{
    "/js/app.js": "/js/app.js?id=fdf34e6c7b73498e6b1e",
    "/css/app.css": "/css/app.css?id=4653cbb27952b0d6fdc1",
    "/js/app.js.map": "/js/app.js.map?id=49a201cd11505a801cf6",
    "/js/chat.js": "/js/chat.js?id=980808ea5825c1925748",
    "/js/chat.js.map": "/js/chat.js.map?id=53618ec16d786b791b19",
    "/js/check-visit.js": "/js/check-visit.js?id=f86307c5a223b8951429",
    "/js/check-visit.js.map": "/js/check-visit.js.map?id=86cc29b0358be07e1810",
    "/js/company-login.js": "/js/company-login.js?id=4e6d488c89999ecf095c",
    "/js/company-login.js.map": "/js/company-login.js.map?id=3089727486b08c7b75f9",
    "/js/create-client-page.js": "/js/create-client-page.js?id=b03e0fa5376b3b5f718f",
    "/js/create-client-page.js.map": "/js/create-client-page.js.map?id=41a0b91e650710a407c7",
    "/js/sale-subscription.js": "/js/sale-subscription.js?id=f4a1936f60163ab76809",
    "/js/sale-subscription.js.map": "/js/sale-subscription.js.map?id=45b96eeef4cbbd6bea43",
    "/js/scripts.js": "/js/scripts.js?id=d77e5dc5af7ed3162094",
    "/js/scripts.js.map": "/js/scripts.js.map?id=fba7e5aab34b16b02c64"
}
