<svg width="18" height="20" viewBox="0 0 18 20" fill="none" xmlns="http://www.w3.org/2000/svg">
<path d="M14.7857 16.4287L11.9893 13.3215M13.5 9.28582C13.5 12.4417 11.1975 15.0001 8.35715 15.0001C5.51683 15.0001 3.21429 12.4417 3.21429 9.28582C3.21429 6.12991 5.51683 3.57153 8.35715 3.57153C11.1975 3.57153 13.5 6.12991 13.5 9.28582Z" stroke="black" stroke-opacity="0.4" stroke-linecap="round" stroke-linejoin="round"/>
</svg>
