<svg width="24" height="24" viewBox="0 0 24 24" fill="none" xmlns="http://www.w3.org/2000/svg">
<path d="M12 12L12 18" stroke="#696767" stroke-width="2" stroke-linecap="round" stroke-linejoin="round"/>
<path d="M15 16L12 18L9 16" stroke="#696767" stroke-width="2" stroke-linecap="round" stroke-linejoin="round"/>
<path d="M18 21H6C5.44772 21 5 20.5523 5 20L5 4C5 3.44772 5.44772 3 6 3L13.5631 3C13.8416 3 14.1076 3.11619 14.2968 3.32059L18.7338 8.11246C18.9049 8.29731 19 8.53995 19 8.79187L19 20C19 20.5523 18.5523 21 18 21Z" stroke="#696767" stroke-width="2" stroke-linecap="round" stroke-linejoin="round"/>
<path d="M19 9L14 9C13.4477 9 13 8.55228 13 8L13 3" stroke="#696767" stroke-width="2" stroke-linecap="round" stroke-linejoin="round"/>
</svg>
