<svg width="19" height="18" viewBox="0 0 19 18" fill="none" xmlns="http://www.w3.org/2000/svg">
<path d="M7.52312 3.51553L6.6102 3.92366V3.92366L7.52312 3.51553ZM8.35775 5.38246L9.27067 4.97433L8.35775 5.38246ZM8.10401 6.81552L8.83578 7.49707V7.49707L8.10401 6.81552ZM7.65482 7.2978L8.38659 7.97935L7.65482 7.2978ZM7.75159 9.20647L7.08479 9.95171L7.75159 9.20647ZM9.26925 10.5644L9.93604 9.81913H9.93604L9.26925 10.5644ZM11.4025 10.6509L10.8047 9.84926H10.8047L11.4025 10.6509ZM11.9415 10.249L12.5392 11.0507L12.5392 11.0507L11.9415 10.249ZM13.5431 10.022L13.2062 10.9635H13.2062L13.5431 10.022ZM15.6297 10.7688L15.9667 9.82727H15.9667L15.6297 10.7688ZM3.875 3.625H6.05303V1.625H3.875V3.625ZM6.6102 3.92366L7.44482 5.79059L9.27067 4.97433L8.43604 3.1074L6.6102 3.92366ZM7.37224 6.13397L6.92305 6.61625L8.38659 7.97935L8.83578 7.49707L7.37224 6.13397ZM7.08479 9.95171L8.60245 11.3096L9.93604 9.81913L8.41838 8.46122L7.08479 9.95171ZM12.0002 11.4526L12.5392 11.0507L11.3437 9.44736L10.8047 9.84926L12.0002 11.4526ZM13.2062 10.9635L15.2927 11.7103L15.9667 9.82727L13.8801 9.0805L13.2062 10.9635ZM15.625 12.0841V14.0329H17.625V12.0841H15.625ZM15.125 14.375C8.52816 14.375 3.375 9.61353 3.375 3.96711H1.375C1.375 10.9215 7.63858 16.375 15.125 16.375V14.375ZM15.625 14.0329C15.625 14.0889 15.6018 14.1624 15.5189 14.2367C15.4341 14.3125 15.2977 14.375 15.125 14.375V16.375C16.3982 16.375 17.625 15.4281 17.625 14.0329H15.625ZM15.2927 11.7103C15.55 11.8024 15.625 11.9816 15.625 12.0841H17.625C17.625 11.0281 16.9117 10.1655 15.9667 9.82727L15.2927 11.7103ZM12.5392 11.0507C12.7082 10.9247 12.9705 10.8792 13.2062 10.9635L13.8801 9.0805C13.0358 8.77834 12.0683 8.90714 11.3437 9.44736L12.5392 11.0507ZM8.60245 11.3096C9.54113 12.1495 10.9954 12.2018 12.0002 11.4526L10.8047 9.84926C10.5513 10.0382 10.1555 10.0155 9.93604 9.81913L8.60245 11.3096ZM6.92305 6.61625C6.0104 7.59615 6.09565 9.06669 7.08479 9.95171L8.41838 8.46122C8.32182 8.37483 8.29161 8.28593 8.28818 8.21829C8.28479 8.1513 8.30541 8.06652 8.38659 7.97935L6.92305 6.61625ZM7.44482 5.79059C7.49009 5.89185 7.48236 6.01573 7.37224 6.13397L8.83578 7.49707C9.47027 6.81583 9.65737 5.83932 9.27067 4.97433L7.44482 5.79059ZM6.05303 3.625C6.35574 3.625 6.55005 3.78913 6.6102 3.92366L8.43604 3.1074C8.01529 2.16623 7.04519 1.625 6.05303 1.625V3.625ZM3.875 1.625C2.60179 1.625 1.375 2.5719 1.375 3.96711H3.375C3.375 3.91114 3.39816 3.83758 3.48113 3.76333C3.56587 3.68752 3.70229 3.625 3.875 3.625V1.625Z" fill="#696767"/>
</svg>
