<svg width="12" height="14" viewBox="0 0 12 14" fill="none" xmlns="http://www.w3.org/2000/svg">
<path fill-rule="evenodd" clip-rule="evenodd" d="M8.7817 0.538032L8.78235 1.06277C10.5861 1.21389 11.7777 2.52784 11.7796 4.54283L11.7867 10.4409C11.7893 12.6378 10.4982 13.9895 8.4287 13.993L3.37355 14C1.31697 14.0028 0.00970217 12.6189 0.00711609 10.4157L4.35438e-06 4.5869C-0.00258173 2.55862 1.14693 1.24818 2.95073 1.07117L2.95008 0.546428C2.94943 0.238582 3.16279 0.00699808 3.44726 0.00699808C3.73173 0.00629843 3.94508 0.237183 3.94572 0.545029L3.94637 1.03478L7.78671 1.02919L7.78606 0.539431C7.78541 0.231586 7.99877 0.000701235 8.28324 1.58584e-06C8.56124 -0.000698064 8.78106 0.230186 8.7817 0.538032ZM0.996247 4.80314L10.7846 4.78914V4.54427C10.7568 3.04002 10.0508 2.25082 8.7836 2.13327L8.78424 2.672C8.78424 2.97285 8.56507 3.21143 8.28707 3.21143C8.0026 3.21213 7.7886 2.97425 7.7886 2.6734L7.78795 2.10669L3.94762 2.11228L3.94826 2.6783C3.94826 2.97985 3.73556 3.21773 3.45109 3.21773C3.16662 3.21843 2.95262 2.98125 2.95262 2.6797L2.95197 2.14097C1.69126 2.276 0.993661 3.06801 0.995601 4.58555L0.996247 4.80314ZM8.01492 7.98297V7.99066C8.02138 8.3125 8.26706 8.55668 8.56511 8.54968C8.85604 8.54199 9.08815 8.27542 9.08168 7.95358C9.0681 7.64574 8.83471 7.39456 8.54442 7.39526C8.24702 7.40226 8.01427 7.66113 8.01492 7.98297ZM8.54885 11.1244C8.25145 11.1174 8.01159 10.8523 8.01095 10.5304C8.00448 10.2086 8.24305 9.94202 8.54045 9.93432H8.54691C8.85078 9.93432 9.0971 10.1995 9.0971 10.5283C9.09775 10.8572 8.85207 11.1237 8.54885 11.1244ZM5.35129 7.99424C5.36422 8.31608 5.61055 8.56726 5.90795 8.55326C6.19888 8.53857 6.43098 8.2727 6.41805 7.95086C6.41094 7.63602 6.17173 7.39115 5.88079 7.39184C5.58339 7.40584 5.35065 7.6724 5.35129 7.99424ZM5.91032 11.0931C5.61292 11.1071 5.36724 10.8559 5.35367 10.534C5.35367 10.2122 5.58577 9.94633 5.88317 9.93164C6.1741 9.93094 6.41396 10.1758 6.42043 10.49C6.434 10.8125 6.20126 11.0784 5.91032 11.0931ZM2.68745 8.01866C2.70038 8.3405 2.94671 8.59237 3.24411 8.57768C3.53504 8.56368 3.76714 8.29712 3.75357 7.97528C3.7471 7.66044 3.50789 7.41556 3.21631 7.41626C2.91891 7.43025 2.68681 7.69682 2.68745 8.01866ZM3.24691 11.0965C2.94951 11.1112 2.70384 10.8593 2.69026 10.5375C2.68961 10.2156 2.92236 9.94905 3.21976 9.93506C3.5107 9.93436 3.75055 10.1792 3.75702 10.4941C3.7706 10.8159 3.5385 11.0825 3.24691 11.0965Z" fill="#00D9FF"/>
</svg>
