<?xml version="1.0" encoding="utf-8"?>
<!-- Generator: Adobe Illustrator 16.0.0, SVG Export Plug-In . SVG Version: 6.00 Build 0)  -->
<!DOCTYPE svg PUBLIC "-//W3C//DTD SVG 1.1//EN" "http://www.w3.org/Graphics/SVG/1.1/DTD/svg11.dtd">
<svg version="1.1" id="Layer_1" xmlns="http://www.w3.org/2000/svg" xmlns:xlink="http://www.w3.org/1999/xlink" x="0px" y="0px"
	 width="150px" height="150px" viewBox="0 0 150 150" enable-background="new 0 0 150 150" xml:space="preserve">
<path fill="#FFFFFF" stroke="#4D4D4D" stroke-width="2" stroke-linecap="round" stroke-linejoin="round" stroke-miterlimit="10" d="
	M146.1,114.7c0,17.7-14.3,32-32,32H36.5c-17.7,0-32-14.3-32-32V37.1c0-17.7,14.3-32,32-32h77.6c17.7,0,32,14.3,32,32L146.1,114.7
	L146.1,114.7z"/>
<path fill="#555555" d="M100.7,56.6h-3.4v-8c0-0.8-0.2-0.8-1-0.8H48.1c-0.8,0-0.9,0-0.9,0.8V107c0,2.1,1.4,3.6,3.6,3.6h42.8
	c2.1,0,3.6-1.4,3.6-3.6V96.8h3c9.5-0.1,17-7.4,17-17.2v-5.8C117.4,64.5,110.1,56.6,100.7,56.6z M114.9,79.6
	c0,8.3-6.4,14.5-14.5,14.5h-4c-0.8,0-1.5,1.1-1.5,1.9V107c0,0.8-0.4,1.1-1.1,1.1H50.9c-0.8,0-1.1-0.3-1.1-1.1V50.3h45.1v7.8
	c0,0.8,0.9,1,1.5,1h4.4c8,0,14.2,6.8,14.2,14.9L114.9,79.6L114.9,79.6z"/>
<path fill="#FFFDFD" d="M100.7,59.1h-4.4c-0.6,0-1.5-0.3-1.5-1v-7.8H49.7V107c0,0.9,0.4,1.1,1.1,1.1h42.8c0.8,0,1.1-0.4,1.1-1.1
	V96.1c0-0.8,0.8-1.9,1.5-1.9h4c8.1,0,14.5-6.3,14.5-14.5V74C114.9,65.9,108.7,59.1,100.7,59.1z M82.9,80.9L73,91
	c-0.3,0.3-0.5,0.4-0.9,0.4c-0.4,0-0.6-0.1-0.9-0.4l-9.9-10.1c-3.1-3.3-3.1-8.4,0.1-11.7c1.1-1,2.5-1.6,4-1.6c2,0,4.4,1.1,6.6,2.9
	c2.1-1.9,4.6-2.9,6.6-2.9c1.5,0,2.9,0.5,4,1.6C86.1,72.4,86.1,77.6,82.9,80.9z M111.1,79.6c0,5.8-5,10.9-10.8,10.9h-3.3
	c-0.8,0-1-0.9-1-1.6V64.6c0-0.8,0.2-1.8,1-1.8h3.3c5.8,0,10.8,5.3,10.8,11.3V79.6z"/>
<path fill="#555555" d="M100.3,62.9h-3.3c-0.8,0-1,1-1,1.8v24.3c0,0.8,0.2,1.6,1,1.6h3.3c5.8,0,10.8-5.1,10.8-10.9v-5.5
	C111.1,68.1,106.1,62.9,100.3,62.9z M108.6,79.5c0,4.5-3.9,8.4-8.3,8.4h-1.8V65.4h1.8c4.4,0,8.3,4.1,8.3,8.6V79.5z"/>
<path fill="#FF8888" d="M79.8,67.6c-2,0-4.5,1-6.6,2.9c-2.3-1.8-4.6-2.9-6.6-2.9c-1.5,0-2.9,0.6-4,1.6c-3.3,3.3-3.3,8.4-0.1,11.7
	L72.3,91c0.3,0.3,0.5,0.4,0.9,0.4c0.4,0,0.6-0.1,0.9-0.4l9.9-10.1c3.1-3.3,3.1-8.5-0.1-11.7C82.7,68.1,81.3,67.6,79.8,67.6z
	 M82,79.1l-9,9.1l-9-9.1c-2-2.3-2-5.9,0.3-8.1c0.6-0.6,1.3-0.9,2.1-0.9c1.6,0,3.9,1.1,5.9,2.9c0.5,0.5,1.3,0.5,1.8,0
	c1.9-1.8,4.1-2.9,5.9-2.9c0.9,0,1.6,0.3,2.1,0.9C84.2,73.3,84.3,76.9,82,79.1z"/>
<g>
	
		<line fill="none" stroke="#CCC6BA" stroke-width="3" stroke-linecap="round" stroke-miterlimit="10" x1="59.6" y1="43.4" x2="59.6" y2="27.6"/>
	
		<line fill="none" stroke="#CCC6BA" stroke-width="3" stroke-linecap="round" stroke-miterlimit="10" x1="71.3" y1="43.4" x2="71.3" y2="27.6"/>
	
		<line fill="none" stroke="#CCC6BA" stroke-width="3" stroke-linecap="round" stroke-miterlimit="10" x1="83" y1="43.4" x2="83" y2="27.6"/>
</g>
<g>
	
		<line fill="none" stroke="#CCC6BA" stroke-width="3" stroke-linecap="round" stroke-miterlimit="10" x1="65.5" y1="43.4" x2="65.5" y2="33.6"/>
	
		<line fill="none" stroke="#CCC6BA" stroke-width="3" stroke-linecap="round" stroke-miterlimit="10" x1="77.2" y1="43.4" x2="77.2" y2="33.6"/>
	
		<line fill="none" stroke="#CCC6BA" stroke-width="3" stroke-linecap="round" stroke-miterlimit="10" x1="88.8" y1="43.4" x2="88.8" y2="33.6"/>
	
		<line fill="none" stroke="#CCC6BA" stroke-width="3" stroke-linecap="round" stroke-miterlimit="10" x1="53.5" y1="43.4" x2="53.5" y2="33.6"/>
</g>
</svg>
