[
    {
        "name": "Belum Dikirim",
        "description": "Belum Dikirim"
    },
    {
        "name": "Sedang Mengirim",
        "description": "Sedang Mengirim"
    },
    {
        "name": "Selesai",
        "description": "Selesai"
    }
]