PROTOCOL IS MODIFIED!

Protocol:	Untitled 01/01/2000 02:35:06 AM
Plate format:	96 Wells

Absorbances     Filter 1: 595nm

	1	2	3	4	5	6	7	8	9	10	11	12
A	0.861	1.314	0.964	0.876	0.920	0.892	1.079	0.885	0.880	1.254	0.996	0.931
B	1.360	1.534	1.112	1.466	1.355	1.555	1.062	1.168	1.273	1.425	0.992	1.102
C	1.075	0.851	1.162	0.903	1.352	0.884	1.128	0.904	1.273	0.854	1.145	0.830
D	1.029	1.482	1.157	0.932	1.006	1.358	1.027	1.033	1.053	0.968	1.084	0.863
E	0.872	1.639	1.034	0.900	0.850	1.357	1.119	0.927	0.850	1.612	1.211	0.816
F	1.217	0.882	0.872	0.890	1.618	0.854	0.847	0.851	1.131	0.855	0.852	0.698
G	1.162	0.891	1.024	0.884	0.881	0.863	0.953	0.851	0.894	0.871	0.989	0.852
H	1.042	1.008	1.151	1.004	0.924	0.970	0.985	0.978	0.892	0.949	1.132	1.048

