{
  "carouselImages": [
    "./assets/carousel-images/Slide1.jpeg",
    "./assets/carousel-images/Slide2.jpeg",
    "./assets/carousel-images/Slide3.jpeg",
    "./assets/carousel-images/Slide4.jpeg",
    "./assets/carousel-images/Slide5.jpeg",
    "./assets/carousel-images/Slide6.jpeg",
    "./assets/carousel-images/Slide7.jpeg",
    "./assets/carousel-images/Slide8.jpeg",
    "./assets/carousel-images/Slide9.jpeg",
    "./assets/carousel-images/Slide10.jpeg",
    "./assets/carousel-images/Slide11.jpeg",
    "./assets/carousel-images/Slide12.jpeg",
    "./assets/carousel-images/Slide13.jpeg",
    "./assets/carousel-images/Slide14.jpeg",
    "./assets/carousel-images/Slide15.jpeg",
    "./assets/carousel-images/Slide16.jpeg",
    "./assets/carousel-images/Slide17.jpeg"
  ]
}
