{
  "$schema": "../data.schema.json",
  "sketches": [
    {
      "id": 1,
      "label": "Building #1",
      "segments": [
        {
          "id": 1,
          "label": {
            "text": "[1] Funky label",
            "values": [
              {
                "text": "Funky label",
                "lookupName": "standard",
                "lookupCode": "ROFFICEA"
              }
            ],
            "position": {
              "x": 32,
              "y": 43
            },
            "style": {}
          },
          "vectors": [
            {
              "ring": {
                "origin": {
                  "x": 28,
                  "y": 7
                },
                "commands": [
                  {
                    "line": {
                      "x": -8,
                      "y": 0
                    },
                    "dimensionLabel": {
                      "visibility": "hidden"
                    }
                  },
                  {
                    "line": {
                      "x": 0,
                      "y": 6
                    }
                  },
                  {
                    "line": {
                      "x": 8,
                      "y": 0
                    }
                  },
                  {
                    "line": {
                      "x": 0,
                      "y": -6
                    }
                  }
                ]
              },
              "areaType": "positive",
              "drawingType": "sketched",
              "area": {
                "value": 48,
                "type": "computed"
              },
              "perimeter": {
                "value": 28,
                "type": "computed"
              },
              "attributes": [
                {
                  "key": "foo",
                  "value": "bar"
                },
                {
                  "key": "another",
                  "value": "attribute"
                }
              ],
              "id": 1
            }
          ],
          "boundarySize": 100,
          "domain": "unspecified",
          "page": 1,
          "area": {
            "value": 48,
            "type": "computed"
          },
          "perimeter": {
            "value": 28,
            "type": "computed"
          }
        },
        {
          "id": 2,
          "label": {
            "text": "[2] RESIDENTIAL OFFICE",
            "values": [
              {
                "text": "RESIDENTIAL OFFICE",
                "lookupName": "standard",
                "lookupCode": "ROFFICEA"
              }
            ],
            "position": {
              "x": 40,
              "y": 27
            },
            "style": {
              "color": "#00f",
              "fontWeight": 600,
              "fontStyle": "normal"
            }
          },
          "vectors": [
            {
              "ring": {
                "origin": {
                  "x": 20,
                  "y": 13
                },
                "commands": [
                  {
                    "line": {
                      "x": 0,
                      "y": 9
                    },
                    "style": {
                      "strokeWidth": 1,
                      "strokeDashArray": [
                        20,
                        5
                      ]
                    }
                  },
                  {
                    "line": {
                      "x": -4,
                      "y": 0
                    },
                    "style": {
                      "stroke": "#333",
                      "strokeWidth": 1,
                      "strokeDashArray": [
                        20,
                        5
                      ]
                    }
                  },
                  {
                    "line": {
                      "x": 0,
                      "y": 15
                    },
                    "style": {
                      "stroke": "#f00",
                      "strokeWidth": 1,
                      "strokeDashArray": [
                        20,
                        5
                      ]
                    }
                  },
                  {
                    "line": {
                      "x": 4,
                      "y": 0
                    },
                    "style": {
                      "stroke": "#ff0",
                      "strokeWidth": 1,
                      "strokeDashArray": [
                        20,
                        5
                      ]
                    }
                  },
                  {
                    "line": {
                      "x": 0,
                      "y": 15
                    },
                    "style": {
                      "stroke": "#2200ff",
                      "strokeWidth": 1,
                      "strokeDashArray": [
                        20,
                        5
                      ]
                    }
                  },
                  {
                    "line": {
                      "x": 2,
                      "y": 0
                    },
                    "style": {
                      "stroke": "#00ffdd",
                      "strokeWidth": 1,
                      "strokeDashArray": [
                        20,
                        5
                      ]
                    }
                  },
                  {
                    "line": {
                      "x": 0,
                      "y": 1
                    },
                    "style": {
                      "stroke": "#15ff00",
                      "strokeWidth": 1,
                      "strokeDashArray": [
                        1,
                        1
                      ]
                    }
                  },
                  {
                    "line": {
                      "x": 10,
                      "y": 0
                    },
                    "style": {
                      "strokeWidth": 1,
                      "strokeDashArray": [
                        10,
                        10
                      ]
                    }
                  },
                  {
                    "line": {
                      "x": 0,
                      "y": -1
                    },
                    "style": {
                      "stroke": "#333"
                    }
                  },
                  {
                    "line": {
                      "x": 2,
                      "y": 0
                    },
                    "style": {
                      "stroke": "#333",
                      "strokeWidth": 1
                    }
                  },
                  {
                    "line": {
                      "x": 0,
                      "y": -10
                    },
                    "style": {
                      "stroke": "#333",
                      "strokeWidth": 2
                    }
                  },
                  {
                    "line": {
                      "x": 28,
                      "y": 0
                    },
                    "style": {
                      "stroke": "#333",
                      "strokeWidth": 3
                    }
                  },
                  {
                    "line": {
                      "x": 0,
                      "y": -6
                    },
                    "style": {
                      "stroke": "#333",
                      "strokeWidth": 4
                    }
                  },
                  {
                    "line": {
                      "x": 1,
                      "y": 0
                    },
                    "style": {
                      "stroke": "#333",
                      "strokeWidth": 5
                    }
                  },
                  {
                    "line": {
                      "x": 0,
                      "y": -8
                    },
                    "style": {
                      "stroke": "#333",
                      "strokeWidth": 6
                    }
                  },
                  {
                    "line": {
                      "x": 7,
                      "y": 0
                    },
                    "style": {
                      "stroke": "#333",
                      "strokeWidth": 7
                    }
                  },
                  {
                    "line": {
                      "x": 0,
                      "y": 3
                    },
                    "style": {
                      "stroke": "#333",
                      "strokeWidth": 8
                    }
                  },
                  {
                    "line": {
                      "x": 8,
                      "y": 0
                    },
                    "style": {
                      "stroke": "none",
                      "strokeWidth": 3,
                      "strokeDashArray": [
                        20,
                        3,
                        3,
                        3,
                        3,
                        3,
                        3,
                        3
                      ]
                    }
                  },
                  {
                    "line": {
                      "x": 0,
                      "y": -8
                    },
                    "style": {
                      "stroke": "#00ffdd",
                      "strokeWidth": 3,
                      "strokeDashArray": [
                        20,
                        3,
                        3,
                        3,
                        3,
                        3,
                        3,
                        3
                      ]
                    }
                  },
                  {
                    "line": {
                      "x": -3,
                      "y": 0
                    },
                    "style": {
                      "stroke": "#15ff00",
                      "strokeWidth": 2
                    }
                  },
                  {
                    "line": {
                      "x": 0,
                      "y": -22
                    },
                    "style": {
                      "stroke": "#15ff00",
                      "strokeWidth": 3,
                      "strokeDashArray": [
                        20,
                        3,
                        3,
                        3,
                        3,
                        3,
                        3,
                        3
                      ]
                    }
                  },
                  {
                    "line": {
                      "x": -20,
                      "y": 0
                    },
                    "style": {
                      "strokeWidth": 4,
                      "strokeDashArray": [
                        15,
                        3,
                        3,
                        3
                      ]
                    }
                  },
                  {
                    "line": {
                      "x": 0,
                      "y": 6
                    },
                    "style": {
                      "stroke": "#ff0",
                      "strokeWidth": 1,
                      "strokeDashArray": [
                        1,
                        1
                      ]
                    }
                  },
                  {
                    "line": {
                      "x": -11,
                      "y": 0
                    },
                    "dimensionLabel": {
                      "style": {
                        "color": "#000"
                      }
                    },
                    "style": {
                      "stroke": "#00ffdd",
                      "strokeWidth": 1,
                      "strokeDashArray": [
                        10,
                        10
                      ]
                    }
                  },
                  {
                    "line": {
                      "x": 0,
                      "y": 1
                    },
                    "style": {
                      "stroke": "#333",
                      "strokeWidth": 2
                    }
                  },
                  {
                    "line": {
                      "x": -16,
                      "y": 0
                    }
                  },
                  {
                    "line": {
                      "x": 0,
                      "y": 5
                    },
                    "style": {
                      "stroke": "#f00",
                      "strokeWidth": 2
                    }
                  },
                  {
                    "line": {
                      "x": -8,
                      "y": 0
                    },
                    "style": {
                      "stroke": "#ff0",
                      "strokeWidth": 2
                    }
                  }
                ]
              },
              "areaType": "positive",
              "drawingType": "sketched",
              "area": {
                "value": 2056,
                "type": "computed"
              },
              "perimeter": {
                "value": 234,
                "type": "computed"
              },
              "id": 2
            }
          ],
          "boundarySize": 100,
          "page": 1,
          "area": {
            "value": 2056,
            "type": "computed"
          },
          "perimeter": {
            "value": 234,
            "type": "computed"
          }
        },
        {
          "id": 3,
          "label": {
            "text": "[3] DK-DOCK",
            "values": [
              {
                "text": "DOCK",
                "lookupName": "standard",
                "lookupCode": "DK"
              }
            ],
            "position": {
              "x": 38,
              "y": 47
            }
          },
          "vectors": [
            {
              "ring": {
                "origin": {
                  "x": 34,
                  "y": 42
                },
                "commands": [
                  {
                    "line": {
                      "x": 0,
                      "y": 9
                    }
                  },
                  {
                    "line": {
                      "x": 7,
                      "y": 0
                    }
                  },
                  {
                    "line": {
                      "x": 0,
                      "y": -9
                    }
                  },
                  {
                    "line": {
                      "x": -7,
                      "y": 0
                    }
                  }
                ]
              },
              "areaType": "positive",
              "drawingType": "sketched",
              "area": {
                "value": 63,
                "type": "computed"
              },
              "perimeter": {
                "value": 32,
                "type": "computed"
              },
              "id": 3
            }
          ],
          "boundarySize": 100,
          "page": 1,
          "area": {
            "value": 63,
            "type": "computed"
          },
          "perimeter": {
            "value": 32,
            "type": "computed"
          }
        },
        {
          "id": 4,
          "label": {
            "text": "[4] STG-STORAGE",
            "values": [
              {
                "text": "STORAGE",
                "lookupName": "standard",
                "lookupCode": "STG"
              }
            ],
            "position": {
              "x": 52,
              "y": 47
            }
          },
          "vectors": [
            {
              "ring": {
                "origin": {
                  "x": 41,
                  "y": 42
                },
                "commands": [
                  {
                    "line": {
                      "x": 0,
                      "y": 9
                    }
                  },
                  {
                    "line": {
                      "x": 21,
                      "y": 0
                    }
                  },
                  {
                    "line": {
                      "x": 0,
                      "y": -9
                    }
                  },
                  {
                    "line": {
                      "x": -21,
                      "y": 0
                    }
                  }
                ]
              },
              "areaType": "positive",
              "drawingType": "sketched",
              "area": {
                "value": 189,
                "type": "computed"
              },
              "perimeter": {
                "value": 60,
                "type": "computed"
              },
              "id": 4
            }
          ],
          "boundarySize": 100,
          "page": 1,
          "area": {
            "value": 189,
            "type": "computed"
          },
          "perimeter": {
            "value": 60,
            "type": "computed"
          }
        },
        {
          "id": 5,
          "label": {
            "text": "[5] RC1",
            "values": [
              {
                "text": "RC1",
                "lookupName": "standard",
                "lookupCode": "RC1"
              }
            ],
            "position": {
              "x": 68,
              "y": 37
            }
          },
          "vectors": [
            {
              "ring": {
                "origin": {
                  "x": 78,
                  "y": 31
                },
                "commands": [
                  {
                    "line": {
                      "x": -8,
                      "y": 0
                    }
                  },
                  {
                    "line": {
                      "x": 0,
                      "y": -3
                    }
                  },
                  {
                    "line": {
                      "x": -7,
                      "y": 0
                    }
                  },
                  {
                    "line": {
                      "x": 0,
                      "y": 8
                    }
                  },
                  {
                    "line": {
                      "x": -1,
                      "y": 0
                    }
                  },
                  {
                    "line": {
                      "x": 0,
                      "y": 15
                    }
                  },
                  {
                    "line": {
                      "x": 6,
                      "y": 0
                    }
                  },
                  {
                    "line": {
                      "x": 0,
                      "y": -10
                    }
                  },
                  {
                    "line": {
                      "x": 10,
                      "y": 0
                    }
                  },
                  {
                    "line": {
                      "x": 0,
                      "y": -10
                    }
                  }
                ]
              },
              "areaType": "positive",
              "drawingType": "sketched",
              "area": {
                "value": 236,
                "type": "computed"
              },
              "perimeter": {
                "value": 78,
                "type": "computed"
              },
              "id": 5
            }
          ],
          "boundarySize": 100,
          "page": 1,
          "area": {
            "value": 236,
            "type": "computed"
          },
          "perimeter": {
            "value": 78,
            "type": "computed"
          }
        },
        {
          "id": 6,
          "label": {
            "text": "[6] WDA-WOOD DECK",
            "values": [
              {
                "text": "WOOD DECK",
                "lookupName": "standard",
                "lookupCode": "WDA"
              }
            ],
            "position": {
              "x": 49,
              "y": 63
            }
          },
          "vectors": [
            {
              "ring": {
                "origin": {
                  "x": 45,
                  "y": 51
                },
                "commands": [
                  {
                    "line": {
                      "x": 0,
                      "y": 4
                    },
                    "style": {
                      "stroke": "#333",
                      "strokeWidth": 1
                    }
                  },
                  {
                    "line": {
                      "x": -4,
                      "y": 0
                    },
                    "style": {
                      "stroke": "#333",
                      "strokeWidth": 1,
                      "strokeDashArray": [
                        1,
                        1
                      ]
                    }
                  },
                  {
                    "line": {
                      "x": 0,
                      "y": 17
                    },
                    "style": {
                      "stroke": "#333",
                      "strokeWidth": 1,
                      "strokeDashArray": [
                        10,
                        10
                      ]
                    }
                  },
                  {
                    "line": {
                      "x": 24,
                      "y": 0
                    },
                    "style": {
                      "stroke": "#333",
                      "strokeWidth": 1,
                      "strokeDashArray": [
                        20,
                        5
                      ]
                    }
                  },
                  {
                    "line": {
                      "x": 0,
                      "y": -17
                    },
                    "style": {
                      "stroke": "#333",
                      "strokeWidth": 1,
                      "strokeDashArray": [
                        15,
                        3,
                        3,
                        3
                      ]
                    }
                  },
                  {
                    "line": {
                      "x": -16,
                      "y": 0
                    },
                    "style": {
                      "stroke": "#333",
                      "strokeWidth": 1,
                      "strokeDashArray": [
                        20,
                        3,
                        3,
                        3,
                        3,
                        3,
                        3,
                        3
                      ]
                    }
                  },
                  {
                    "line": {
                      "x": 0,
                      "y": -4
                    }
                  },
                  {
                    "line": {
                      "x": -4,
                      "y": 0
                    }
                  }
                ]
              },
              "areaType": "positive",
              "drawingType": "sketched",
              "area": {
                "value": 424,
                "type": "computed"
              },
              "perimeter": {
                "value": 90,
                "type": "computed"
              },
              "id": 6
            }
          ],
          "boundarySize": 100,
          "page": 1,
          "area": {
            "value": 424,
            "type": "computed"
          },
          "perimeter": {
            "value": 90,
            "type": "computed"
          }
        },
        {
          "id": 7,
          "label": {
            "text": "[7] RC",
            "values": [
              {
                "text": "RC",
                "lookupName": "standard",
                "lookupCode": "RC"
              }
            ],
            "position": {
              "x": 53,
              "y": 78
            }
          },
          "vectors": [
            {
              "ring": {
                "origin": {
                  "x": 47,
                  "y": 72
                },
                "commands": [
                  {
                    "line": {
                      "x": 0,
                      "y": 12
                    }
                  },
                  {
                    "line": {
                      "x": 12,
                      "y": 0
                    }
                  },
                  {
                    "line": {
                      "x": 0,
                      "y": -12
                    }
                  },
                  {
                    "line": {
                      "x": -12,
                      "y": 0
                    }
                  }
                ]
              },
              "label": {
                "text": "[7] RC",
                "values": [
                  {
                    "text": "RC",
                    "lookupName": "standard",
                    "lookupCode": "RC"
                  }
                ],
                "position": {
                  "x": 53,
                  "y": 78
                }
              },
              "areaType": "positive",
              "drawingType": "sketched",
              "area": {
                "value": 144,
                "type": "computed"
              },
              "perimeter": {
                "value": 48,
                "type": "computed"
              },
              "id": 7
            }
          ],
          "boundarySize": 100,
          "page": 1,
          "area": {
            "value": 144,
            "type": "computed"
          },
          "perimeter": {
            "value": 48,
            "type": "computed"
          }
        }
      ],
      "notes": []
    },
    {
      "id": 2,
      "label": "Building #3",
      "segments": [],
      "notes": [
        {
          "keycode": "ROFFICEA",
          "page": 1,
          "position": {
            "x": 4,
            "y": 4
          },
          "text": "My beautiful note"
        }
      ]
    }
  ],
  "lookupCollection": {
    "standard": {
      "unspecified": {
        "ROFFICEA": {
          "name": "RESIDENTIAL OFFICE",
          "description": "RESIDENTIAL OFFICE - TYPE A",
          "ordinal": 1,
          "styles": {
            "label": {
              "color": "#00f",
              "fontWeight": "bold"
            },
            "dimensionLabel": {
              "fontFamily": "Georgia",
              "fontSize": 2,
              "fontStyle": "italic",
              "fontWeight": 200
            },
            "vector": {
              "fill": "#dd2",
              "fillPattern": {
                "height": 15,
                "width": 15,
                "elements": [
                  {
                    "path": "M0,0 l15,15 M15,0 l-15,15",
                    "style": {
                      "color": "none",
                      "stroke": "#000",
                      "strokeWidth": 2
                    }
                  }
                ]
              },
              "stroke": "#f00",
              "strokeWidth": 0,
              "strokeDashArray": [
                1,
                2,
                3
              ]
            }
          },
          "attributes": [
            {
              "key": "additionalValue1",
              "value": "foo"
            },
            {
              "key": "additionalValue2",
              "value": "bar"
            }
          ]
        }
      }
    }
  }
}
