{
  "name": "Data Warehouse Node API",
  "version": "0.0.0",
  "title": "AAA Warehouse API",
  "description": "A data warehouse node is a server which is responsible for handling resource request from end users"
}