{
  "swagger": "2.0",
  "info": {
    "title": "Echo Service",
    "version": "1.0",
    "contact": {
      "name": "initial echo project",
      "url": "https://kbtg.tech/jirat.sr/go-initial-project",
      "email": "jirat.sr@kbtg.tech"
    }
  },
  "tags": [
    {
      "name": "HealthCheckService"
    },
    {
      "name": "PlayerService"
    }
  ],
  "consumes": [
    "application/json"
  ],
  "produces": [
    "application/json"
  ],
  "paths": {
    "/api/v1/health": {
      "get": {
        "operationId": "HealthCheckService_health",
        "responses": {
          "200": {
            "description": "A successful response.",
            "schema": {
              "$ref": "#/definitions/serviceHealthCheck"
            }
          },
          "404": {
            "description": "Returned when the resource does not exist.",
            "schema": {
              "type": "string",
              "format": "string"
            }
          },
          "default": {
            "description": "An unexpected error response.",
            "schema": {
              "$ref": "#/definitions/rpcStatus"
            }
          }
        },
        "tags": [
          "HealthCheckService"
        ]
      }
    },
    "/api/v1/player/match": {
      "get": {
        "operationId": "PlayerService_GetLastMatch",
        "responses": {
          "200": {
            "description": "A successful response.",
            "schema": {
              "$ref": "#/definitions/serviceMatchLogs"
            }
          },
          "404": {
            "description": "Returned when the resource does not exist.",
            "schema": {
              "type": "string",
              "format": "string"
            }
          },
          "default": {
            "description": "An unexpected error response.",
            "schema": {
              "$ref": "#/definitions/rpcStatus"
            }
          }
        },
        "tags": [
          "PlayerService"
        ]
      }
    },
    "/api/v1/player/match/{matchId}": {
      "get": {
        "operationId": "PlayerService_GetMatchById",
        "responses": {
          "200": {
            "description": "A successful response.",
            "schema": {
              "$ref": "#/definitions/serviceMatchLogs"
            }
          },
          "404": {
            "description": "Returned when the resource does not exist.",
            "schema": {
              "type": "string",
              "format": "string"
            }
          },
          "default": {
            "description": "An unexpected error response.",
            "schema": {
              "$ref": "#/definitions/rpcStatus"
            }
          }
        },
        "parameters": [
          {
            "name": "matchId",
            "in": "path",
            "required": true,
            "type": "string"
          }
        ],
        "tags": [
          "PlayerService"
        ]
      }
    },
    "/api/v1/player/new_match": {
      "get": {
        "operationId": "PlayerService_NewMatch",
        "responses": {
          "200": {
            "description": "A successful response.",
            "schema": {
              "properties": {}
            }
          },
          "404": {
            "description": "Returned when the resource does not exist.",
            "schema": {
              "type": "string",
              "format": "string"
            }
          },
          "default": {
            "description": "An unexpected error response.",
            "schema": {
              "$ref": "#/definitions/rpcStatus"
            }
          }
        },
        "tags": [
          "PlayerService"
        ]
      }
    }
  },
  "definitions": {
    "protobufAny": {
      "type": "object",
      "properties": {
        "@type": {
          "type": "string"
        }
      },
      "additionalProperties": {}
    },
    "rpcStatus": {
      "type": "object",
      "properties": {
        "code": {
          "type": "integer",
          "format": "int32"
        },
        "message": {
          "type": "string"
        },
        "details": {
          "type": "array",
          "items": {
            "$ref": "#/definitions/protobufAny"
          }
        }
      }
    },
    "serviceHealthCheck": {
      "type": "object",
      "properties": {
        "status": {
          "type": "string"
        }
      }
    },
    "serviceMatch": {
      "type": "object",
      "properties": {
        "matchNumber": {
          "type": "integer",
          "format": "int32"
        },
        "turn": {
          "type": "integer",
          "format": "int32"
        },
        "wakingProcess": {
          "type": "string"
        },
        "ballPowerHit": {
          "type": "number",
          "format": "double"
        },
        "ballPowerReceive": {
          "type": "number",
          "format": "double"
        },
        "goRoutineNumber": {
          "type": "integer",
          "format": "int32"
        },
        "time": {
          "type": "string",
          "format": "date-time"
        },
        "isEndMatch": {
          "type": "boolean"
        }
      }
    },
    "serviceMatchLogs": {
      "type": "object",
      "properties": {
        "match": {
          "type": "array",
          "items": {
            "$ref": "#/definitions/serviceMatch"
          }
        }
      }
    }
  }
}
