module gitlab.com/wongsatorn.tho/pingpong-go-grc-player

go 1.17

require (
	github.com/deepmap/oapi-codegen v1.9.0
	github.com/go-chi/chi v1.5.4
	github.com/go-redis/redis/v8 v8.11.4
	github.com/go-swagger/go-swagger v0.28.0
	github.com/golang/protobuf v1.5.2
	github.com/google/uuid v1.3.0
	github.com/grpc-ecosystem/go-grpc-middleware v1.3.0
	github.com/grpc-ecosystem/grpc-gateway/v2 v2.7.2
	github.com/pkg/errors v0.9.1
	github.com/soheilhy/cmux v0.1.5
	github.com/swaggo/http-swagger v1.1.2
	go.mongodb.org/mongo-driver v1.7.3
	go.uber.org/zap v1.19.1
	google.golang.org/genproto v0.0.0-20211223182754-3ac035c7e7cb
	google.golang.org/grpc v1.43.0
	google.golang.org/grpc/cmd/protoc-gen-go-grpc v1.2.0
	google.golang.org/protobuf v1.27.1
)

require (
	github.com/KyleBanks/depth v1.2.1 // indirect
	github.com/PuerkitoBio/purell v1.1.1 // indirect
	github.com/PuerkitoBio/urlesc v0.0.0-20170810143723-de5bf2ad4578 // indirect
	github.com/asaskevich/govalidator v0.0.0-20210307081110-f21760c49a8d // indirect
	github.com/cespare/xxhash/v2 v2.1.2 // indirect
	github.com/dgryski/go-rendezvous v0.0.0-20200823014737-9f7001d12a5f // indirect
	github.com/felixge/httpsnoop v1.0.2 // indirect
	github.com/fsnotify/fsnotify v1.5.1 // indirect
	github.com/getkin/kin-openapi v0.80.0 // indirect
	github.com/ghodss/yaml v1.0.0 // indirect
	github.com/go-openapi/analysis v0.20.1 // indirect
	github.com/go-openapi/errors v0.20.1 // indirect
	github.com/go-openapi/inflect v0.19.0 // indirect
	github.com/go-openapi/jsonpointer v0.19.5 // indirect
	github.com/go-openapi/jsonreference v0.19.6 // indirect
	github.com/go-openapi/loads v0.20.3 // indirect
	github.com/go-openapi/runtime v0.20.0 // indirect
	github.com/go-openapi/spec v0.20.4 // indirect
	github.com/go-openapi/strfmt v0.20.3 // indirect
	github.com/go-openapi/swag v0.19.15 // indirect
	github.com/go-openapi/validate v0.20.3 // indirect
	github.com/go-stack/stack v1.8.1 // indirect
	github.com/golang/glog v1.0.0 // indirect
	github.com/golang/snappy v0.0.3 // indirect
	github.com/gorilla/handlers v1.5.1 // indirect
	github.com/hashicorp/hcl v1.0.0 // indirect
	github.com/jessevdk/go-flags v1.5.0 // indirect
	github.com/josharian/intern v1.0.0 // indirect
	github.com/klauspost/compress v1.13.6 // indirect
	github.com/kr/pretty v0.3.0 // indirect
	github.com/kr/text v0.2.0 // indirect
	github.com/labstack/echo/v4 v4.2.1 // indirect
	github.com/labstack/gommon v0.3.0 // indirect
	github.com/magiconair/properties v1.8.5 // indirect
	github.com/mailru/easyjson v0.7.7 // indirect
	github.com/mattn/go-colorable v0.1.8 // indirect
	github.com/mattn/go-isatty v0.0.14 // indirect
	github.com/mitchellh/mapstructure v1.4.2 // indirect
	github.com/oklog/ulid v1.3.1 // indirect
	github.com/pelletier/go-toml v1.9.4 // indirect
	github.com/rogpeppe/go-internal v1.8.0 // indirect
	github.com/spf13/afero v1.6.0 // indirect
	github.com/spf13/cast v1.4.1 // indirect
	github.com/spf13/jwalterweatherman v1.1.0 // indirect
	github.com/spf13/pflag v1.0.5 // indirect
	github.com/spf13/viper v1.9.0 // indirect
	github.com/subosito/gotenv v1.2.0 // indirect
	github.com/swaggo/files v0.0.0-20190704085106-630677cd5c14 // indirect
	github.com/swaggo/swag v1.7.0 // indirect
	github.com/toqueteos/webbrowser v1.2.0 // indirect
	github.com/valyala/bytebufferpool v1.0.0 // indirect
	github.com/valyala/fasttemplate v1.2.1 // indirect
	github.com/xdg-go/pbkdf2 v1.0.0 // indirect
	github.com/xdg-go/scram v1.0.2 // indirect
	github.com/xdg-go/stringprep v1.0.2 // indirect
	github.com/youmark/pkcs8 v0.0.0-20181117223130-1be2e3e5546d // indirect
	go.uber.org/atomic v1.7.0 // indirect
	go.uber.org/multierr v1.6.0 // indirect
	golang.org/x/crypto v0.0.0-20210921155107-089bfa567519 // indirect
	golang.org/x/mod v0.5.1 // indirect
	golang.org/x/net v0.0.0-20211008194852-3b03d305991f // indirect
	golang.org/x/sync v0.0.0-20210220032951-036812b2e83c // indirect
	golang.org/x/sys v0.0.0-20211031064116-611d5d643895 // indirect
	golang.org/x/text v0.3.7 // indirect
	golang.org/x/tools v0.1.7 // indirect
	golang.org/x/xerrors v0.0.0-20200804184101-5ec99f83aff1 // indirect
	gopkg.in/ini.v1 v1.63.2 // indirect
	gopkg.in/yaml.v2 v2.4.0 // indirect
	sigs.k8s.io/yaml v1.3.0 // indirect
)
