[
  {
    "level": "INFO",
    "message": "Start JSON generation. Platform version: 24 min SDK version: armeabi-v7a"
  },
  {
    "level": "INFO",
    "message": "No CMake version was specified in build.gradle. Choosing a suitable version."
  },
  {
    "level": "INFO",
    "message": "Trying to locate CMake in local SDK repository."
  },
  {
    "level": "INFO",
    "message": "- CMake found in SDK at \u0027C:\\Users\\olivi\\AppData\\Local\\Android\\Sdk\\cmake\\3.6.4111459\u0027 had version \u00273.6.0\u0027"
  },
  {
    "level": "INFO",
    "message": "rebuilding JSON C:\\Users\\olivi\\Documents\\wondavr\\wvrmobile\\app\\.cxx\\cmake\\oculusvrStoreArmRelease\\armeabi-v7a\\android_gradle_build.json due to:"
  },
  {
    "level": "INFO",
    "message": "- force flag, will remove stale json folder"
  },
  {
    "level": "INFO",
    "message": "removing stale contents from \u0027C:\\Users\\olivi\\Documents\\wondavr\\wvrmobile\\app\\.cxx\\cmake\\oculusvrStoreArmRelease\\armeabi-v7a\u0027"
  },
  {
    "level": "INFO",
    "message": "created folder \u0027C:\\Users\\olivi\\Documents\\wondavr\\wvrmobile\\app\\.cxx\\cmake\\oculusvrStoreArmRelease\\armeabi-v7a\u0027"
  },
  {
    "level": "INFO",
    "message": "executing cmake Executable : C:\\Users\\olivi\\AppData\\Local\\Android\\Sdk\\cmake\\3.6.4111459\\bin\\cmake.exe\narguments : \n-HC:\\Users\\olivi\\Documents\\wondavr\\wvrmobile\\app\n-BC:\\Users\\olivi\\Documents\\wondavr\\wvrmobile\\app\\.cxx\\cmake\\oculusvrStoreArmRelease\\armeabi-v7a\n-DANDROID_ABI\u003darmeabi-v7a\n-DANDROID_PLATFORM\u003dandroid-24\n-DCMAKE_LIBRARY_OUTPUT_DIRECTORY\u003dC:\\Users\\olivi\\Documents\\wondavr\\wvrmobile\\app\\build\\intermediates\\cmake\\oculusvrStoreArmRelease\\obj\\armeabi-v7a\n-DCMAKE_BUILD_TYPE\u003dRelease\n-DANDROID_NDK\u003dC:\\Users\\olivi\\AppData\\Local\\Android\\Sdk\\ndk-bundle\n-DCMAKE_CXX_FLAGS\u003d-std\u003dc++14 -fexceptions -frtti -Werror -IC:\\Users\\olivi\\Documents\\wondavr\\wvrmobile\\app\\src\\main\\cpp -IC:\\Users\\olivi\\Documents\\wondavr\\wvrmobile\\app\\src\\main\\cpp\\vrb\\include  -IC:\\Users\\olivi\\Documents\\wondavr\\wvrmobile\\third_party\\ovr_mobile\\VrApi\\Include -IC:\\Users\\olivi\\Documents\\wondavr\\wvrmobile\\third_party\\OVRPlatformSDK\\Include -IC:\\Users\\olivi\\Documents\\wondavr\\wvrmobile\\app\\src\\oculusvr\\cpp -DOCULUSVR -DSTORE_BUILD\u003d1\n-DCMAKE_TOOLCHAIN_FILE\u003dC:\\Users\\olivi\\AppData\\Local\\Android\\Sdk\\ndk-bundle\\build\\cmake\\android.toolchain.cmake\n-DCMAKE_MAKE_PROGRAM\u003dC:\\Users\\olivi\\AppData\\Local\\Android\\Sdk\\cmake\\3.6.4111459\\bin\\ninja.exe\n-GAndroid Gradle - Ninja\n-DANDROID_STL\u003dc++_shared\n-DVR_SDK_LIB\u003doculusvr-lib\n-DVR_SDK_EXTRA_LIB\u003dovrplatform-lib\n-DOCULUSVR\u003dON\njvmArgs : \n\n"
  },
  {
    "level": "INFO",
    "message": "Executable : C:\\Users\\olivi\\AppData\\Local\\Android\\Sdk\\cmake\\3.6.4111459\\bin\\cmake.exe\narguments : \n-HC:\\Users\\olivi\\Documents\\wondavr\\wvrmobile\\app\n-BC:\\Users\\olivi\\Documents\\wondavr\\wvrmobile\\app\\.cxx\\cmake\\oculusvrStoreArmRelease\\armeabi-v7a\n-DANDROID_ABI\u003darmeabi-v7a\n-DANDROID_PLATFORM\u003dandroid-24\n-DCMAKE_LIBRARY_OUTPUT_DIRECTORY\u003dC:\\Users\\olivi\\Documents\\wondavr\\wvrmobile\\app\\build\\intermediates\\cmake\\oculusvrStoreArmRelease\\obj\\armeabi-v7a\n-DCMAKE_BUILD_TYPE\u003dRelease\n-DANDROID_NDK\u003dC:\\Users\\olivi\\AppData\\Local\\Android\\Sdk\\ndk-bundle\n-DCMAKE_CXX_FLAGS\u003d-std\u003dc++14 -fexceptions -frtti -Werror -IC:\\Users\\olivi\\Documents\\wondavr\\wvrmobile\\app\\src\\main\\cpp -IC:\\Users\\olivi\\Documents\\wondavr\\wvrmobile\\app\\src\\main\\cpp\\vrb\\include  -IC:\\Users\\olivi\\Documents\\wondavr\\wvrmobile\\third_party\\ovr_mobile\\VrApi\\Include -IC:\\Users\\olivi\\Documents\\wondavr\\wvrmobile\\third_party\\OVRPlatformSDK\\Include -IC:\\Users\\olivi\\Documents\\wondavr\\wvrmobile\\app\\src\\oculusvr\\cpp -DOCULUSVR -DSTORE_BUILD\u003d1\n-DCMAKE_TOOLCHAIN_FILE\u003dC:\\Users\\olivi\\AppData\\Local\\Android\\Sdk\\ndk-bundle\\build\\cmake\\android.toolchain.cmake\n-DCMAKE_MAKE_PROGRAM\u003dC:\\Users\\olivi\\AppData\\Local\\Android\\Sdk\\cmake\\3.6.4111459\\bin\\ninja.exe\n-GAndroid Gradle - Ninja\n-DANDROID_STL\u003dc++_shared\n-DVR_SDK_LIB\u003doculusvr-lib\n-DVR_SDK_EXTRA_LIB\u003dovrplatform-lib\n-DOCULUSVR\u003dON\njvmArgs : \n\n"
  },
  {
    "level": "INFO",
    "message": "done executing cmake"
  },
  {
    "level": "INFO",
    "message": "write build output C:\\Users\\olivi\\Documents\\wondavr\\wvrmobile\\app\\.cxx\\cmake\\oculusvrStoreArmRelease\\armeabi-v7a\\build_output.txt"
  },
  {
    "level": "INFO",
    "message": "write command file C:\\Users\\olivi\\Documents\\wondavr\\wvrmobile\\app\\.cxx\\cmake\\oculusvrStoreArmRelease\\armeabi-v7a\\build_command.txt"
  },
  {
    "level": "INFO",
    "message": "JSON generation completed without problems"
  }
]