
{
	"buildFiles" : 
	[
		"C:/Users/olivi/Documents/wondavr/wvrmobile/app/CMakeLists.txt",
		"C:/Users/olivi/Documents/wondavr/wvrmobile/app/src/main/cpp/vrb/src/CMakeLists.txt"
	],
	"cFileExtensions" : [ "c" ],
	"cleanCommands" : 
	[
		"C:\\Users\\olivi\\AppData\\Local\\Android\\Sdk\\cmake\\3.6.4111459\\bin\\cmake.exe --build C:\\Users\\olivi\\Documents\\wondavr\\wvrmobile\\app\\.cxx\\cmake\\oculusvr3dofStoreArm64Debug\\arm64-v8a --target clean"
	],
	"cppFileExtensions" : [ "cpp" ],
	"libraries" : 
	{
		"googlevr-lib-Debug-arm64-v8a" : 
		{
			"abi" : "arm64-v8a",
			"artifactName" : "googlevr-lib",
			"buildType" : "debug",
			"output" : "C:/Users/olivi/Documents/wondavr/wvrmobile/app/../gvr-android-sdk/libraries/jni/arm64-v8a/libgvr.so",
			"toolchain" : "2895662125"
		},
		"native-lib-Debug-arm64-v8a" : 
		{
			"abi" : "arm64-v8a",
			"artifactName" : "native-lib",
			"buildCommand" : "C:\\Users\\olivi\\AppData\\Local\\Android\\Sdk\\cmake\\3.6.4111459\\bin\\cmake.exe --build C:\\Users\\olivi\\Documents\\wondavr\\wvrmobile\\app\\.cxx\\cmake\\oculusvr3dofStoreArm64Debug\\arm64-v8a --target native-lib",
			"buildType" : "debug",
			"files" : 
			[
				
				{
					"flags" : "  --target=aarch64-none-linux-android24 --gcc-toolchain=C:/Users/olivi/AppData/Local/Android/Sdk/ndk-bundle/toolchains/llvm/prebuilt/windows-x86_64 --sysroot=C:/Users/olivi/AppData/Local/Android/Sdk/ndk-bundle/toolchains/llvm/prebuilt/windows-x86_64/sysroot  -Dnative_lib_EXPORTS -IC:\\Users\\olivi\\AppData\\Local\\Android\\Sdk\\ndk-bundle\\sources\\android\\native_app_glue  -g -DANDROID -fdata-sections -ffunction-sections -funwind-tables -fstack-protector-strong -no-canonical-prefixes -fno-addrsig -Wa,--noexecstack -Wformat -Werror=format-security  -std=c++14 -fexceptions -frtti -Werror -IC:\\Users\\olivi\\Documents\\wondavr\\wvrmobile\\app\\src\\main\\cpp -IC:\\Users\\olivi\\Documents\\wondavr\\wvrmobile\\app\\src\\main\\cpp\\vrb\\include  -IC:\\Users\\olivi\\Documents\\wondavr\\wvrmobile\\third_party\\ovr_mobile\\VrApi\\Include -IC:\\Users\\olivi\\Documents\\wondavr\\wvrmobile\\third_party\\OVRPlatformSDK\\Include -IC:\\Users\\olivi\\Documents\\wondavr\\wvrmobile\\app\\src\\oculusvr\\cpp -DOCULUSVR -DSTORE_BUILD=1 -O0 -fno-limit-debug-info  -fPIC    -c ",
					"src" : "C:/Users/olivi/Documents/wondavr/wvrmobile/app/src/main/cpp/BrowserWorld.cpp",
					"workingDirectory" : "C:/Users/olivi/Documents/wondavr/wvrmobile/app/.cxx/cmake/oculusvr3dofStoreArm64Debug/arm64-v8a"
				},
				
				{
					"flags" : "  --target=aarch64-none-linux-android24 --gcc-toolchain=C:/Users/olivi/AppData/Local/Android/Sdk/ndk-bundle/toolchains/llvm/prebuilt/windows-x86_64 --sysroot=C:/Users/olivi/AppData/Local/Android/Sdk/ndk-bundle/toolchains/llvm/prebuilt/windows-x86_64/sysroot  -Dnative_lib_EXPORTS -IC:\\Users\\olivi\\AppData\\Local\\Android\\Sdk\\ndk-bundle\\sources\\android\\native_app_glue  -g -DANDROID -fdata-sections -ffunction-sections -funwind-tables -fstack-protector-strong -no-canonical-prefixes -fno-addrsig -Wa,--noexecstack -Wformat -Werror=format-security  -std=c++14 -fexceptions -frtti -Werror -IC:\\Users\\olivi\\Documents\\wondavr\\wvrmobile\\app\\src\\main\\cpp -IC:\\Users\\olivi\\Documents\\wondavr\\wvrmobile\\app\\src\\main\\cpp\\vrb\\include  -IC:\\Users\\olivi\\Documents\\wondavr\\wvrmobile\\third_party\\ovr_mobile\\VrApi\\Include -IC:\\Users\\olivi\\Documents\\wondavr\\wvrmobile\\third_party\\OVRPlatformSDK\\Include -IC:\\Users\\olivi\\Documents\\wondavr\\wvrmobile\\app\\src\\oculusvr\\cpp -DOCULUSVR -DSTORE_BUILD=1 -O0 -fno-limit-debug-info  -fPIC    -c ",
					"src" : "C:/Users/olivi/Documents/wondavr/wvrmobile/app/src/main/cpp/Cylinder.cpp",
					"workingDirectory" : "C:/Users/olivi/Documents/wondavr/wvrmobile/app/.cxx/cmake/oculusvr3dofStoreArm64Debug/arm64-v8a"
				},
				
				{
					"flags" : "  --target=aarch64-none-linux-android24 --gcc-toolchain=C:/Users/olivi/AppData/Local/Android/Sdk/ndk-bundle/toolchains/llvm/prebuilt/windows-x86_64 --sysroot=C:/Users/olivi/AppData/Local/Android/Sdk/ndk-bundle/toolchains/llvm/prebuilt/windows-x86_64/sysroot  -Dnative_lib_EXPORTS -IC:\\Users\\olivi\\AppData\\Local\\Android\\Sdk\\ndk-bundle\\sources\\android\\native_app_glue  -g -DANDROID -fdata-sections -ffunction-sections -funwind-tables -fstack-protector-strong -no-canonical-prefixes -fno-addrsig -Wa,--noexecstack -Wformat -Werror=format-security  -std=c++14 -fexceptions -frtti -Werror -IC:\\Users\\olivi\\Documents\\wondavr\\wvrmobile\\app\\src\\main\\cpp -IC:\\Users\\olivi\\Documents\\wondavr\\wvrmobile\\app\\src\\main\\cpp\\vrb\\include  -IC:\\Users\\olivi\\Documents\\wondavr\\wvrmobile\\third_party\\ovr_mobile\\VrApi\\Include -IC:\\Users\\olivi\\Documents\\wondavr\\wvrmobile\\third_party\\OVRPlatformSDK\\Include -IC:\\Users\\olivi\\Documents\\wondavr\\wvrmobile\\app\\src\\oculusvr\\cpp -DOCULUSVR -DSTORE_BUILD=1 -O0 -fno-limit-debug-info  -fPIC    -c ",
					"src" : "C:/Users/olivi/Documents/wondavr/wvrmobile/app/src/main/cpp/Controller.cpp",
					"workingDirectory" : "C:/Users/olivi/Documents/wondavr/wvrmobile/app/.cxx/cmake/oculusvr3dofStoreArm64Debug/arm64-v8a"
				},
				
				{
					"flags" : "  --target=aarch64-none-linux-android24 --gcc-toolchain=C:/Users/olivi/AppData/Local/Android/Sdk/ndk-bundle/toolchains/llvm/prebuilt/windows-x86_64 --sysroot=C:/Users/olivi/AppData/Local/Android/Sdk/ndk-bundle/toolchains/llvm/prebuilt/windows-x86_64/sysroot  -Dnative_lib_EXPORTS -IC:\\Users\\olivi\\AppData\\Local\\Android\\Sdk\\ndk-bundle\\sources\\android\\native_app_glue  -g -DANDROID -fdata-sections -ffunction-sections -funwind-tables -fstack-protector-strong -no-canonical-prefixes -fno-addrsig -Wa,--noexecstack -Wformat -Werror=format-security  -std=c++14 -fexceptions -frtti -Werror -IC:\\Users\\olivi\\Documents\\wondavr\\wvrmobile\\app\\src\\main\\cpp -IC:\\Users\\olivi\\Documents\\wondavr\\wvrmobile\\app\\src\\main\\cpp\\vrb\\include  -IC:\\Users\\olivi\\Documents\\wondavr\\wvrmobile\\third_party\\ovr_mobile\\VrApi\\Include -IC:\\Users\\olivi\\Documents\\wondavr\\wvrmobile\\third_party\\OVRPlatformSDK\\Include -IC:\\Users\\olivi\\Documents\\wondavr\\wvrmobile\\app\\src\\oculusvr\\cpp -DOCULUSVR -DSTORE_BUILD=1 -O0 -fno-limit-debug-info  -fPIC    -c ",
					"src" : "C:/Users/olivi/Documents/wondavr/wvrmobile/app/src/main/cpp/ControllerContainer.cpp",
					"workingDirectory" : "C:/Users/olivi/Documents/wondavr/wvrmobile/app/.cxx/cmake/oculusvr3dofStoreArm64Debug/arm64-v8a"
				},
				
				{
					"flags" : "  --target=aarch64-none-linux-android24 --gcc-toolchain=C:/Users/olivi/AppData/Local/Android/Sdk/ndk-bundle/toolchains/llvm/prebuilt/windows-x86_64 --sysroot=C:/Users/olivi/AppData/Local/Android/Sdk/ndk-bundle/toolchains/llvm/prebuilt/windows-x86_64/sysroot  -Dnative_lib_EXPORTS -IC:\\Users\\olivi\\AppData\\Local\\Android\\Sdk\\ndk-bundle\\sources\\android\\native_app_glue  -g -DANDROID -fdata-sections -ffunction-sections -funwind-tables -fstack-protector-strong -no-canonical-prefixes -fno-addrsig -Wa,--noexecstack -Wformat -Werror=format-security  -std=c++14 -fexceptions -frtti -Werror -IC:\\Users\\olivi\\Documents\\wondavr\\wvrmobile\\app\\src\\main\\cpp -IC:\\Users\\olivi\\Documents\\wondavr\\wvrmobile\\app\\src\\main\\cpp\\vrb\\include  -IC:\\Users\\olivi\\Documents\\wondavr\\wvrmobile\\third_party\\ovr_mobile\\VrApi\\Include -IC:\\Users\\olivi\\Documents\\wondavr\\wvrmobile\\third_party\\OVRPlatformSDK\\Include -IC:\\Users\\olivi\\Documents\\wondavr\\wvrmobile\\app\\src\\oculusvr\\cpp -DOCULUSVR -DSTORE_BUILD=1 -O0 -fno-limit-debug-info  -fPIC    -c ",
					"src" : "C:/Users/olivi/Documents/wondavr/wvrmobile/app/src/main/cpp/DeviceUtils.cpp",
					"workingDirectory" : "C:/Users/olivi/Documents/wondavr/wvrmobile/app/.cxx/cmake/oculusvr3dofStoreArm64Debug/arm64-v8a"
				},
				
				{
					"flags" : "  --target=aarch64-none-linux-android24 --gcc-toolchain=C:/Users/olivi/AppData/Local/Android/Sdk/ndk-bundle/toolchains/llvm/prebuilt/windows-x86_64 --sysroot=C:/Users/olivi/AppData/Local/Android/Sdk/ndk-bundle/toolchains/llvm/prebuilt/windows-x86_64/sysroot  -Dnative_lib_EXPORTS -IC:\\Users\\olivi\\AppData\\Local\\Android\\Sdk\\ndk-bundle\\sources\\android\\native_app_glue  -g -DANDROID -fdata-sections -ffunction-sections -funwind-tables -fstack-protector-strong -no-canonical-prefixes -fno-addrsig -Wa,--noexecstack -Wformat -Werror=format-security  -std=c++14 -fexceptions -frtti -Werror -IC:\\Users\\olivi\\Documents\\wondavr\\wvrmobile\\app\\src\\main\\cpp -IC:\\Users\\olivi\\Documents\\wondavr\\wvrmobile\\app\\src\\main\\cpp\\vrb\\include  -IC:\\Users\\olivi\\Documents\\wondavr\\wvrmobile\\third_party\\ovr_mobile\\VrApi\\Include -IC:\\Users\\olivi\\Documents\\wondavr\\wvrmobile\\third_party\\OVRPlatformSDK\\Include -IC:\\Users\\olivi\\Documents\\wondavr\\wvrmobile\\app\\src\\oculusvr\\cpp -DOCULUSVR -DSTORE_BUILD=1 -O0 -fno-limit-debug-info  -fPIC    -c ",
					"src" : "C:/Users/olivi/Documents/wondavr/wvrmobile/app/src/main/cpp/ElbowModel.cpp",
					"workingDirectory" : "C:/Users/olivi/Documents/wondavr/wvrmobile/app/.cxx/cmake/oculusvr3dofStoreArm64Debug/arm64-v8a"
				},
				
				{
					"flags" : "  --target=aarch64-none-linux-android24 --gcc-toolchain=C:/Users/olivi/AppData/Local/Android/Sdk/ndk-bundle/toolchains/llvm/prebuilt/windows-x86_64 --sysroot=C:/Users/olivi/AppData/Local/Android/Sdk/ndk-bundle/toolchains/llvm/prebuilt/windows-x86_64/sysroot  -Dnative_lib_EXPORTS -IC:\\Users\\olivi\\AppData\\Local\\Android\\Sdk\\ndk-bundle\\sources\\android\\native_app_glue  -g -DANDROID -fdata-sections -ffunction-sections -funwind-tables -fstack-protector-strong -no-canonical-prefixes -fno-addrsig -Wa,--noexecstack -Wformat -Werror=format-security  -std=c++14 -fexceptions -frtti -Werror -IC:\\Users\\olivi\\Documents\\wondavr\\wvrmobile\\app\\src\\main\\cpp -IC:\\Users\\olivi\\Documents\\wondavr\\wvrmobile\\app\\src\\main\\cpp\\vrb\\include  -IC:\\Users\\olivi\\Documents\\wondavr\\wvrmobile\\third_party\\ovr_mobile\\VrApi\\Include -IC:\\Users\\olivi\\Documents\\wondavr\\wvrmobile\\third_party\\OVRPlatformSDK\\Include -IC:\\Users\\olivi\\Documents\\wondavr\\wvrmobile\\app\\src\\oculusvr\\cpp -DOCULUSVR -DSTORE_BUILD=1 -O0 -fno-limit-debug-info  -fPIC    -c ",
					"src" : "C:/Users/olivi/Documents/wondavr/wvrmobile/app/src/main/cpp/FadeAnimation.cpp",
					"workingDirectory" : "C:/Users/olivi/Documents/wondavr/wvrmobile/app/.cxx/cmake/oculusvr3dofStoreArm64Debug/arm64-v8a"
				},
				
				{
					"flags" : "  --target=aarch64-none-linux-android24 --gcc-toolchain=C:/Users/olivi/AppData/Local/Android/Sdk/ndk-bundle/toolchains/llvm/prebuilt/windows-x86_64 --sysroot=C:/Users/olivi/AppData/Local/Android/Sdk/ndk-bundle/toolchains/llvm/prebuilt/windows-x86_64/sysroot  -Dnative_lib_EXPORTS -IC:\\Users\\olivi\\AppData\\Local\\Android\\Sdk\\ndk-bundle\\sources\\android\\native_app_glue  -g -DANDROID -fdata-sections -ffunction-sections -funwind-tables -fstack-protector-strong -no-canonical-prefixes -fno-addrsig -Wa,--noexecstack -Wformat -Werror=format-security  -std=c++14 -fexceptions -frtti -Werror -IC:\\Users\\olivi\\Documents\\wondavr\\wvrmobile\\app\\src\\main\\cpp -IC:\\Users\\olivi\\Documents\\wondavr\\wvrmobile\\app\\src\\main\\cpp\\vrb\\include  -IC:\\Users\\olivi\\Documents\\wondavr\\wvrmobile\\third_party\\ovr_mobile\\VrApi\\Include -IC:\\Users\\olivi\\Documents\\wondavr\\wvrmobile\\third_party\\OVRPlatformSDK\\Include -IC:\\Users\\olivi\\Documents\\wondavr\\wvrmobile\\app\\src\\oculusvr\\cpp -DOCULUSVR -DSTORE_BUILD=1 -O0 -fno-limit-debug-info  -fPIC    -c ",
					"src" : "C:/Users/olivi/Documents/wondavr/wvrmobile/app/src/main/cpp/Quad.cpp",
					"workingDirectory" : "C:/Users/olivi/Documents/wondavr/wvrmobile/app/.cxx/cmake/oculusvr3dofStoreArm64Debug/arm64-v8a"
				},
				
				{
					"flags" : "  --target=aarch64-none-linux-android24 --gcc-toolchain=C:/Users/olivi/AppData/Local/Android/Sdk/ndk-bundle/toolchains/llvm/prebuilt/windows-x86_64 --sysroot=C:/Users/olivi/AppData/Local/Android/Sdk/ndk-bundle/toolchains/llvm/prebuilt/windows-x86_64/sysroot  -Dnative_lib_EXPORTS -IC:\\Users\\olivi\\AppData\\Local\\Android\\Sdk\\ndk-bundle\\sources\\android\\native_app_glue  -g -DANDROID -fdata-sections -ffunction-sections -funwind-tables -fstack-protector-strong -no-canonical-prefixes -fno-addrsig -Wa,--noexecstack -Wformat -Werror=format-security  -std=c++14 -fexceptions -frtti -Werror -IC:\\Users\\olivi\\Documents\\wondavr\\wvrmobile\\app\\src\\main\\cpp -IC:\\Users\\olivi\\Documents\\wondavr\\wvrmobile\\app\\src\\main\\cpp\\vrb\\include  -IC:\\Users\\olivi\\Documents\\wondavr\\wvrmobile\\third_party\\ovr_mobile\\VrApi\\Include -IC:\\Users\\olivi\\Documents\\wondavr\\wvrmobile\\third_party\\OVRPlatformSDK\\Include -IC:\\Users\\olivi\\Documents\\wondavr\\wvrmobile\\app\\src\\oculusvr\\cpp -DOCULUSVR -DSTORE_BUILD=1 -O0 -fno-limit-debug-info  -fPIC    -c ",
					"src" : "C:/Users/olivi/Documents/wondavr/wvrmobile/app/src/main/cpp/ExternalBlitter.cpp",
					"workingDirectory" : "C:/Users/olivi/Documents/wondavr/wvrmobile/app/.cxx/cmake/oculusvr3dofStoreArm64Debug/arm64-v8a"
				},
				
				{
					"flags" : "  --target=aarch64-none-linux-android24 --gcc-toolchain=C:/Users/olivi/AppData/Local/Android/Sdk/ndk-bundle/toolchains/llvm/prebuilt/windows-x86_64 --sysroot=C:/Users/olivi/AppData/Local/Android/Sdk/ndk-bundle/toolchains/llvm/prebuilt/windows-x86_64/sysroot  -Dnative_lib_EXPORTS -IC:\\Users\\olivi\\AppData\\Local\\Android\\Sdk\\ndk-bundle\\sources\\android\\native_app_glue  -g -DANDROID -fdata-sections -ffunction-sections -funwind-tables -fstack-protector-strong -no-canonical-prefixes -fno-addrsig -Wa,--noexecstack -Wformat -Werror=format-security  -std=c++14 -fexceptions -frtti -Werror -IC:\\Users\\olivi\\Documents\\wondavr\\wvrmobile\\app\\src\\main\\cpp -IC:\\Users\\olivi\\Documents\\wondavr\\wvrmobile\\app\\src\\main\\cpp\\vrb\\include  -IC:\\Users\\olivi\\Documents\\wondavr\\wvrmobile\\third_party\\ovr_mobile\\VrApi\\Include -IC:\\Users\\olivi\\Documents\\wondavr\\wvrmobile\\third_party\\OVRPlatformSDK\\Include -IC:\\Users\\olivi\\Documents\\wondavr\\wvrmobile\\app\\src\\oculusvr\\cpp -DOCULUSVR -DSTORE_BUILD=1 -O0 -fno-limit-debug-info  -fPIC    -c ",
					"src" : "C:/Users/olivi/Documents/wondavr/wvrmobile/app/src/main/cpp/ExternalVR.cpp",
					"workingDirectory" : "C:/Users/olivi/Documents/wondavr/wvrmobile/app/.cxx/cmake/oculusvr3dofStoreArm64Debug/arm64-v8a"
				},
				
				{
					"flags" : "  --target=aarch64-none-linux-android24 --gcc-toolchain=C:/Users/olivi/AppData/Local/Android/Sdk/ndk-bundle/toolchains/llvm/prebuilt/windows-x86_64 --sysroot=C:/Users/olivi/AppData/Local/Android/Sdk/ndk-bundle/toolchains/llvm/prebuilt/windows-x86_64/sysroot  -Dnative_lib_EXPORTS -IC:\\Users\\olivi\\AppData\\Local\\Android\\Sdk\\ndk-bundle\\sources\\android\\native_app_glue  -g -DANDROID -fdata-sections -ffunction-sections -funwind-tables -fstack-protector-strong -no-canonical-prefixes -fno-addrsig -Wa,--noexecstack -Wformat -Werror=format-security  -std=c++14 -fexceptions -frtti -Werror -IC:\\Users\\olivi\\Documents\\wondavr\\wvrmobile\\app\\src\\main\\cpp -IC:\\Users\\olivi\\Documents\\wondavr\\wvrmobile\\app\\src\\main\\cpp\\vrb\\include  -IC:\\Users\\olivi\\Documents\\wondavr\\wvrmobile\\third_party\\ovr_mobile\\VrApi\\Include -IC:\\Users\\olivi\\Documents\\wondavr\\wvrmobile\\third_party\\OVRPlatformSDK\\Include -IC:\\Users\\olivi\\Documents\\wondavr\\wvrmobile\\app\\src\\oculusvr\\cpp -DOCULUSVR -DSTORE_BUILD=1 -O0 -fno-limit-debug-info  -fPIC    -c ",
					"src" : "C:/Users/olivi/Documents/wondavr/wvrmobile/app/src/main/cpp/GeckoSurfaceTexture.cpp",
					"workingDirectory" : "C:/Users/olivi/Documents/wondavr/wvrmobile/app/.cxx/cmake/oculusvr3dofStoreArm64Debug/arm64-v8a"
				},
				
				{
					"flags" : "  --target=aarch64-none-linux-android24 --gcc-toolchain=C:/Users/olivi/AppData/Local/Android/Sdk/ndk-bundle/toolchains/llvm/prebuilt/windows-x86_64 --sysroot=C:/Users/olivi/AppData/Local/Android/Sdk/ndk-bundle/toolchains/llvm/prebuilt/windows-x86_64/sysroot  -Dnative_lib_EXPORTS -IC:\\Users\\olivi\\AppData\\Local\\Android\\Sdk\\ndk-bundle\\sources\\android\\native_app_glue  -g -DANDROID -fdata-sections -ffunction-sections -funwind-tables -fstack-protector-strong -no-canonical-prefixes -fno-addrsig -Wa,--noexecstack -Wformat -Werror=format-security  -std=c++14 -fexceptions -frtti -Werror -IC:\\Users\\olivi\\Documents\\wondavr\\wvrmobile\\app\\src\\main\\cpp -IC:\\Users\\olivi\\Documents\\wondavr\\wvrmobile\\app\\src\\main\\cpp\\vrb\\include  -IC:\\Users\\olivi\\Documents\\wondavr\\wvrmobile\\third_party\\ovr_mobile\\VrApi\\Include -IC:\\Users\\olivi\\Documents\\wondavr\\wvrmobile\\third_party\\OVRPlatformSDK\\Include -IC:\\Users\\olivi\\Documents\\wondavr\\wvrmobile\\app\\src\\oculusvr\\cpp -DOCULUSVR -DSTORE_BUILD=1 -O0 -fno-limit-debug-info  -fPIC    -c ",
					"src" : "C:/Users/olivi/Documents/wondavr/wvrmobile/app/src/main/cpp/GestureDelegate.cpp",
					"workingDirectory" : "C:/Users/olivi/Documents/wondavr/wvrmobile/app/.cxx/cmake/oculusvr3dofStoreArm64Debug/arm64-v8a"
				},
				
				{
					"flags" : "  --target=aarch64-none-linux-android24 --gcc-toolchain=C:/Users/olivi/AppData/Local/Android/Sdk/ndk-bundle/toolchains/llvm/prebuilt/windows-x86_64 --sysroot=C:/Users/olivi/AppData/Local/Android/Sdk/ndk-bundle/toolchains/llvm/prebuilt/windows-x86_64/sysroot  -Dnative_lib_EXPORTS -IC:\\Users\\olivi\\AppData\\Local\\Android\\Sdk\\ndk-bundle\\sources\\android\\native_app_glue  -g -DANDROID -fdata-sections -ffunction-sections -funwind-tables -fstack-protector-strong -no-canonical-prefixes -fno-addrsig -Wa,--noexecstack -Wformat -Werror=format-security  -std=c++14 -fexceptions -frtti -Werror -IC:\\Users\\olivi\\Documents\\wondavr\\wvrmobile\\app\\src\\main\\cpp -IC:\\Users\\olivi\\Documents\\wondavr\\wvrmobile\\app\\src\\main\\cpp\\vrb\\include  -IC:\\Users\\olivi\\Documents\\wondavr\\wvrmobile\\third_party\\ovr_mobile\\VrApi\\Include -IC:\\Users\\olivi\\Documents\\wondavr\\wvrmobile\\third_party\\OVRPlatformSDK\\Include -IC:\\Users\\olivi\\Documents\\wondavr\\wvrmobile\\app\\src\\oculusvr\\cpp -DOCULUSVR -DSTORE_BUILD=1 -O0 -fno-limit-debug-info  -fPIC    -c ",
					"src" : "C:/Users/olivi/Documents/wondavr/wvrmobile/app/src/main/cpp/LoadingAnimation.cpp",
					"workingDirectory" : "C:/Users/olivi/Documents/wondavr/wvrmobile/app/.cxx/cmake/oculusvr3dofStoreArm64Debug/arm64-v8a"
				},
				
				{
					"flags" : "  --target=aarch64-none-linux-android24 --gcc-toolchain=C:/Users/olivi/AppData/Local/Android/Sdk/ndk-bundle/toolchains/llvm/prebuilt/windows-x86_64 --sysroot=C:/Users/olivi/AppData/Local/Android/Sdk/ndk-bundle/toolchains/llvm/prebuilt/windows-x86_64/sysroot  -Dnative_lib_EXPORTS -IC:\\Users\\olivi\\AppData\\Local\\Android\\Sdk\\ndk-bundle\\sources\\android\\native_app_glue  -g -DANDROID -fdata-sections -ffunction-sections -funwind-tables -fstack-protector-strong -no-canonical-prefixes -fno-addrsig -Wa,--noexecstack -Wformat -Werror=format-security  -std=c++14 -fexceptions -frtti -Werror -IC:\\Users\\olivi\\Documents\\wondavr\\wvrmobile\\app\\src\\main\\cpp -IC:\\Users\\olivi\\Documents\\wondavr\\wvrmobile\\app\\src\\main\\cpp\\vrb\\include  -IC:\\Users\\olivi\\Documents\\wondavr\\wvrmobile\\third_party\\ovr_mobile\\VrApi\\Include -IC:\\Users\\olivi\\Documents\\wondavr\\wvrmobile\\third_party\\OVRPlatformSDK\\Include -IC:\\Users\\olivi\\Documents\\wondavr\\wvrmobile\\app\\src\\oculusvr\\cpp -DOCULUSVR -DSTORE_BUILD=1 -O0 -fno-limit-debug-info  -fPIC    -c ",
					"src" : "C:/Users/olivi/Documents/wondavr/wvrmobile/app/src/main/cpp/JNIUtil.cpp",
					"workingDirectory" : "C:/Users/olivi/Documents/wondavr/wvrmobile/app/.cxx/cmake/oculusvr3dofStoreArm64Debug/arm64-v8a"
				},
				
				{
					"flags" : "  --target=aarch64-none-linux-android24 --gcc-toolchain=C:/Users/olivi/AppData/Local/Android/Sdk/ndk-bundle/toolchains/llvm/prebuilt/windows-x86_64 --sysroot=C:/Users/olivi/AppData/Local/Android/Sdk/ndk-bundle/toolchains/llvm/prebuilt/windows-x86_64/sysroot  -Dnative_lib_EXPORTS -IC:\\Users\\olivi\\AppData\\Local\\Android\\Sdk\\ndk-bundle\\sources\\android\\native_app_glue  -g -DANDROID -fdata-sections -ffunction-sections -funwind-tables -fstack-protector-strong -no-canonical-prefixes -fno-addrsig -Wa,--noexecstack -Wformat -Werror=format-security  -std=c++14 -fexceptions -frtti -Werror -IC:\\Users\\olivi\\Documents\\wondavr\\wvrmobile\\app\\src\\main\\cpp -IC:\\Users\\olivi\\Documents\\wondavr\\wvrmobile\\app\\src\\main\\cpp\\vrb\\include  -IC:\\Users\\olivi\\Documents\\wondavr\\wvrmobile\\third_party\\ovr_mobile\\VrApi\\Include -IC:\\Users\\olivi\\Documents\\wondavr\\wvrmobile\\third_party\\OVRPlatformSDK\\Include -IC:\\Users\\olivi\\Documents\\wondavr\\wvrmobile\\app\\src\\oculusvr\\cpp -DOCULUSVR -DSTORE_BUILD=1 -O0 -fno-limit-debug-info  -fPIC    -c ",
					"src" : "C:/Users/olivi/Documents/wondavr/wvrmobile/app/src/main/cpp/Pointer.cpp",
					"workingDirectory" : "C:/Users/olivi/Documents/wondavr/wvrmobile/app/.cxx/cmake/oculusvr3dofStoreArm64Debug/arm64-v8a"
				},
				
				{
					"flags" : "  --target=aarch64-none-linux-android24 --gcc-toolchain=C:/Users/olivi/AppData/Local/Android/Sdk/ndk-bundle/toolchains/llvm/prebuilt/windows-x86_64 --sysroot=C:/Users/olivi/AppData/Local/Android/Sdk/ndk-bundle/toolchains/llvm/prebuilt/windows-x86_64/sysroot  -Dnative_lib_EXPORTS -IC:\\Users\\olivi\\AppData\\Local\\Android\\Sdk\\ndk-bundle\\sources\\android\\native_app_glue  -g -DANDROID -fdata-sections -ffunction-sections -funwind-tables -fstack-protector-strong -no-canonical-prefixes -fno-addrsig -Wa,--noexecstack -Wformat -Werror=format-security  -std=c++14 -fexceptions -frtti -Werror -IC:\\Users\\olivi\\Documents\\wondavr\\wvrmobile\\app\\src\\main\\cpp -IC:\\Users\\olivi\\Documents\\wondavr\\wvrmobile\\app\\src\\main\\cpp\\vrb\\include  -IC:\\Users\\olivi\\Documents\\wondavr\\wvrmobile\\third_party\\ovr_mobile\\VrApi\\Include -IC:\\Users\\olivi\\Documents\\wondavr\\wvrmobile\\third_party\\OVRPlatformSDK\\Include -IC:\\Users\\olivi\\Documents\\wondavr\\wvrmobile\\app\\src\\oculusvr\\cpp -DOCULUSVR -DSTORE_BUILD=1 -O0 -fno-limit-debug-info  -fPIC    -c ",
					"src" : "C:/Users/olivi/Documents/wondavr/wvrmobile/app/src/main/cpp/Skybox.cpp",
					"workingDirectory" : "C:/Users/olivi/Documents/wondavr/wvrmobile/app/.cxx/cmake/oculusvr3dofStoreArm64Debug/arm64-v8a"
				},
				
				{
					"flags" : "  --target=aarch64-none-linux-android24 --gcc-toolchain=C:/Users/olivi/AppData/Local/Android/Sdk/ndk-bundle/toolchains/llvm/prebuilt/windows-x86_64 --sysroot=C:/Users/olivi/AppData/Local/Android/Sdk/ndk-bundle/toolchains/llvm/prebuilt/windows-x86_64/sysroot  -Dnative_lib_EXPORTS -IC:\\Users\\olivi\\AppData\\Local\\Android\\Sdk\\ndk-bundle\\sources\\android\\native_app_glue  -g -DANDROID -fdata-sections -ffunction-sections -funwind-tables -fstack-protector-strong -no-canonical-prefixes -fno-addrsig -Wa,--noexecstack -Wformat -Werror=format-security  -std=c++14 -fexceptions -frtti -Werror -IC:\\Users\\olivi\\Documents\\wondavr\\wvrmobile\\app\\src\\main\\cpp -IC:\\Users\\olivi\\Documents\\wondavr\\wvrmobile\\app\\src\\main\\cpp\\vrb\\include  -IC:\\Users\\olivi\\Documents\\wondavr\\wvrmobile\\third_party\\ovr_mobile\\VrApi\\Include -IC:\\Users\\olivi\\Documents\\wondavr\\wvrmobile\\third_party\\OVRPlatformSDK\\Include -IC:\\Users\\olivi\\Documents\\wondavr\\wvrmobile\\app\\src\\oculusvr\\cpp -DOCULUSVR -DSTORE_BUILD=1 -O0 -fno-limit-debug-info  -fPIC    -c ",
					"src" : "C:/Users/olivi/Documents/wondavr/wvrmobile/app/src/main/cpp/SplashAnimation.cpp",
					"workingDirectory" : "C:/Users/olivi/Documents/wondavr/wvrmobile/app/.cxx/cmake/oculusvr3dofStoreArm64Debug/arm64-v8a"
				},
				
				{
					"flags" : "  --target=aarch64-none-linux-android24 --gcc-toolchain=C:/Users/olivi/AppData/Local/Android/Sdk/ndk-bundle/toolchains/llvm/prebuilt/windows-x86_64 --sysroot=C:/Users/olivi/AppData/Local/Android/Sdk/ndk-bundle/toolchains/llvm/prebuilt/windows-x86_64/sysroot  -Dnative_lib_EXPORTS -IC:\\Users\\olivi\\AppData\\Local\\Android\\Sdk\\ndk-bundle\\sources\\android\\native_app_glue  -g -DANDROID -fdata-sections -ffunction-sections -funwind-tables -fstack-protector-strong -no-canonical-prefixes -fno-addrsig -Wa,--noexecstack -Wformat -Werror=format-security  -std=c++14 -fexceptions -frtti -Werror -IC:\\Users\\olivi\\Documents\\wondavr\\wvrmobile\\app\\src\\main\\cpp -IC:\\Users\\olivi\\Documents\\wondavr\\wvrmobile\\app\\src\\main\\cpp\\vrb\\include  -IC:\\Users\\olivi\\Documents\\wondavr\\wvrmobile\\third_party\\ovr_mobile\\VrApi\\Include -IC:\\Users\\olivi\\Documents\\wondavr\\wvrmobile\\third_party\\OVRPlatformSDK\\Include -IC:\\Users\\olivi\\Documents\\wondavr\\wvrmobile\\app\\src\\oculusvr\\cpp -DOCULUSVR -DSTORE_BUILD=1 -O0 -fno-limit-debug-info  -fPIC    -c ",
					"src" : "C:/Users/olivi/Documents/wondavr/wvrmobile/app/src/main/cpp/VRBrowser.cpp",
					"workingDirectory" : "C:/Users/olivi/Documents/wondavr/wvrmobile/app/.cxx/cmake/oculusvr3dofStoreArm64Debug/arm64-v8a"
				},
				
				{
					"flags" : "  --target=aarch64-none-linux-android24 --gcc-toolchain=C:/Users/olivi/AppData/Local/Android/Sdk/ndk-bundle/toolchains/llvm/prebuilt/windows-x86_64 --sysroot=C:/Users/olivi/AppData/Local/Android/Sdk/ndk-bundle/toolchains/llvm/prebuilt/windows-x86_64/sysroot  -Dnative_lib_EXPORTS -IC:\\Users\\olivi\\AppData\\Local\\Android\\Sdk\\ndk-bundle\\sources\\android\\native_app_glue  -g -DANDROID -fdata-sections -ffunction-sections -funwind-tables -fstack-protector-strong -no-canonical-prefixes -fno-addrsig -Wa,--noexecstack -Wformat -Werror=format-security  -std=c++14 -fexceptions -frtti -Werror -IC:\\Users\\olivi\\Documents\\wondavr\\wvrmobile\\app\\src\\main\\cpp -IC:\\Users\\olivi\\Documents\\wondavr\\wvrmobile\\app\\src\\main\\cpp\\vrb\\include  -IC:\\Users\\olivi\\Documents\\wondavr\\wvrmobile\\third_party\\ovr_mobile\\VrApi\\Include -IC:\\Users\\olivi\\Documents\\wondavr\\wvrmobile\\third_party\\OVRPlatformSDK\\Include -IC:\\Users\\olivi\\Documents\\wondavr\\wvrmobile\\app\\src\\oculusvr\\cpp -DOCULUSVR -DSTORE_BUILD=1 -O0 -fno-limit-debug-info  -fPIC    -c ",
					"src" : "C:/Users/olivi/Documents/wondavr/wvrmobile/app/src/main/cpp/VRVideo.cpp",
					"workingDirectory" : "C:/Users/olivi/Documents/wondavr/wvrmobile/app/.cxx/cmake/oculusvr3dofStoreArm64Debug/arm64-v8a"
				},
				
				{
					"flags" : "  --target=aarch64-none-linux-android24 --gcc-toolchain=C:/Users/olivi/AppData/Local/Android/Sdk/ndk-bundle/toolchains/llvm/prebuilt/windows-x86_64 --sysroot=C:/Users/olivi/AppData/Local/Android/Sdk/ndk-bundle/toolchains/llvm/prebuilt/windows-x86_64/sysroot  -Dnative_lib_EXPORTS -IC:\\Users\\olivi\\AppData\\Local\\Android\\Sdk\\ndk-bundle\\sources\\android\\native_app_glue  -g -DANDROID -fdata-sections -ffunction-sections -funwind-tables -fstack-protector-strong -no-canonical-prefixes -fno-addrsig -Wa,--noexecstack -Wformat -Werror=format-security  -std=c++14 -fexceptions -frtti -Werror -IC:\\Users\\olivi\\Documents\\wondavr\\wvrmobile\\app\\src\\main\\cpp -IC:\\Users\\olivi\\Documents\\wondavr\\wvrmobile\\app\\src\\main\\cpp\\vrb\\include  -IC:\\Users\\olivi\\Documents\\wondavr\\wvrmobile\\third_party\\ovr_mobile\\VrApi\\Include -IC:\\Users\\olivi\\Documents\\wondavr\\wvrmobile\\third_party\\OVRPlatformSDK\\Include -IC:\\Users\\olivi\\Documents\\wondavr\\wvrmobile\\app\\src\\oculusvr\\cpp -DOCULUSVR -DSTORE_BUILD=1 -O0 -fno-limit-debug-info  -fPIC    -c ",
					"src" : "C:/Users/olivi/Documents/wondavr/wvrmobile/app/src/main/cpp/VRLayer.cpp",
					"workingDirectory" : "C:/Users/olivi/Documents/wondavr/wvrmobile/app/.cxx/cmake/oculusvr3dofStoreArm64Debug/arm64-v8a"
				},
				
				{
					"flags" : "  --target=aarch64-none-linux-android24 --gcc-toolchain=C:/Users/olivi/AppData/Local/Android/Sdk/ndk-bundle/toolchains/llvm/prebuilt/windows-x86_64 --sysroot=C:/Users/olivi/AppData/Local/Android/Sdk/ndk-bundle/toolchains/llvm/prebuilt/windows-x86_64/sysroot  -Dnative_lib_EXPORTS -IC:\\Users\\olivi\\AppData\\Local\\Android\\Sdk\\ndk-bundle\\sources\\android\\native_app_glue  -g -DANDROID -fdata-sections -ffunction-sections -funwind-tables -fstack-protector-strong -no-canonical-prefixes -fno-addrsig -Wa,--noexecstack -Wformat -Werror=format-security  -std=c++14 -fexceptions -frtti -Werror -IC:\\Users\\olivi\\Documents\\wondavr\\wvrmobile\\app\\src\\main\\cpp -IC:\\Users\\olivi\\Documents\\wondavr\\wvrmobile\\app\\src\\main\\cpp\\vrb\\include  -IC:\\Users\\olivi\\Documents\\wondavr\\wvrmobile\\third_party\\ovr_mobile\\VrApi\\Include -IC:\\Users\\olivi\\Documents\\wondavr\\wvrmobile\\third_party\\OVRPlatformSDK\\Include -IC:\\Users\\olivi\\Documents\\wondavr\\wvrmobile\\app\\src\\oculusvr\\cpp -DOCULUSVR -DSTORE_BUILD=1 -O0 -fno-limit-debug-info  -fPIC    -c ",
					"src" : "C:/Users/olivi/Documents/wondavr/wvrmobile/app/src/main/cpp/VRLayerNode.cpp",
					"workingDirectory" : "C:/Users/olivi/Documents/wondavr/wvrmobile/app/.cxx/cmake/oculusvr3dofStoreArm64Debug/arm64-v8a"
				},
				
				{
					"flags" : "  --target=aarch64-none-linux-android24 --gcc-toolchain=C:/Users/olivi/AppData/Local/Android/Sdk/ndk-bundle/toolchains/llvm/prebuilt/windows-x86_64 --sysroot=C:/Users/olivi/AppData/Local/Android/Sdk/ndk-bundle/toolchains/llvm/prebuilt/windows-x86_64/sysroot  -Dnative_lib_EXPORTS -IC:\\Users\\olivi\\AppData\\Local\\Android\\Sdk\\ndk-bundle\\sources\\android\\native_app_glue  -g -DANDROID -fdata-sections -ffunction-sections -funwind-tables -fstack-protector-strong -no-canonical-prefixes -fno-addrsig -Wa,--noexecstack -Wformat -Werror=format-security  -std=c++14 -fexceptions -frtti -Werror -IC:\\Users\\olivi\\Documents\\wondavr\\wvrmobile\\app\\src\\main\\cpp -IC:\\Users\\olivi\\Documents\\wondavr\\wvrmobile\\app\\src\\main\\cpp\\vrb\\include  -IC:\\Users\\olivi\\Documents\\wondavr\\wvrmobile\\third_party\\ovr_mobile\\VrApi\\Include -IC:\\Users\\olivi\\Documents\\wondavr\\wvrmobile\\third_party\\OVRPlatformSDK\\Include -IC:\\Users\\olivi\\Documents\\wondavr\\wvrmobile\\app\\src\\oculusvr\\cpp -DOCULUSVR -DSTORE_BUILD=1 -O0 -fno-limit-debug-info  -fPIC    -c ",
					"src" : "C:/Users/olivi/Documents/wondavr/wvrmobile/app/src/main/cpp/Widget.cpp",
					"workingDirectory" : "C:/Users/olivi/Documents/wondavr/wvrmobile/app/.cxx/cmake/oculusvr3dofStoreArm64Debug/arm64-v8a"
				},
				
				{
					"flags" : "  --target=aarch64-none-linux-android24 --gcc-toolchain=C:/Users/olivi/AppData/Local/Android/Sdk/ndk-bundle/toolchains/llvm/prebuilt/windows-x86_64 --sysroot=C:/Users/olivi/AppData/Local/Android/Sdk/ndk-bundle/toolchains/llvm/prebuilt/windows-x86_64/sysroot  -Dnative_lib_EXPORTS -IC:\\Users\\olivi\\AppData\\Local\\Android\\Sdk\\ndk-bundle\\sources\\android\\native_app_glue  -g -DANDROID -fdata-sections -ffunction-sections -funwind-tables -fstack-protector-strong -no-canonical-prefixes -fno-addrsig -Wa,--noexecstack -Wformat -Werror=format-security  -std=c++14 -fexceptions -frtti -Werror -IC:\\Users\\olivi\\Documents\\wondavr\\wvrmobile\\app\\src\\main\\cpp -IC:\\Users\\olivi\\Documents\\wondavr\\wvrmobile\\app\\src\\main\\cpp\\vrb\\include  -IC:\\Users\\olivi\\Documents\\wondavr\\wvrmobile\\third_party\\ovr_mobile\\VrApi\\Include -IC:\\Users\\olivi\\Documents\\wondavr\\wvrmobile\\third_party\\OVRPlatformSDK\\Include -IC:\\Users\\olivi\\Documents\\wondavr\\wvrmobile\\app\\src\\oculusvr\\cpp -DOCULUSVR -DSTORE_BUILD=1 -O0 -fno-limit-debug-info  -fPIC    -c ",
					"src" : "C:/Users/olivi/Documents/wondavr/wvrmobile/app/src/main/cpp/WidgetBorder.cpp",
					"workingDirectory" : "C:/Users/olivi/Documents/wondavr/wvrmobile/app/.cxx/cmake/oculusvr3dofStoreArm64Debug/arm64-v8a"
				},
				
				{
					"flags" : "  --target=aarch64-none-linux-android24 --gcc-toolchain=C:/Users/olivi/AppData/Local/Android/Sdk/ndk-bundle/toolchains/llvm/prebuilt/windows-x86_64 --sysroot=C:/Users/olivi/AppData/Local/Android/Sdk/ndk-bundle/toolchains/llvm/prebuilt/windows-x86_64/sysroot  -Dnative_lib_EXPORTS -IC:\\Users\\olivi\\AppData\\Local\\Android\\Sdk\\ndk-bundle\\sources\\android\\native_app_glue  -g -DANDROID -fdata-sections -ffunction-sections -funwind-tables -fstack-protector-strong -no-canonical-prefixes -fno-addrsig -Wa,--noexecstack -Wformat -Werror=format-security  -std=c++14 -fexceptions -frtti -Werror -IC:\\Users\\olivi\\Documents\\wondavr\\wvrmobile\\app\\src\\main\\cpp -IC:\\Users\\olivi\\Documents\\wondavr\\wvrmobile\\app\\src\\main\\cpp\\vrb\\include  -IC:\\Users\\olivi\\Documents\\wondavr\\wvrmobile\\third_party\\ovr_mobile\\VrApi\\Include -IC:\\Users\\olivi\\Documents\\wondavr\\wvrmobile\\third_party\\OVRPlatformSDK\\Include -IC:\\Users\\olivi\\Documents\\wondavr\\wvrmobile\\app\\src\\oculusvr\\cpp -DOCULUSVR -DSTORE_BUILD=1 -O0 -fno-limit-debug-info  -fPIC    -c ",
					"src" : "C:/Users/olivi/Documents/wondavr/wvrmobile/app/src/main/cpp/WidgetMover.cpp",
					"workingDirectory" : "C:/Users/olivi/Documents/wondavr/wvrmobile/app/.cxx/cmake/oculusvr3dofStoreArm64Debug/arm64-v8a"
				},
				
				{
					"flags" : "  --target=aarch64-none-linux-android24 --gcc-toolchain=C:/Users/olivi/AppData/Local/Android/Sdk/ndk-bundle/toolchains/llvm/prebuilt/windows-x86_64 --sysroot=C:/Users/olivi/AppData/Local/Android/Sdk/ndk-bundle/toolchains/llvm/prebuilt/windows-x86_64/sysroot  -Dnative_lib_EXPORTS -IC:\\Users\\olivi\\AppData\\Local\\Android\\Sdk\\ndk-bundle\\sources\\android\\native_app_glue  -g -DANDROID -fdata-sections -ffunction-sections -funwind-tables -fstack-protector-strong -no-canonical-prefixes -fno-addrsig -Wa,--noexecstack -Wformat -Werror=format-security  -std=c++14 -fexceptions -frtti -Werror -IC:\\Users\\olivi\\Documents\\wondavr\\wvrmobile\\app\\src\\main\\cpp -IC:\\Users\\olivi\\Documents\\wondavr\\wvrmobile\\app\\src\\main\\cpp\\vrb\\include  -IC:\\Users\\olivi\\Documents\\wondavr\\wvrmobile\\third_party\\ovr_mobile\\VrApi\\Include -IC:\\Users\\olivi\\Documents\\wondavr\\wvrmobile\\third_party\\OVRPlatformSDK\\Include -IC:\\Users\\olivi\\Documents\\wondavr\\wvrmobile\\app\\src\\oculusvr\\cpp -DOCULUSVR -DSTORE_BUILD=1 -O0 -fno-limit-debug-info  -fPIC    -c ",
					"src" : "C:/Users/olivi/Documents/wondavr/wvrmobile/app/src/main/cpp/WidgetPlacement.cpp",
					"workingDirectory" : "C:/Users/olivi/Documents/wondavr/wvrmobile/app/.cxx/cmake/oculusvr3dofStoreArm64Debug/arm64-v8a"
				},
				
				{
					"flags" : "  --target=aarch64-none-linux-android24 --gcc-toolchain=C:/Users/olivi/AppData/Local/Android/Sdk/ndk-bundle/toolchains/llvm/prebuilt/windows-x86_64 --sysroot=C:/Users/olivi/AppData/Local/Android/Sdk/ndk-bundle/toolchains/llvm/prebuilt/windows-x86_64/sysroot  -Dnative_lib_EXPORTS -IC:\\Users\\olivi\\AppData\\Local\\Android\\Sdk\\ndk-bundle\\sources\\android\\native_app_glue  -g -DANDROID -fdata-sections -ffunction-sections -funwind-tables -fstack-protector-strong -no-canonical-prefixes -fno-addrsig -Wa,--noexecstack -Wformat -Werror=format-security  -std=c++14 -fexceptions -frtti -Werror -IC:\\Users\\olivi\\Documents\\wondavr\\wvrmobile\\app\\src\\main\\cpp -IC:\\Users\\olivi\\Documents\\wondavr\\wvrmobile\\app\\src\\main\\cpp\\vrb\\include  -IC:\\Users\\olivi\\Documents\\wondavr\\wvrmobile\\third_party\\ovr_mobile\\VrApi\\Include -IC:\\Users\\olivi\\Documents\\wondavr\\wvrmobile\\third_party\\OVRPlatformSDK\\Include -IC:\\Users\\olivi\\Documents\\wondavr\\wvrmobile\\app\\src\\oculusvr\\cpp -DOCULUSVR -DSTORE_BUILD=1 -O0 -fno-limit-debug-info  -fPIC    -c ",
					"src" : "C:/Users/olivi/Documents/wondavr/wvrmobile/app/src/main/cpp/WidgetResizer.cpp",
					"workingDirectory" : "C:/Users/olivi/Documents/wondavr/wvrmobile/app/.cxx/cmake/oculusvr3dofStoreArm64Debug/arm64-v8a"
				},
				
				{
					"flags" : "  --target=aarch64-none-linux-android24 --gcc-toolchain=C:/Users/olivi/AppData/Local/Android/Sdk/ndk-bundle/toolchains/llvm/prebuilt/windows-x86_64 --sysroot=C:/Users/olivi/AppData/Local/Android/Sdk/ndk-bundle/toolchains/llvm/prebuilt/windows-x86_64/sysroot  -Dnative_lib_EXPORTS -IC:\\Users\\olivi\\AppData\\Local\\Android\\Sdk\\ndk-bundle\\sources\\android\\native_app_glue  -g -DANDROID -fdata-sections -ffunction-sections -funwind-tables -fstack-protector-strong -no-canonical-prefixes -fno-addrsig -Wa,--noexecstack -Wformat -Werror=format-security  -std=c++14 -fexceptions -frtti -Werror -IC:\\Users\\olivi\\Documents\\wondavr\\wvrmobile\\app\\src\\main\\cpp -IC:\\Users\\olivi\\Documents\\wondavr\\wvrmobile\\app\\src\\main\\cpp\\vrb\\include  -IC:\\Users\\olivi\\Documents\\wondavr\\wvrmobile\\third_party\\ovr_mobile\\VrApi\\Include -IC:\\Users\\olivi\\Documents\\wondavr\\wvrmobile\\third_party\\OVRPlatformSDK\\Include -IC:\\Users\\olivi\\Documents\\wondavr\\wvrmobile\\app\\src\\oculusvr\\cpp -DOCULUSVR -DSTORE_BUILD=1 -O0 -fno-limit-debug-info  -fPIC    -c ",
					"src" : "C:/Users/olivi/Documents/wondavr/wvrmobile/app/src/main/cpp/native-lib.cpp",
					"workingDirectory" : "C:/Users/olivi/Documents/wondavr/wvrmobile/app/.cxx/cmake/oculusvr3dofStoreArm64Debug/arm64-v8a"
				},
				
				{
					"flags" : "  --target=aarch64-none-linux-android24 --gcc-toolchain=C:/Users/olivi/AppData/Local/Android/Sdk/ndk-bundle/toolchains/llvm/prebuilt/windows-x86_64 --sysroot=C:/Users/olivi/AppData/Local/Android/Sdk/ndk-bundle/toolchains/llvm/prebuilt/windows-x86_64/sysroot  -Dnative_lib_EXPORTS -IC:\\Users\\olivi\\AppData\\Local\\Android\\Sdk\\ndk-bundle\\sources\\android\\native_app_glue  -g -DANDROID -fdata-sections -ffunction-sections -funwind-tables -fstack-protector-strong -no-canonical-prefixes -fno-addrsig -Wa,--noexecstack -Wformat -Werror=format-security  -std=c++14 -fexceptions -frtti -Werror -IC:\\Users\\olivi\\Documents\\wondavr\\wvrmobile\\app\\src\\main\\cpp -IC:\\Users\\olivi\\Documents\\wondavr\\wvrmobile\\app\\src\\main\\cpp\\vrb\\include  -IC:\\Users\\olivi\\Documents\\wondavr\\wvrmobile\\third_party\\ovr_mobile\\VrApi\\Include -IC:\\Users\\olivi\\Documents\\wondavr\\wvrmobile\\third_party\\OVRPlatformSDK\\Include -IC:\\Users\\olivi\\Documents\\wondavr\\wvrmobile\\app\\src\\oculusvr\\cpp -DOCULUSVR -DSTORE_BUILD=1 -O0 -fno-limit-debug-info  -fPIC    -c ",
					"src" : "C:/Users/olivi/Documents/wondavr/wvrmobile/app/src/main/cpp/BrowserEGLContext.cpp",
					"workingDirectory" : "C:/Users/olivi/Documents/wondavr/wvrmobile/app/.cxx/cmake/oculusvr3dofStoreArm64Debug/arm64-v8a"
				},
				
				{
					"flags" : "  --target=aarch64-none-linux-android24 --gcc-toolchain=C:/Users/olivi/AppData/Local/Android/Sdk/ndk-bundle/toolchains/llvm/prebuilt/windows-x86_64 --sysroot=C:/Users/olivi/AppData/Local/Android/Sdk/ndk-bundle/toolchains/llvm/prebuilt/windows-x86_64/sysroot  -Dnative_lib_EXPORTS -IC:\\Users\\olivi\\AppData\\Local\\Android\\Sdk\\ndk-bundle\\sources\\android\\native_app_glue  -g -DANDROID -fdata-sections -ffunction-sections -funwind-tables -fstack-protector-strong -no-canonical-prefixes -fno-addrsig -Wa,--noexecstack -Wformat -Werror=format-security  -std=c++14 -fexceptions -frtti -Werror -IC:\\Users\\olivi\\Documents\\wondavr\\wvrmobile\\app\\src\\main\\cpp -IC:\\Users\\olivi\\Documents\\wondavr\\wvrmobile\\app\\src\\main\\cpp\\vrb\\include  -IC:\\Users\\olivi\\Documents\\wondavr\\wvrmobile\\third_party\\ovr_mobile\\VrApi\\Include -IC:\\Users\\olivi\\Documents\\wondavr\\wvrmobile\\third_party\\OVRPlatformSDK\\Include -IC:\\Users\\olivi\\Documents\\wondavr\\wvrmobile\\app\\src\\oculusvr\\cpp -DOCULUSVR -DSTORE_BUILD=1 -O0 -fno-limit-debug-info  -fPIC    -c ",
					"src" : "C:/Users/olivi/Documents/wondavr/wvrmobile/app/src/oculusvr/cpp/DeviceDelegateOculusVR.cpp",
					"workingDirectory" : "C:/Users/olivi/Documents/wondavr/wvrmobile/app/.cxx/cmake/oculusvr3dofStoreArm64Debug/arm64-v8a"
				}
			],
			"output" : "C:/Users/olivi/Documents/wondavr/wvrmobile/app/build/intermediates/cmake/oculusvr3dofStoreArm64Debug/obj/arm64-v8a/libnative-lib.so",
			"toolchain" : "2895662125"
		},
		"native_app_glue-Debug-arm64-v8a" : 
		{
			"abi" : "arm64-v8a",
			"artifactName" : "native_app_glue",
			"buildCommand" : "C:\\Users\\olivi\\AppData\\Local\\Android\\Sdk\\cmake\\3.6.4111459\\bin\\cmake.exe --build C:\\Users\\olivi\\Documents\\wondavr\\wvrmobile\\app\\.cxx\\cmake\\oculusvr3dofStoreArm64Debug\\arm64-v8a --target native_app_glue",
			"buildType" : "debug",
			"files" : 
			[
				
				{
					"flags" : "  --target=aarch64-none-linux-android24 --gcc-toolchain=C:/Users/olivi/AppData/Local/Android/Sdk/ndk-bundle/toolchains/llvm/prebuilt/windows-x86_64 --sysroot=C:/Users/olivi/AppData/Local/Android/Sdk/ndk-bundle/toolchains/llvm/prebuilt/windows-x86_64/sysroot  -IC:\\Users\\olivi\\AppData\\Local\\Android\\Sdk\\ndk-bundle\\sources\\android\\native_app_glue  -g -DANDROID -fdata-sections -ffunction-sections -funwind-tables -fstack-protector-strong -no-canonical-prefixes -fno-addrsig -Wa,--noexecstack -Wformat -Werror=format-security  -O0 -fno-limit-debug-info  -fPIC      -c ",
					"src" : "C:/Users/olivi/AppData/Local/Android/Sdk/ndk-bundle/sources/android/native_app_glue/android_native_app_glue.c",
					"workingDirectory" : "C:/Users/olivi/Documents/wondavr/wvrmobile/app/.cxx/cmake/oculusvr3dofStoreArm64Debug/arm64-v8a"
				}
			],
			"output" : "C:/Users/olivi/Documents/wondavr/wvrmobile/app/.cxx/cmake/oculusvr3dofStoreArm64Debug/arm64-v8a/libnative_app_glue.a",
			"toolchain" : "2895662125"
		},
		"oculusvr-lib-Debug-arm64-v8a" : 
		{
			"abi" : "arm64-v8a",
			"artifactName" : "oculusvr-lib",
			"buildType" : "debug",
			"output" : "C:/Users/olivi/Documents/wondavr/wvrmobile/app/../third_party/ovr_mobile/VrApi/Libs/Android/arm64-v8a/Release/libvrapi.so",
			"toolchain" : "2895662125"
		},
		"ovrplatform-lib-Debug-arm64-v8a" : 
		{
			"abi" : "arm64-v8a",
			"artifactName" : "ovrplatform-lib",
			"buildType" : "debug",
			"output" : "C:/Users/olivi/Documents/wondavr/wvrmobile/app/../third_party/OVRPlatformSDK/Android/libs/arm64-v8a/libovrplatformloader.so",
			"toolchain" : "2895662125"
		},
		"svr-lib-Debug-arm64-v8a" : 
		{
			"abi" : "arm64-v8a",
			"artifactName" : "svr-lib",
			"buildType" : "debug",
			"output" : "C:/Users/olivi/Documents/wondavr/wvrmobile/app/../third_party/svr/libs/arm64-v8a/libsvrapi.so",
			"toolchain" : "2895662125"
		},
		"vrb-Debug-arm64-v8a" : 
		{
			"abi" : "arm64-v8a",
			"artifactName" : "vrb",
			"buildCommand" : "C:\\Users\\olivi\\AppData\\Local\\Android\\Sdk\\cmake\\3.6.4111459\\bin\\cmake.exe --build C:\\Users\\olivi\\Documents\\wondavr\\wvrmobile\\app\\.cxx\\cmake\\oculusvr3dofStoreArm64Debug\\arm64-v8a --target vrb",
			"buildType" : "debug",
			"files" : 
			[
				
				{
					"flags" : "  --target=aarch64-none-linux-android24 --gcc-toolchain=C:/Users/olivi/AppData/Local/Android/Sdk/ndk-bundle/toolchains/llvm/prebuilt/windows-x86_64 --sysroot=C:/Users/olivi/AppData/Local/Android/Sdk/ndk-bundle/toolchains/llvm/prebuilt/windows-x86_64/sysroot   -I..\\..\\..\\..\\src\\main\\cpp\\vrb\\src\\..\\include  -g -DANDROID -fdata-sections -ffunction-sections -funwind-tables -fstack-protector-strong -no-canonical-prefixes -fno-addrsig -Wa,--noexecstack -Wformat -Werror=format-security  -std=c++14 -fexceptions -frtti -Werror -IC:\\Users\\olivi\\Documents\\wondavr\\wvrmobile\\app\\src\\main\\cpp -IC:\\Users\\olivi\\Documents\\wondavr\\wvrmobile\\app\\src\\main\\cpp\\vrb\\include  -IC:\\Users\\olivi\\Documents\\wondavr\\wvrmobile\\third_party\\ovr_mobile\\VrApi\\Include -IC:\\Users\\olivi\\Documents\\wondavr\\wvrmobile\\third_party\\OVRPlatformSDK\\Include -IC:\\Users\\olivi\\Documents\\wondavr\\wvrmobile\\app\\src\\oculusvr\\cpp -DOCULUSVR -DSTORE_BUILD=1 -O0 -fno-limit-debug-info  -fPIC    -c ",
					"src" : "C:/Users/olivi/Documents/wondavr/wvrmobile/app/src/main/cpp/vrb/src/CameraEye.cpp",
					"workingDirectory" : "C:/Users/olivi/Documents/wondavr/wvrmobile/app/.cxx/cmake/oculusvr3dofStoreArm64Debug/arm64-v8a"
				},
				
				{
					"flags" : "  --target=aarch64-none-linux-android24 --gcc-toolchain=C:/Users/olivi/AppData/Local/Android/Sdk/ndk-bundle/toolchains/llvm/prebuilt/windows-x86_64 --sysroot=C:/Users/olivi/AppData/Local/Android/Sdk/ndk-bundle/toolchains/llvm/prebuilt/windows-x86_64/sysroot   -I..\\..\\..\\..\\src\\main\\cpp\\vrb\\src\\..\\include  -g -DANDROID -fdata-sections -ffunction-sections -funwind-tables -fstack-protector-strong -no-canonical-prefixes -fno-addrsig -Wa,--noexecstack -Wformat -Werror=format-security  -std=c++14 -fexceptions -frtti -Werror -IC:\\Users\\olivi\\Documents\\wondavr\\wvrmobile\\app\\src\\main\\cpp -IC:\\Users\\olivi\\Documents\\wondavr\\wvrmobile\\app\\src\\main\\cpp\\vrb\\include  -IC:\\Users\\olivi\\Documents\\wondavr\\wvrmobile\\third_party\\ovr_mobile\\VrApi\\Include -IC:\\Users\\olivi\\Documents\\wondavr\\wvrmobile\\third_party\\OVRPlatformSDK\\Include -IC:\\Users\\olivi\\Documents\\wondavr\\wvrmobile\\app\\src\\oculusvr\\cpp -DOCULUSVR -DSTORE_BUILD=1 -O0 -fno-limit-debug-info  -fPIC    -c ",
					"src" : "C:/Users/olivi/Documents/wondavr/wvrmobile/app/src/main/cpp/vrb/src/CameraSimple.cpp",
					"workingDirectory" : "C:/Users/olivi/Documents/wondavr/wvrmobile/app/.cxx/cmake/oculusvr3dofStoreArm64Debug/arm64-v8a"
				},
				
				{
					"flags" : "  --target=aarch64-none-linux-android24 --gcc-toolchain=C:/Users/olivi/AppData/Local/Android/Sdk/ndk-bundle/toolchains/llvm/prebuilt/windows-x86_64 --sysroot=C:/Users/olivi/AppData/Local/Android/Sdk/ndk-bundle/toolchains/llvm/prebuilt/windows-x86_64/sysroot   -I..\\..\\..\\..\\src\\main\\cpp\\vrb\\src\\..\\include  -g -DANDROID -fdata-sections -ffunction-sections -funwind-tables -fstack-protector-strong -no-canonical-prefixes -fno-addrsig -Wa,--noexecstack -Wformat -Werror=format-security  -std=c++14 -fexceptions -frtti -Werror -IC:\\Users\\olivi\\Documents\\wondavr\\wvrmobile\\app\\src\\main\\cpp -IC:\\Users\\olivi\\Documents\\wondavr\\wvrmobile\\app\\src\\main\\cpp\\vrb\\include  -IC:\\Users\\olivi\\Documents\\wondavr\\wvrmobile\\third_party\\ovr_mobile\\VrApi\\Include -IC:\\Users\\olivi\\Documents\\wondavr\\wvrmobile\\third_party\\OVRPlatformSDK\\Include -IC:\\Users\\olivi\\Documents\\wondavr\\wvrmobile\\app\\src\\oculusvr\\cpp -DOCULUSVR -DSTORE_BUILD=1 -O0 -fno-limit-debug-info  -fPIC    -c ",
					"src" : "C:/Users/olivi/Documents/wondavr/wvrmobile/app/src/main/cpp/vrb/src/ContextSynchronizer.cpp",
					"workingDirectory" : "C:/Users/olivi/Documents/wondavr/wvrmobile/app/.cxx/cmake/oculusvr3dofStoreArm64Debug/arm64-v8a"
				},
				
				{
					"flags" : "  --target=aarch64-none-linux-android24 --gcc-toolchain=C:/Users/olivi/AppData/Local/Android/Sdk/ndk-bundle/toolchains/llvm/prebuilt/windows-x86_64 --sysroot=C:/Users/olivi/AppData/Local/Android/Sdk/ndk-bundle/toolchains/llvm/prebuilt/windows-x86_64/sysroot   -I..\\..\\..\\..\\src\\main\\cpp\\vrb\\src\\..\\include  -g -DANDROID -fdata-sections -ffunction-sections -funwind-tables -fstack-protector-strong -no-canonical-prefixes -fno-addrsig -Wa,--noexecstack -Wformat -Werror=format-security  -std=c++14 -fexceptions -frtti -Werror -IC:\\Users\\olivi\\Documents\\wondavr\\wvrmobile\\app\\src\\main\\cpp -IC:\\Users\\olivi\\Documents\\wondavr\\wvrmobile\\app\\src\\main\\cpp\\vrb\\include  -IC:\\Users\\olivi\\Documents\\wondavr\\wvrmobile\\third_party\\ovr_mobile\\VrApi\\Include -IC:\\Users\\olivi\\Documents\\wondavr\\wvrmobile\\third_party\\OVRPlatformSDK\\Include -IC:\\Users\\olivi\\Documents\\wondavr\\wvrmobile\\app\\src\\oculusvr\\cpp -DOCULUSVR -DSTORE_BUILD=1 -O0 -fno-limit-debug-info  -fPIC    -c ",
					"src" : "C:/Users/olivi/Documents/wondavr/wvrmobile/app/src/main/cpp/vrb/src/CreationContext.cpp",
					"workingDirectory" : "C:/Users/olivi/Documents/wondavr/wvrmobile/app/.cxx/cmake/oculusvr3dofStoreArm64Debug/arm64-v8a"
				},
				
				{
					"flags" : "  --target=aarch64-none-linux-android24 --gcc-toolchain=C:/Users/olivi/AppData/Local/Android/Sdk/ndk-bundle/toolchains/llvm/prebuilt/windows-x86_64 --sysroot=C:/Users/olivi/AppData/Local/Android/Sdk/ndk-bundle/toolchains/llvm/prebuilt/windows-x86_64/sysroot   -I..\\..\\..\\..\\src\\main\\cpp\\vrb\\src\\..\\include  -g -DANDROID -fdata-sections -ffunction-sections -funwind-tables -fstack-protector-strong -no-canonical-prefixes -fno-addrsig -Wa,--noexecstack -Wformat -Werror=format-security  -std=c++14 -fexceptions -frtti -Werror -IC:\\Users\\olivi\\Documents\\wondavr\\wvrmobile\\app\\src\\main\\cpp -IC:\\Users\\olivi\\Documents\\wondavr\\wvrmobile\\app\\src\\main\\cpp\\vrb\\include  -IC:\\Users\\olivi\\Documents\\wondavr\\wvrmobile\\third_party\\ovr_mobile\\VrApi\\Include -IC:\\Users\\olivi\\Documents\\wondavr\\wvrmobile\\third_party\\OVRPlatformSDK\\Include -IC:\\Users\\olivi\\Documents\\wondavr\\wvrmobile\\app\\src\\oculusvr\\cpp -DOCULUSVR -DSTORE_BUILD=1 -O0 -fno-limit-debug-info  -fPIC    -c ",
					"src" : "C:/Users/olivi/Documents/wondavr/wvrmobile/app/src/main/cpp/vrb/src/CullVisitor.cpp",
					"workingDirectory" : "C:/Users/olivi/Documents/wondavr/wvrmobile/app/.cxx/cmake/oculusvr3dofStoreArm64Debug/arm64-v8a"
				},
				
				{
					"flags" : "  --target=aarch64-none-linux-android24 --gcc-toolchain=C:/Users/olivi/AppData/Local/Android/Sdk/ndk-bundle/toolchains/llvm/prebuilt/windows-x86_64 --sysroot=C:/Users/olivi/AppData/Local/Android/Sdk/ndk-bundle/toolchains/llvm/prebuilt/windows-x86_64/sysroot   -I..\\..\\..\\..\\src\\main\\cpp\\vrb\\src\\..\\include  -g -DANDROID -fdata-sections -ffunction-sections -funwind-tables -fstack-protector-strong -no-canonical-prefixes -fno-addrsig -Wa,--noexecstack -Wformat -Werror=format-security  -std=c++14 -fexceptions -frtti -Werror -IC:\\Users\\olivi\\Documents\\wondavr\\wvrmobile\\app\\src\\main\\cpp -IC:\\Users\\olivi\\Documents\\wondavr\\wvrmobile\\app\\src\\main\\cpp\\vrb\\include  -IC:\\Users\\olivi\\Documents\\wondavr\\wvrmobile\\third_party\\ovr_mobile\\VrApi\\Include -IC:\\Users\\olivi\\Documents\\wondavr\\wvrmobile\\third_party\\OVRPlatformSDK\\Include -IC:\\Users\\olivi\\Documents\\wondavr\\wvrmobile\\app\\src\\oculusvr\\cpp -DOCULUSVR -DSTORE_BUILD=1 -O0 -fno-limit-debug-info  -fPIC    -c ",
					"src" : "C:/Users/olivi/Documents/wondavr/wvrmobile/app/src/main/cpp/vrb/src/DataCache.cpp",
					"workingDirectory" : "C:/Users/olivi/Documents/wondavr/wvrmobile/app/.cxx/cmake/oculusvr3dofStoreArm64Debug/arm64-v8a"
				},
				
				{
					"flags" : "  --target=aarch64-none-linux-android24 --gcc-toolchain=C:/Users/olivi/AppData/Local/Android/Sdk/ndk-bundle/toolchains/llvm/prebuilt/windows-x86_64 --sysroot=C:/Users/olivi/AppData/Local/Android/Sdk/ndk-bundle/toolchains/llvm/prebuilt/windows-x86_64/sysroot   -I..\\..\\..\\..\\src\\main\\cpp\\vrb\\src\\..\\include  -g -DANDROID -fdata-sections -ffunction-sections -funwind-tables -fstack-protector-strong -no-canonical-prefixes -fno-addrsig -Wa,--noexecstack -Wformat -Werror=format-security  -std=c++14 -fexceptions -frtti -Werror -IC:\\Users\\olivi\\Documents\\wondavr\\wvrmobile\\app\\src\\main\\cpp -IC:\\Users\\olivi\\Documents\\wondavr\\wvrmobile\\app\\src\\main\\cpp\\vrb\\include  -IC:\\Users\\olivi\\Documents\\wondavr\\wvrmobile\\third_party\\ovr_mobile\\VrApi\\Include -IC:\\Users\\olivi\\Documents\\wondavr\\wvrmobile\\third_party\\OVRPlatformSDK\\Include -IC:\\Users\\olivi\\Documents\\wondavr\\wvrmobile\\app\\src\\oculusvr\\cpp -DOCULUSVR -DSTORE_BUILD=1 -O0 -fno-limit-debug-info  -fPIC    -c ",
					"src" : "C:/Users/olivi/Documents/wondavr/wvrmobile/app/src/main/cpp/vrb/src/Drawable.cpp",
					"workingDirectory" : "C:/Users/olivi/Documents/wondavr/wvrmobile/app/.cxx/cmake/oculusvr3dofStoreArm64Debug/arm64-v8a"
				},
				
				{
					"flags" : "  --target=aarch64-none-linux-android24 --gcc-toolchain=C:/Users/olivi/AppData/Local/Android/Sdk/ndk-bundle/toolchains/llvm/prebuilt/windows-x86_64 --sysroot=C:/Users/olivi/AppData/Local/Android/Sdk/ndk-bundle/toolchains/llvm/prebuilt/windows-x86_64/sysroot   -I..\\..\\..\\..\\src\\main\\cpp\\vrb\\src\\..\\include  -g -DANDROID -fdata-sections -ffunction-sections -funwind-tables -fstack-protector-strong -no-canonical-prefixes -fno-addrsig -Wa,--noexecstack -Wformat -Werror=format-security  -std=c++14 -fexceptions -frtti -Werror -IC:\\Users\\olivi\\Documents\\wondavr\\wvrmobile\\app\\src\\main\\cpp -IC:\\Users\\olivi\\Documents\\wondavr\\wvrmobile\\app\\src\\main\\cpp\\vrb\\include  -IC:\\Users\\olivi\\Documents\\wondavr\\wvrmobile\\third_party\\ovr_mobile\\VrApi\\Include -IC:\\Users\\olivi\\Documents\\wondavr\\wvrmobile\\third_party\\OVRPlatformSDK\\Include -IC:\\Users\\olivi\\Documents\\wondavr\\wvrmobile\\app\\src\\oculusvr\\cpp -DOCULUSVR -DSTORE_BUILD=1 -O0 -fno-limit-debug-info  -fPIC    -c ",
					"src" : "C:/Users/olivi/Documents/wondavr/wvrmobile/app/src/main/cpp/vrb/src/DrawableList.cpp",
					"workingDirectory" : "C:/Users/olivi/Documents/wondavr/wvrmobile/app/.cxx/cmake/oculusvr3dofStoreArm64Debug/arm64-v8a"
				},
				
				{
					"flags" : "  --target=aarch64-none-linux-android24 --gcc-toolchain=C:/Users/olivi/AppData/Local/Android/Sdk/ndk-bundle/toolchains/llvm/prebuilt/windows-x86_64 --sysroot=C:/Users/olivi/AppData/Local/Android/Sdk/ndk-bundle/toolchains/llvm/prebuilt/windows-x86_64/sysroot   -I..\\..\\..\\..\\src\\main\\cpp\\vrb\\src\\..\\include  -g -DANDROID -fdata-sections -ffunction-sections -funwind-tables -fstack-protector-strong -no-canonical-prefixes -fno-addrsig -Wa,--noexecstack -Wformat -Werror=format-security  -std=c++14 -fexceptions -frtti -Werror -IC:\\Users\\olivi\\Documents\\wondavr\\wvrmobile\\app\\src\\main\\cpp -IC:\\Users\\olivi\\Documents\\wondavr\\wvrmobile\\app\\src\\main\\cpp\\vrb\\include  -IC:\\Users\\olivi\\Documents\\wondavr\\wvrmobile\\third_party\\ovr_mobile\\VrApi\\Include -IC:\\Users\\olivi\\Documents\\wondavr\\wvrmobile\\third_party\\OVRPlatformSDK\\Include -IC:\\Users\\olivi\\Documents\\wondavr\\wvrmobile\\app\\src\\oculusvr\\cpp -DOCULUSVR -DSTORE_BUILD=1 -O0 -fno-limit-debug-info  -fPIC    -c ",
					"src" : "C:/Users/olivi/Documents/wondavr/wvrmobile/app/src/main/cpp/vrb/src/FBO.cpp",
					"workingDirectory" : "C:/Users/olivi/Documents/wondavr/wvrmobile/app/.cxx/cmake/oculusvr3dofStoreArm64Debug/arm64-v8a"
				},
				
				{
					"flags" : "  --target=aarch64-none-linux-android24 --gcc-toolchain=C:/Users/olivi/AppData/Local/Android/Sdk/ndk-bundle/toolchains/llvm/prebuilt/windows-x86_64 --sysroot=C:/Users/olivi/AppData/Local/Android/Sdk/ndk-bundle/toolchains/llvm/prebuilt/windows-x86_64/sysroot   -I..\\..\\..\\..\\src\\main\\cpp\\vrb\\src\\..\\include  -g -DANDROID -fdata-sections -ffunction-sections -funwind-tables -fstack-protector-strong -no-canonical-prefixes -fno-addrsig -Wa,--noexecstack -Wformat -Werror=format-security  -std=c++14 -fexceptions -frtti -Werror -IC:\\Users\\olivi\\Documents\\wondavr\\wvrmobile\\app\\src\\main\\cpp -IC:\\Users\\olivi\\Documents\\wondavr\\wvrmobile\\app\\src\\main\\cpp\\vrb\\include  -IC:\\Users\\olivi\\Documents\\wondavr\\wvrmobile\\third_party\\ovr_mobile\\VrApi\\Include -IC:\\Users\\olivi\\Documents\\wondavr\\wvrmobile\\third_party\\OVRPlatformSDK\\Include -IC:\\Users\\olivi\\Documents\\wondavr\\wvrmobile\\app\\src\\oculusvr\\cpp -DOCULUSVR -DSTORE_BUILD=1 -O0 -fno-limit-debug-info  -fPIC    -c ",
					"src" : "C:/Users/olivi/Documents/wondavr/wvrmobile/app/src/main/cpp/vrb/src/GLError.cpp",
					"workingDirectory" : "C:/Users/olivi/Documents/wondavr/wvrmobile/app/.cxx/cmake/oculusvr3dofStoreArm64Debug/arm64-v8a"
				},
				
				{
					"flags" : "  --target=aarch64-none-linux-android24 --gcc-toolchain=C:/Users/olivi/AppData/Local/Android/Sdk/ndk-bundle/toolchains/llvm/prebuilt/windows-x86_64 --sysroot=C:/Users/olivi/AppData/Local/Android/Sdk/ndk-bundle/toolchains/llvm/prebuilt/windows-x86_64/sysroot   -I..\\..\\..\\..\\src\\main\\cpp\\vrb\\src\\..\\include  -g -DANDROID -fdata-sections -ffunction-sections -funwind-tables -fstack-protector-strong -no-canonical-prefixes -fno-addrsig -Wa,--noexecstack -Wformat -Werror=format-security  -std=c++14 -fexceptions -frtti -Werror -IC:\\Users\\olivi\\Documents\\wondavr\\wvrmobile\\app\\src\\main\\cpp -IC:\\Users\\olivi\\Documents\\wondavr\\wvrmobile\\app\\src\\main\\cpp\\vrb\\include  -IC:\\Users\\olivi\\Documents\\wondavr\\wvrmobile\\third_party\\ovr_mobile\\VrApi\\Include -IC:\\Users\\olivi\\Documents\\wondavr\\wvrmobile\\third_party\\OVRPlatformSDK\\Include -IC:\\Users\\olivi\\Documents\\wondavr\\wvrmobile\\app\\src\\oculusvr\\cpp -DOCULUSVR -DSTORE_BUILD=1 -O0 -fno-limit-debug-info  -fPIC    -c ",
					"src" : "C:/Users/olivi/Documents/wondavr/wvrmobile/app/src/main/cpp/vrb/src/GLExtensions.cpp",
					"workingDirectory" : "C:/Users/olivi/Documents/wondavr/wvrmobile/app/.cxx/cmake/oculusvr3dofStoreArm64Debug/arm64-v8a"
				},
				
				{
					"flags" : "  --target=aarch64-none-linux-android24 --gcc-toolchain=C:/Users/olivi/AppData/Local/Android/Sdk/ndk-bundle/toolchains/llvm/prebuilt/windows-x86_64 --sysroot=C:/Users/olivi/AppData/Local/Android/Sdk/ndk-bundle/toolchains/llvm/prebuilt/windows-x86_64/sysroot   -I..\\..\\..\\..\\src\\main\\cpp\\vrb\\src\\..\\include  -g -DANDROID -fdata-sections -ffunction-sections -funwind-tables -fstack-protector-strong -no-canonical-prefixes -fno-addrsig -Wa,--noexecstack -Wformat -Werror=format-security  -std=c++14 -fexceptions -frtti -Werror -IC:\\Users\\olivi\\Documents\\wondavr\\wvrmobile\\app\\src\\main\\cpp -IC:\\Users\\olivi\\Documents\\wondavr\\wvrmobile\\app\\src\\main\\cpp\\vrb\\include  -IC:\\Users\\olivi\\Documents\\wondavr\\wvrmobile\\third_party\\ovr_mobile\\VrApi\\Include -IC:\\Users\\olivi\\Documents\\wondavr\\wvrmobile\\third_party\\OVRPlatformSDK\\Include -IC:\\Users\\olivi\\Documents\\wondavr\\wvrmobile\\app\\src\\oculusvr\\cpp -DOCULUSVR -DSTORE_BUILD=1 -O0 -fno-limit-debug-info  -fPIC    -c ",
					"src" : "C:/Users/olivi/Documents/wondavr/wvrmobile/app/src/main/cpp/vrb/src/Geometry.cpp",
					"workingDirectory" : "C:/Users/olivi/Documents/wondavr/wvrmobile/app/.cxx/cmake/oculusvr3dofStoreArm64Debug/arm64-v8a"
				},
				
				{
					"flags" : "  --target=aarch64-none-linux-android24 --gcc-toolchain=C:/Users/olivi/AppData/Local/Android/Sdk/ndk-bundle/toolchains/llvm/prebuilt/windows-x86_64 --sysroot=C:/Users/olivi/AppData/Local/Android/Sdk/ndk-bundle/toolchains/llvm/prebuilt/windows-x86_64/sysroot   -I..\\..\\..\\..\\src\\main\\cpp\\vrb\\src\\..\\include  -g -DANDROID -fdata-sections -ffunction-sections -funwind-tables -fstack-protector-strong -no-canonical-prefixes -fno-addrsig -Wa,--noexecstack -Wformat -Werror=format-security  -std=c++14 -fexceptions -frtti -Werror -IC:\\Users\\olivi\\Documents\\wondavr\\wvrmobile\\app\\src\\main\\cpp -IC:\\Users\\olivi\\Documents\\wondavr\\wvrmobile\\app\\src\\main\\cpp\\vrb\\include  -IC:\\Users\\olivi\\Documents\\wondavr\\wvrmobile\\third_party\\ovr_mobile\\VrApi\\Include -IC:\\Users\\olivi\\Documents\\wondavr\\wvrmobile\\third_party\\OVRPlatformSDK\\Include -IC:\\Users\\olivi\\Documents\\wondavr\\wvrmobile\\app\\src\\oculusvr\\cpp -DOCULUSVR -DSTORE_BUILD=1 -O0 -fno-limit-debug-info  -fPIC    -c ",
					"src" : "C:/Users/olivi/Documents/wondavr/wvrmobile/app/src/main/cpp/vrb/src/Group.cpp",
					"workingDirectory" : "C:/Users/olivi/Documents/wondavr/wvrmobile/app/.cxx/cmake/oculusvr3dofStoreArm64Debug/arm64-v8a"
				},
				
				{
					"flags" : "  --target=aarch64-none-linux-android24 --gcc-toolchain=C:/Users/olivi/AppData/Local/Android/Sdk/ndk-bundle/toolchains/llvm/prebuilt/windows-x86_64 --sysroot=C:/Users/olivi/AppData/Local/Android/Sdk/ndk-bundle/toolchains/llvm/prebuilt/windows-x86_64/sysroot   -I..\\..\\..\\..\\src\\main\\cpp\\vrb\\src\\..\\include  -g -DANDROID -fdata-sections -ffunction-sections -funwind-tables -fstack-protector-strong -no-canonical-prefixes -fno-addrsig -Wa,--noexecstack -Wformat -Werror=format-security  -std=c++14 -fexceptions -frtti -Werror -IC:\\Users\\olivi\\Documents\\wondavr\\wvrmobile\\app\\src\\main\\cpp -IC:\\Users\\olivi\\Documents\\wondavr\\wvrmobile\\app\\src\\main\\cpp\\vrb\\include  -IC:\\Users\\olivi\\Documents\\wondavr\\wvrmobile\\third_party\\ovr_mobile\\VrApi\\Include -IC:\\Users\\olivi\\Documents\\wondavr\\wvrmobile\\third_party\\OVRPlatformSDK\\Include -IC:\\Users\\olivi\\Documents\\wondavr\\wvrmobile\\app\\src\\oculusvr\\cpp -DOCULUSVR -DSTORE_BUILD=1 -O0 -fno-limit-debug-info  -fPIC    -c ",
					"src" : "C:/Users/olivi/Documents/wondavr/wvrmobile/app/src/main/cpp/vrb/src/Light.cpp",
					"workingDirectory" : "C:/Users/olivi/Documents/wondavr/wvrmobile/app/.cxx/cmake/oculusvr3dofStoreArm64Debug/arm64-v8a"
				},
				
				{
					"flags" : "  --target=aarch64-none-linux-android24 --gcc-toolchain=C:/Users/olivi/AppData/Local/Android/Sdk/ndk-bundle/toolchains/llvm/prebuilt/windows-x86_64 --sysroot=C:/Users/olivi/AppData/Local/Android/Sdk/ndk-bundle/toolchains/llvm/prebuilt/windows-x86_64/sysroot   -I..\\..\\..\\..\\src\\main\\cpp\\vrb\\src\\..\\include  -g -DANDROID -fdata-sections -ffunction-sections -funwind-tables -fstack-protector-strong -no-canonical-prefixes -fno-addrsig -Wa,--noexecstack -Wformat -Werror=format-security  -std=c++14 -fexceptions -frtti -Werror -IC:\\Users\\olivi\\Documents\\wondavr\\wvrmobile\\app\\src\\main\\cpp -IC:\\Users\\olivi\\Documents\\wondavr\\wvrmobile\\app\\src\\main\\cpp\\vrb\\include  -IC:\\Users\\olivi\\Documents\\wondavr\\wvrmobile\\third_party\\ovr_mobile\\VrApi\\Include -IC:\\Users\\olivi\\Documents\\wondavr\\wvrmobile\\third_party\\OVRPlatformSDK\\Include -IC:\\Users\\olivi\\Documents\\wondavr\\wvrmobile\\app\\src\\oculusvr\\cpp -DOCULUSVR -DSTORE_BUILD=1 -O0 -fno-limit-debug-info  -fPIC    -c ",
					"src" : "C:/Users/olivi/Documents/wondavr/wvrmobile/app/src/main/cpp/vrb/src/Node.cpp",
					"workingDirectory" : "C:/Users/olivi/Documents/wondavr/wvrmobile/app/.cxx/cmake/oculusvr3dofStoreArm64Debug/arm64-v8a"
				},
				
				{
					"flags" : "  --target=aarch64-none-linux-android24 --gcc-toolchain=C:/Users/olivi/AppData/Local/Android/Sdk/ndk-bundle/toolchains/llvm/prebuilt/windows-x86_64 --sysroot=C:/Users/olivi/AppData/Local/Android/Sdk/ndk-bundle/toolchains/llvm/prebuilt/windows-x86_64/sysroot   -I..\\..\\..\\..\\src\\main\\cpp\\vrb\\src\\..\\include  -g -DANDROID -fdata-sections -ffunction-sections -funwind-tables -fstack-protector-strong -no-canonical-prefixes -fno-addrsig -Wa,--noexecstack -Wformat -Werror=format-security  -std=c++14 -fexceptions -frtti -Werror -IC:\\Users\\olivi\\Documents\\wondavr\\wvrmobile\\app\\src\\main\\cpp -IC:\\Users\\olivi\\Documents\\wondavr\\wvrmobile\\app\\src\\main\\cpp\\vrb\\include  -IC:\\Users\\olivi\\Documents\\wondavr\\wvrmobile\\third_party\\ovr_mobile\\VrApi\\Include -IC:\\Users\\olivi\\Documents\\wondavr\\wvrmobile\\third_party\\OVRPlatformSDK\\Include -IC:\\Users\\olivi\\Documents\\wondavr\\wvrmobile\\app\\src\\oculusvr\\cpp -DOCULUSVR -DSTORE_BUILD=1 -O0 -fno-limit-debug-info  -fPIC    -c ",
					"src" : "C:/Users/olivi/Documents/wondavr/wvrmobile/app/src/main/cpp/vrb/src/NodeFactoryObj.cpp",
					"workingDirectory" : "C:/Users/olivi/Documents/wondavr/wvrmobile/app/.cxx/cmake/oculusvr3dofStoreArm64Debug/arm64-v8a"
				},
				
				{
					"flags" : "  --target=aarch64-none-linux-android24 --gcc-toolchain=C:/Users/olivi/AppData/Local/Android/Sdk/ndk-bundle/toolchains/llvm/prebuilt/windows-x86_64 --sysroot=C:/Users/olivi/AppData/Local/Android/Sdk/ndk-bundle/toolchains/llvm/prebuilt/windows-x86_64/sysroot   -I..\\..\\..\\..\\src\\main\\cpp\\vrb\\src\\..\\include  -g -DANDROID -fdata-sections -ffunction-sections -funwind-tables -fstack-protector-strong -no-canonical-prefixes -fno-addrsig -Wa,--noexecstack -Wformat -Werror=format-security  -std=c++14 -fexceptions -frtti -Werror -IC:\\Users\\olivi\\Documents\\wondavr\\wvrmobile\\app\\src\\main\\cpp -IC:\\Users\\olivi\\Documents\\wondavr\\wvrmobile\\app\\src\\main\\cpp\\vrb\\include  -IC:\\Users\\olivi\\Documents\\wondavr\\wvrmobile\\third_party\\ovr_mobile\\VrApi\\Include -IC:\\Users\\olivi\\Documents\\wondavr\\wvrmobile\\third_party\\OVRPlatformSDK\\Include -IC:\\Users\\olivi\\Documents\\wondavr\\wvrmobile\\app\\src\\oculusvr\\cpp -DOCULUSVR -DSTORE_BUILD=1 -O0 -fno-limit-debug-info  -fPIC    -c ",
					"src" : "C:/Users/olivi/Documents/wondavr/wvrmobile/app/src/main/cpp/vrb/src/ParserObj.cpp",
					"workingDirectory" : "C:/Users/olivi/Documents/wondavr/wvrmobile/app/.cxx/cmake/oculusvr3dofStoreArm64Debug/arm64-v8a"
				},
				
				{
					"flags" : "  --target=aarch64-none-linux-android24 --gcc-toolchain=C:/Users/olivi/AppData/Local/Android/Sdk/ndk-bundle/toolchains/llvm/prebuilt/windows-x86_64 --sysroot=C:/Users/olivi/AppData/Local/Android/Sdk/ndk-bundle/toolchains/llvm/prebuilt/windows-x86_64/sysroot   -I..\\..\\..\\..\\src\\main\\cpp\\vrb\\src\\..\\include  -g -DANDROID -fdata-sections -ffunction-sections -funwind-tables -fstack-protector-strong -no-canonical-prefixes -fno-addrsig -Wa,--noexecstack -Wformat -Werror=format-security  -std=c++14 -fexceptions -frtti -Werror -IC:\\Users\\olivi\\Documents\\wondavr\\wvrmobile\\app\\src\\main\\cpp -IC:\\Users\\olivi\\Documents\\wondavr\\wvrmobile\\app\\src\\main\\cpp\\vrb\\include  -IC:\\Users\\olivi\\Documents\\wondavr\\wvrmobile\\third_party\\ovr_mobile\\VrApi\\Include -IC:\\Users\\olivi\\Documents\\wondavr\\wvrmobile\\third_party\\OVRPlatformSDK\\Include -IC:\\Users\\olivi\\Documents\\wondavr\\wvrmobile\\app\\src\\oculusvr\\cpp -DOCULUSVR -DSTORE_BUILD=1 -O0 -fno-limit-debug-info  -fPIC    -c ",
					"src" : "C:/Users/olivi/Documents/wondavr/wvrmobile/app/src/main/cpp/vrb/src/PerformanceMonitor.cpp",
					"workingDirectory" : "C:/Users/olivi/Documents/wondavr/wvrmobile/app/.cxx/cmake/oculusvr3dofStoreArm64Debug/arm64-v8a"
				},
				
				{
					"flags" : "  --target=aarch64-none-linux-android24 --gcc-toolchain=C:/Users/olivi/AppData/Local/Android/Sdk/ndk-bundle/toolchains/llvm/prebuilt/windows-x86_64 --sysroot=C:/Users/olivi/AppData/Local/Android/Sdk/ndk-bundle/toolchains/llvm/prebuilt/windows-x86_64/sysroot   -I..\\..\\..\\..\\src\\main\\cpp\\vrb\\src\\..\\include  -g -DANDROID -fdata-sections -ffunction-sections -funwind-tables -fstack-protector-strong -no-canonical-prefixes -fno-addrsig -Wa,--noexecstack -Wformat -Werror=format-security  -std=c++14 -fexceptions -frtti -Werror -IC:\\Users\\olivi\\Documents\\wondavr\\wvrmobile\\app\\src\\main\\cpp -IC:\\Users\\olivi\\Documents\\wondavr\\wvrmobile\\app\\src\\main\\cpp\\vrb\\include  -IC:\\Users\\olivi\\Documents\\wondavr\\wvrmobile\\third_party\\ovr_mobile\\VrApi\\Include -IC:\\Users\\olivi\\Documents\\wondavr\\wvrmobile\\third_party\\OVRPlatformSDK\\Include -IC:\\Users\\olivi\\Documents\\wondavr\\wvrmobile\\app\\src\\oculusvr\\cpp -DOCULUSVR -DSTORE_BUILD=1 -O0 -fno-limit-debug-info  -fPIC    -c ",
					"src" : "C:/Users/olivi/Documents/wondavr/wvrmobile/app/src/main/cpp/vrb/src/Quaternion.cpp",
					"workingDirectory" : "C:/Users/olivi/Documents/wondavr/wvrmobile/app/.cxx/cmake/oculusvr3dofStoreArm64Debug/arm64-v8a"
				},
				
				{
					"flags" : "  --target=aarch64-none-linux-android24 --gcc-toolchain=C:/Users/olivi/AppData/Local/Android/Sdk/ndk-bundle/toolchains/llvm/prebuilt/windows-x86_64 --sysroot=C:/Users/olivi/AppData/Local/Android/Sdk/ndk-bundle/toolchains/llvm/prebuilt/windows-x86_64/sysroot   -I..\\..\\..\\..\\src\\main\\cpp\\vrb\\src\\..\\include  -g -DANDROID -fdata-sections -ffunction-sections -funwind-tables -fstack-protector-strong -no-canonical-prefixes -fno-addrsig -Wa,--noexecstack -Wformat -Werror=format-security  -std=c++14 -fexceptions -frtti -Werror -IC:\\Users\\olivi\\Documents\\wondavr\\wvrmobile\\app\\src\\main\\cpp -IC:\\Users\\olivi\\Documents\\wondavr\\wvrmobile\\app\\src\\main\\cpp\\vrb\\include  -IC:\\Users\\olivi\\Documents\\wondavr\\wvrmobile\\third_party\\ovr_mobile\\VrApi\\Include -IC:\\Users\\olivi\\Documents\\wondavr\\wvrmobile\\third_party\\OVRPlatformSDK\\Include -IC:\\Users\\olivi\\Documents\\wondavr\\wvrmobile\\app\\src\\oculusvr\\cpp -DOCULUSVR -DSTORE_BUILD=1 -O0 -fno-limit-debug-info  -fPIC    -c ",
					"src" : "C:/Users/olivi/Documents/wondavr/wvrmobile/app/src/main/cpp/vrb/src/RenderContext.cpp",
					"workingDirectory" : "C:/Users/olivi/Documents/wondavr/wvrmobile/app/.cxx/cmake/oculusvr3dofStoreArm64Debug/arm64-v8a"
				},
				
				{
					"flags" : "  --target=aarch64-none-linux-android24 --gcc-toolchain=C:/Users/olivi/AppData/Local/Android/Sdk/ndk-bundle/toolchains/llvm/prebuilt/windows-x86_64 --sysroot=C:/Users/olivi/AppData/Local/Android/Sdk/ndk-bundle/toolchains/llvm/prebuilt/windows-x86_64/sysroot   -I..\\..\\..\\..\\src\\main\\cpp\\vrb\\src\\..\\include  -g -DANDROID -fdata-sections -ffunction-sections -funwind-tables -fstack-protector-strong -no-canonical-prefixes -fno-addrsig -Wa,--noexecstack -Wformat -Werror=format-security  -std=c++14 -fexceptions -frtti -Werror -IC:\\Users\\olivi\\Documents\\wondavr\\wvrmobile\\app\\src\\main\\cpp -IC:\\Users\\olivi\\Documents\\wondavr\\wvrmobile\\app\\src\\main\\cpp\\vrb\\include  -IC:\\Users\\olivi\\Documents\\wondavr\\wvrmobile\\third_party\\ovr_mobile\\VrApi\\Include -IC:\\Users\\olivi\\Documents\\wondavr\\wvrmobile\\third_party\\OVRPlatformSDK\\Include -IC:\\Users\\olivi\\Documents\\wondavr\\wvrmobile\\app\\src\\oculusvr\\cpp -DOCULUSVR -DSTORE_BUILD=1 -O0 -fno-limit-debug-info  -fPIC    -c ",
					"src" : "C:/Users/olivi/Documents/wondavr/wvrmobile/app/src/main/cpp/vrb/src/RenderState.cpp",
					"workingDirectory" : "C:/Users/olivi/Documents/wondavr/wvrmobile/app/.cxx/cmake/oculusvr3dofStoreArm64Debug/arm64-v8a"
				},
				
				{
					"flags" : "  --target=aarch64-none-linux-android24 --gcc-toolchain=C:/Users/olivi/AppData/Local/Android/Sdk/ndk-bundle/toolchains/llvm/prebuilt/windows-x86_64 --sysroot=C:/Users/olivi/AppData/Local/Android/Sdk/ndk-bundle/toolchains/llvm/prebuilt/windows-x86_64/sysroot   -I..\\..\\..\\..\\src\\main\\cpp\\vrb\\src\\..\\include  -g -DANDROID -fdata-sections -ffunction-sections -funwind-tables -fstack-protector-strong -no-canonical-prefixes -fno-addrsig -Wa,--noexecstack -Wformat -Werror=format-security  -std=c++14 -fexceptions -frtti -Werror -IC:\\Users\\olivi\\Documents\\wondavr\\wvrmobile\\app\\src\\main\\cpp -IC:\\Users\\olivi\\Documents\\wondavr\\wvrmobile\\app\\src\\main\\cpp\\vrb\\include  -IC:\\Users\\olivi\\Documents\\wondavr\\wvrmobile\\third_party\\ovr_mobile\\VrApi\\Include -IC:\\Users\\olivi\\Documents\\wondavr\\wvrmobile\\third_party\\OVRPlatformSDK\\Include -IC:\\Users\\olivi\\Documents\\wondavr\\wvrmobile\\app\\src\\oculusvr\\cpp -DOCULUSVR -DSTORE_BUILD=1 -O0 -fno-limit-debug-info  -fPIC    -c ",
					"src" : "C:/Users/olivi/Documents/wondavr/wvrmobile/app/src/main/cpp/vrb/src/ResourceGL.cpp",
					"workingDirectory" : "C:/Users/olivi/Documents/wondavr/wvrmobile/app/.cxx/cmake/oculusvr3dofStoreArm64Debug/arm64-v8a"
				},
				
				{
					"flags" : "  --target=aarch64-none-linux-android24 --gcc-toolchain=C:/Users/olivi/AppData/Local/Android/Sdk/ndk-bundle/toolchains/llvm/prebuilt/windows-x86_64 --sysroot=C:/Users/olivi/AppData/Local/Android/Sdk/ndk-bundle/toolchains/llvm/prebuilt/windows-x86_64/sysroot   -I..\\..\\..\\..\\src\\main\\cpp\\vrb\\src\\..\\include  -g -DANDROID -fdata-sections -ffunction-sections -funwind-tables -fstack-protector-strong -no-canonical-prefixes -fno-addrsig -Wa,--noexecstack -Wformat -Werror=format-security  -std=c++14 -fexceptions -frtti -Werror -IC:\\Users\\olivi\\Documents\\wondavr\\wvrmobile\\app\\src\\main\\cpp -IC:\\Users\\olivi\\Documents\\wondavr\\wvrmobile\\app\\src\\main\\cpp\\vrb\\include  -IC:\\Users\\olivi\\Documents\\wondavr\\wvrmobile\\third_party\\ovr_mobile\\VrApi\\Include -IC:\\Users\\olivi\\Documents\\wondavr\\wvrmobile\\third_party\\OVRPlatformSDK\\Include -IC:\\Users\\olivi\\Documents\\wondavr\\wvrmobile\\app\\src\\oculusvr\\cpp -DOCULUSVR -DSTORE_BUILD=1 -O0 -fno-limit-debug-info  -fPIC    -c ",
					"src" : "C:/Users/olivi/Documents/wondavr/wvrmobile/app/src/main/cpp/vrb/src/ShaderUtil.cpp",
					"workingDirectory" : "C:/Users/olivi/Documents/wondavr/wvrmobile/app/.cxx/cmake/oculusvr3dofStoreArm64Debug/arm64-v8a"
				},
				
				{
					"flags" : "  --target=aarch64-none-linux-android24 --gcc-toolchain=C:/Users/olivi/AppData/Local/Android/Sdk/ndk-bundle/toolchains/llvm/prebuilt/windows-x86_64 --sysroot=C:/Users/olivi/AppData/Local/Android/Sdk/ndk-bundle/toolchains/llvm/prebuilt/windows-x86_64/sysroot   -I..\\..\\..\\..\\src\\main\\cpp\\vrb\\src\\..\\include  -g -DANDROID -fdata-sections -ffunction-sections -funwind-tables -fstack-protector-strong -no-canonical-prefixes -fno-addrsig -Wa,--noexecstack -Wformat -Werror=format-security  -std=c++14 -fexceptions -frtti -Werror -IC:\\Users\\olivi\\Documents\\wondavr\\wvrmobile\\app\\src\\main\\cpp -IC:\\Users\\olivi\\Documents\\wondavr\\wvrmobile\\app\\src\\main\\cpp\\vrb\\include  -IC:\\Users\\olivi\\Documents\\wondavr\\wvrmobile\\third_party\\ovr_mobile\\VrApi\\Include -IC:\\Users\\olivi\\Documents\\wondavr\\wvrmobile\\third_party\\OVRPlatformSDK\\Include -IC:\\Users\\olivi\\Documents\\wondavr\\wvrmobile\\app\\src\\oculusvr\\cpp -DOCULUSVR -DSTORE_BUILD=1 -O0 -fno-limit-debug-info  -fPIC    -c ",
					"src" : "C:/Users/olivi/Documents/wondavr/wvrmobile/app/src/main/cpp/vrb/src/Texture.cpp",
					"workingDirectory" : "C:/Users/olivi/Documents/wondavr/wvrmobile/app/.cxx/cmake/oculusvr3dofStoreArm64Debug/arm64-v8a"
				},
				
				{
					"flags" : "  --target=aarch64-none-linux-android24 --gcc-toolchain=C:/Users/olivi/AppData/Local/Android/Sdk/ndk-bundle/toolchains/llvm/prebuilt/windows-x86_64 --sysroot=C:/Users/olivi/AppData/Local/Android/Sdk/ndk-bundle/toolchains/llvm/prebuilt/windows-x86_64/sysroot   -I..\\..\\..\\..\\src\\main\\cpp\\vrb\\src\\..\\include  -g -DANDROID -fdata-sections -ffunction-sections -funwind-tables -fstack-protector-strong -no-canonical-prefixes -fno-addrsig -Wa,--noexecstack -Wformat -Werror=format-security  -std=c++14 -fexceptions -frtti -Werror -IC:\\Users\\olivi\\Documents\\wondavr\\wvrmobile\\app\\src\\main\\cpp -IC:\\Users\\olivi\\Documents\\wondavr\\wvrmobile\\app\\src\\main\\cpp\\vrb\\include  -IC:\\Users\\olivi\\Documents\\wondavr\\wvrmobile\\third_party\\ovr_mobile\\VrApi\\Include -IC:\\Users\\olivi\\Documents\\wondavr\\wvrmobile\\third_party\\OVRPlatformSDK\\Include -IC:\\Users\\olivi\\Documents\\wondavr\\wvrmobile\\app\\src\\oculusvr\\cpp -DOCULUSVR -DSTORE_BUILD=1 -O0 -fno-limit-debug-info  -fPIC    -c ",
					"src" : "C:/Users/olivi/Documents/wondavr/wvrmobile/app/src/main/cpp/vrb/src/TextureCache.cpp",
					"workingDirectory" : "C:/Users/olivi/Documents/wondavr/wvrmobile/app/.cxx/cmake/oculusvr3dofStoreArm64Debug/arm64-v8a"
				},
				
				{
					"flags" : "  --target=aarch64-none-linux-android24 --gcc-toolchain=C:/Users/olivi/AppData/Local/Android/Sdk/ndk-bundle/toolchains/llvm/prebuilt/windows-x86_64 --sysroot=C:/Users/olivi/AppData/Local/Android/Sdk/ndk-bundle/toolchains/llvm/prebuilt/windows-x86_64/sysroot   -I..\\..\\..\\..\\src\\main\\cpp\\vrb\\src\\..\\include  -g -DANDROID -fdata-sections -ffunction-sections -funwind-tables -fstack-protector-strong -no-canonical-prefixes -fno-addrsig -Wa,--noexecstack -Wformat -Werror=format-security  -std=c++14 -fexceptions -frtti -Werror -IC:\\Users\\olivi\\Documents\\wondavr\\wvrmobile\\app\\src\\main\\cpp -IC:\\Users\\olivi\\Documents\\wondavr\\wvrmobile\\app\\src\\main\\cpp\\vrb\\include  -IC:\\Users\\olivi\\Documents\\wondavr\\wvrmobile\\third_party\\ovr_mobile\\VrApi\\Include -IC:\\Users\\olivi\\Documents\\wondavr\\wvrmobile\\third_party\\OVRPlatformSDK\\Include -IC:\\Users\\olivi\\Documents\\wondavr\\wvrmobile\\app\\src\\oculusvr\\cpp -DOCULUSVR -DSTORE_BUILD=1 -O0 -fno-limit-debug-info  -fPIC    -c ",
					"src" : "C:/Users/olivi/Documents/wondavr/wvrmobile/app/src/main/cpp/vrb/src/TextureCubeMap.cpp",
					"workingDirectory" : "C:/Users/olivi/Documents/wondavr/wvrmobile/app/.cxx/cmake/oculusvr3dofStoreArm64Debug/arm64-v8a"
				},
				
				{
					"flags" : "  --target=aarch64-none-linux-android24 --gcc-toolchain=C:/Users/olivi/AppData/Local/Android/Sdk/ndk-bundle/toolchains/llvm/prebuilt/windows-x86_64 --sysroot=C:/Users/olivi/AppData/Local/Android/Sdk/ndk-bundle/toolchains/llvm/prebuilt/windows-x86_64/sysroot   -I..\\..\\..\\..\\src\\main\\cpp\\vrb\\src\\..\\include  -g -DANDROID -fdata-sections -ffunction-sections -funwind-tables -fstack-protector-strong -no-canonical-prefixes -fno-addrsig -Wa,--noexecstack -Wformat -Werror=format-security  -std=c++14 -fexceptions -frtti -Werror -IC:\\Users\\olivi\\Documents\\wondavr\\wvrmobile\\app\\src\\main\\cpp -IC:\\Users\\olivi\\Documents\\wondavr\\wvrmobile\\app\\src\\main\\cpp\\vrb\\include  -IC:\\Users\\olivi\\Documents\\wondavr\\wvrmobile\\third_party\\ovr_mobile\\VrApi\\Include -IC:\\Users\\olivi\\Documents\\wondavr\\wvrmobile\\third_party\\OVRPlatformSDK\\Include -IC:\\Users\\olivi\\Documents\\wondavr\\wvrmobile\\app\\src\\oculusvr\\cpp -DOCULUSVR -DSTORE_BUILD=1 -O0 -fno-limit-debug-info  -fPIC    -c ",
					"src" : "C:/Users/olivi/Documents/wondavr/wvrmobile/app/src/main/cpp/vrb/src/TextureGL.cpp",
					"workingDirectory" : "C:/Users/olivi/Documents/wondavr/wvrmobile/app/.cxx/cmake/oculusvr3dofStoreArm64Debug/arm64-v8a"
				},
				
				{
					"flags" : "  --target=aarch64-none-linux-android24 --gcc-toolchain=C:/Users/olivi/AppData/Local/Android/Sdk/ndk-bundle/toolchains/llvm/prebuilt/windows-x86_64 --sysroot=C:/Users/olivi/AppData/Local/Android/Sdk/ndk-bundle/toolchains/llvm/prebuilt/windows-x86_64/sysroot   -I..\\..\\..\\..\\src\\main\\cpp\\vrb\\src\\..\\include  -g -DANDROID -fdata-sections -ffunction-sections -funwind-tables -fstack-protector-strong -no-canonical-prefixes -fno-addrsig -Wa,--noexecstack -Wformat -Werror=format-security  -std=c++14 -fexceptions -frtti -Werror -IC:\\Users\\olivi\\Documents\\wondavr\\wvrmobile\\app\\src\\main\\cpp -IC:\\Users\\olivi\\Documents\\wondavr\\wvrmobile\\app\\src\\main\\cpp\\vrb\\include  -IC:\\Users\\olivi\\Documents\\wondavr\\wvrmobile\\third_party\\ovr_mobile\\VrApi\\Include -IC:\\Users\\olivi\\Documents\\wondavr\\wvrmobile\\third_party\\OVRPlatformSDK\\Include -IC:\\Users\\olivi\\Documents\\wondavr\\wvrmobile\\app\\src\\oculusvr\\cpp -DOCULUSVR -DSTORE_BUILD=1 -O0 -fno-limit-debug-info  -fPIC    -c ",
					"src" : "C:/Users/olivi/Documents/wondavr/wvrmobile/app/src/main/cpp/vrb/src/Toggle.cpp",
					"workingDirectory" : "C:/Users/olivi/Documents/wondavr/wvrmobile/app/.cxx/cmake/oculusvr3dofStoreArm64Debug/arm64-v8a"
				},
				
				{
					"flags" : "  --target=aarch64-none-linux-android24 --gcc-toolchain=C:/Users/olivi/AppData/Local/Android/Sdk/ndk-bundle/toolchains/llvm/prebuilt/windows-x86_64 --sysroot=C:/Users/olivi/AppData/Local/Android/Sdk/ndk-bundle/toolchains/llvm/prebuilt/windows-x86_64/sysroot   -I..\\..\\..\\..\\src\\main\\cpp\\vrb\\src\\..\\include  -g -DANDROID -fdata-sections -ffunction-sections -funwind-tables -fstack-protector-strong -no-canonical-prefixes -fno-addrsig -Wa,--noexecstack -Wformat -Werror=format-security  -std=c++14 -fexceptions -frtti -Werror -IC:\\Users\\olivi\\Documents\\wondavr\\wvrmobile\\app\\src\\main\\cpp -IC:\\Users\\olivi\\Documents\\wondavr\\wvrmobile\\app\\src\\main\\cpp\\vrb\\include  -IC:\\Users\\olivi\\Documents\\wondavr\\wvrmobile\\third_party\\ovr_mobile\\VrApi\\Include -IC:\\Users\\olivi\\Documents\\wondavr\\wvrmobile\\third_party\\OVRPlatformSDK\\Include -IC:\\Users\\olivi\\Documents\\wondavr\\wvrmobile\\app\\src\\oculusvr\\cpp -DOCULUSVR -DSTORE_BUILD=1 -O0 -fno-limit-debug-info  -fPIC    -c ",
					"src" : "C:/Users/olivi/Documents/wondavr/wvrmobile/app/src/main/cpp/vrb/src/Transform.cpp",
					"workingDirectory" : "C:/Users/olivi/Documents/wondavr/wvrmobile/app/.cxx/cmake/oculusvr3dofStoreArm64Debug/arm64-v8a"
				},
				
				{
					"flags" : "  --target=aarch64-none-linux-android24 --gcc-toolchain=C:/Users/olivi/AppData/Local/Android/Sdk/ndk-bundle/toolchains/llvm/prebuilt/windows-x86_64 --sysroot=C:/Users/olivi/AppData/Local/Android/Sdk/ndk-bundle/toolchains/llvm/prebuilt/windows-x86_64/sysroot   -I..\\..\\..\\..\\src\\main\\cpp\\vrb\\src\\..\\include  -g -DANDROID -fdata-sections -ffunction-sections -funwind-tables -fstack-protector-strong -no-canonical-prefixes -fno-addrsig -Wa,--noexecstack -Wformat -Werror=format-security  -std=c++14 -fexceptions -frtti -Werror -IC:\\Users\\olivi\\Documents\\wondavr\\wvrmobile\\app\\src\\main\\cpp -IC:\\Users\\olivi\\Documents\\wondavr\\wvrmobile\\app\\src\\main\\cpp\\vrb\\include  -IC:\\Users\\olivi\\Documents\\wondavr\\wvrmobile\\third_party\\ovr_mobile\\VrApi\\Include -IC:\\Users\\olivi\\Documents\\wondavr\\wvrmobile\\third_party\\OVRPlatformSDK\\Include -IC:\\Users\\olivi\\Documents\\wondavr\\wvrmobile\\app\\src\\oculusvr\\cpp -DOCULUSVR -DSTORE_BUILD=1 -O0 -fno-limit-debug-info  -fPIC    -c ",
					"src" : "C:/Users/olivi/Documents/wondavr/wvrmobile/app/src/main/cpp/vrb/src/Updatable.cpp",
					"workingDirectory" : "C:/Users/olivi/Documents/wondavr/wvrmobile/app/.cxx/cmake/oculusvr3dofStoreArm64Debug/arm64-v8a"
				},
				
				{
					"flags" : "  --target=aarch64-none-linux-android24 --gcc-toolchain=C:/Users/olivi/AppData/Local/Android/Sdk/ndk-bundle/toolchains/llvm/prebuilt/windows-x86_64 --sysroot=C:/Users/olivi/AppData/Local/Android/Sdk/ndk-bundle/toolchains/llvm/prebuilt/windows-x86_64/sysroot   -I..\\..\\..\\..\\src\\main\\cpp\\vrb\\src\\..\\include  -g -DANDROID -fdata-sections -ffunction-sections -funwind-tables -fstack-protector-strong -no-canonical-prefixes -fno-addrsig -Wa,--noexecstack -Wformat -Werror=format-security  -std=c++14 -fexceptions -frtti -Werror -IC:\\Users\\olivi\\Documents\\wondavr\\wvrmobile\\app\\src\\main\\cpp -IC:\\Users\\olivi\\Documents\\wondavr\\wvrmobile\\app\\src\\main\\cpp\\vrb\\include  -IC:\\Users\\olivi\\Documents\\wondavr\\wvrmobile\\third_party\\ovr_mobile\\VrApi\\Include -IC:\\Users\\olivi\\Documents\\wondavr\\wvrmobile\\third_party\\OVRPlatformSDK\\Include -IC:\\Users\\olivi\\Documents\\wondavr\\wvrmobile\\app\\src\\oculusvr\\cpp -DOCULUSVR -DSTORE_BUILD=1 -O0 -fno-limit-debug-info  -fPIC    -c ",
					"src" : "C:/Users/olivi/Documents/wondavr/wvrmobile/app/src/main/cpp/vrb/src/VertexArray.cpp",
					"workingDirectory" : "C:/Users/olivi/Documents/wondavr/wvrmobile/app/.cxx/cmake/oculusvr3dofStoreArm64Debug/arm64-v8a"
				},
				
				{
					"flags" : "  --target=aarch64-none-linux-android24 --gcc-toolchain=C:/Users/olivi/AppData/Local/Android/Sdk/ndk-bundle/toolchains/llvm/prebuilt/windows-x86_64 --sysroot=C:/Users/olivi/AppData/Local/Android/Sdk/ndk-bundle/toolchains/llvm/prebuilt/windows-x86_64/sysroot   -I..\\..\\..\\..\\src\\main\\cpp\\vrb\\src\\..\\include  -g -DANDROID -fdata-sections -ffunction-sections -funwind-tables -fstack-protector-strong -no-canonical-prefixes -fno-addrsig -Wa,--noexecstack -Wformat -Werror=format-security  -std=c++14 -fexceptions -frtti -Werror -IC:\\Users\\olivi\\Documents\\wondavr\\wvrmobile\\app\\src\\main\\cpp -IC:\\Users\\olivi\\Documents\\wondavr\\wvrmobile\\app\\src\\main\\cpp\\vrb\\include  -IC:\\Users\\olivi\\Documents\\wondavr\\wvrmobile\\third_party\\ovr_mobile\\VrApi\\Include -IC:\\Users\\olivi\\Documents\\wondavr\\wvrmobile\\third_party\\OVRPlatformSDK\\Include -IC:\\Users\\olivi\\Documents\\wondavr\\wvrmobile\\app\\src\\oculusvr\\cpp -DOCULUSVR -DSTORE_BUILD=1 -O0 -fno-limit-debug-info  -fPIC    -c ",
					"src" : "C:/Users/olivi/Documents/wondavr/wvrmobile/app/src/main/cpp/vrb/src/ClassLoaderAndroid.cpp",
					"workingDirectory" : "C:/Users/olivi/Documents/wondavr/wvrmobile/app/.cxx/cmake/oculusvr3dofStoreArm64Debug/arm64-v8a"
				},
				
				{
					"flags" : "  --target=aarch64-none-linux-android24 --gcc-toolchain=C:/Users/olivi/AppData/Local/Android/Sdk/ndk-bundle/toolchains/llvm/prebuilt/windows-x86_64 --sysroot=C:/Users/olivi/AppData/Local/Android/Sdk/ndk-bundle/toolchains/llvm/prebuilt/windows-x86_64/sysroot   -I..\\..\\..\\..\\src\\main\\cpp\\vrb\\src\\..\\include  -g -DANDROID -fdata-sections -ffunction-sections -funwind-tables -fstack-protector-strong -no-canonical-prefixes -fno-addrsig -Wa,--noexecstack -Wformat -Werror=format-security  -std=c++14 -fexceptions -frtti -Werror -IC:\\Users\\olivi\\Documents\\wondavr\\wvrmobile\\app\\src\\main\\cpp -IC:\\Users\\olivi\\Documents\\wondavr\\wvrmobile\\app\\src\\main\\cpp\\vrb\\include  -IC:\\Users\\olivi\\Documents\\wondavr\\wvrmobile\\third_party\\ovr_mobile\\VrApi\\Include -IC:\\Users\\olivi\\Documents\\wondavr\\wvrmobile\\third_party\\OVRPlatformSDK\\Include -IC:\\Users\\olivi\\Documents\\wondavr\\wvrmobile\\app\\src\\oculusvr\\cpp -DOCULUSVR -DSTORE_BUILD=1 -O0 -fno-limit-debug-info  -fPIC    -c ",
					"src" : "C:/Users/olivi/Documents/wondavr/wvrmobile/app/src/main/cpp/vrb/src/EGLError.cpp",
					"workingDirectory" : "C:/Users/olivi/Documents/wondavr/wvrmobile/app/.cxx/cmake/oculusvr3dofStoreArm64Debug/arm64-v8a"
				},
				
				{
					"flags" : "  --target=aarch64-none-linux-android24 --gcc-toolchain=C:/Users/olivi/AppData/Local/Android/Sdk/ndk-bundle/toolchains/llvm/prebuilt/windows-x86_64 --sysroot=C:/Users/olivi/AppData/Local/Android/Sdk/ndk-bundle/toolchains/llvm/prebuilt/windows-x86_64/sysroot   -I..\\..\\..\\..\\src\\main\\cpp\\vrb\\src\\..\\include  -g -DANDROID -fdata-sections -ffunction-sections -funwind-tables -fstack-protector-strong -no-canonical-prefixes -fno-addrsig -Wa,--noexecstack -Wformat -Werror=format-security  -std=c++14 -fexceptions -frtti -Werror -IC:\\Users\\olivi\\Documents\\wondavr\\wvrmobile\\app\\src\\main\\cpp -IC:\\Users\\olivi\\Documents\\wondavr\\wvrmobile\\app\\src\\main\\cpp\\vrb\\include  -IC:\\Users\\olivi\\Documents\\wondavr\\wvrmobile\\third_party\\ovr_mobile\\VrApi\\Include -IC:\\Users\\olivi\\Documents\\wondavr\\wvrmobile\\third_party\\OVRPlatformSDK\\Include -IC:\\Users\\olivi\\Documents\\wondavr\\wvrmobile\\app\\src\\oculusvr\\cpp -DOCULUSVR -DSTORE_BUILD=1 -O0 -fno-limit-debug-info  -fPIC    -c ",
					"src" : "C:/Users/olivi/Documents/wondavr/wvrmobile/app/src/main/cpp/vrb/src/FileReaderAndroid.cpp",
					"workingDirectory" : "C:/Users/olivi/Documents/wondavr/wvrmobile/app/.cxx/cmake/oculusvr3dofStoreArm64Debug/arm64-v8a"
				},
				
				{
					"flags" : "  --target=aarch64-none-linux-android24 --gcc-toolchain=C:/Users/olivi/AppData/Local/Android/Sdk/ndk-bundle/toolchains/llvm/prebuilt/windows-x86_64 --sysroot=C:/Users/olivi/AppData/Local/Android/Sdk/ndk-bundle/toolchains/llvm/prebuilt/windows-x86_64/sysroot   -I..\\..\\..\\..\\src\\main\\cpp\\vrb\\src\\..\\include  -g -DANDROID -fdata-sections -ffunction-sections -funwind-tables -fstack-protector-strong -no-canonical-prefixes -fno-addrsig -Wa,--noexecstack -Wformat -Werror=format-security  -std=c++14 -fexceptions -frtti -Werror -IC:\\Users\\olivi\\Documents\\wondavr\\wvrmobile\\app\\src\\main\\cpp -IC:\\Users\\olivi\\Documents\\wondavr\\wvrmobile\\app\\src\\main\\cpp\\vrb\\include  -IC:\\Users\\olivi\\Documents\\wondavr\\wvrmobile\\third_party\\ovr_mobile\\VrApi\\Include -IC:\\Users\\olivi\\Documents\\wondavr\\wvrmobile\\third_party\\OVRPlatformSDK\\Include -IC:\\Users\\olivi\\Documents\\wondavr\\wvrmobile\\app\\src\\oculusvr\\cpp -DOCULUSVR -DSTORE_BUILD=1 -O0 -fno-limit-debug-info  -fPIC    -c ",
					"src" : "C:/Users/olivi/Documents/wondavr/wvrmobile/app/src/main/cpp/vrb/src/ModelLoaderAndroid.cpp",
					"workingDirectory" : "C:/Users/olivi/Documents/wondavr/wvrmobile/app/.cxx/cmake/oculusvr3dofStoreArm64Debug/arm64-v8a"
				},
				
				{
					"flags" : "  --target=aarch64-none-linux-android24 --gcc-toolchain=C:/Users/olivi/AppData/Local/Android/Sdk/ndk-bundle/toolchains/llvm/prebuilt/windows-x86_64 --sysroot=C:/Users/olivi/AppData/Local/Android/Sdk/ndk-bundle/toolchains/llvm/prebuilt/windows-x86_64/sysroot   -I..\\..\\..\\..\\src\\main\\cpp\\vrb\\src\\..\\include  -g -DANDROID -fdata-sections -ffunction-sections -funwind-tables -fstack-protector-strong -no-canonical-prefixes -fno-addrsig -Wa,--noexecstack -Wformat -Werror=format-security  -std=c++14 -fexceptions -frtti -Werror -IC:\\Users\\olivi\\Documents\\wondavr\\wvrmobile\\app\\src\\main\\cpp -IC:\\Users\\olivi\\Documents\\wondavr\\wvrmobile\\app\\src\\main\\cpp\\vrb\\include  -IC:\\Users\\olivi\\Documents\\wondavr\\wvrmobile\\third_party\\ovr_mobile\\VrApi\\Include -IC:\\Users\\olivi\\Documents\\wondavr\\wvrmobile\\third_party\\OVRPlatformSDK\\Include -IC:\\Users\\olivi\\Documents\\wondavr\\wvrmobile\\app\\src\\oculusvr\\cpp -DOCULUSVR -DSTORE_BUILD=1 -O0 -fno-limit-debug-info  -fPIC    -c ",
					"src" : "C:/Users/olivi/Documents/wondavr/wvrmobile/app/src/main/cpp/vrb/src/RunnableQueue.cpp",
					"workingDirectory" : "C:/Users/olivi/Documents/wondavr/wvrmobile/app/.cxx/cmake/oculusvr3dofStoreArm64Debug/arm64-v8a"
				},
				
				{
					"flags" : "  --target=aarch64-none-linux-android24 --gcc-toolchain=C:/Users/olivi/AppData/Local/Android/Sdk/ndk-bundle/toolchains/llvm/prebuilt/windows-x86_64 --sysroot=C:/Users/olivi/AppData/Local/Android/Sdk/ndk-bundle/toolchains/llvm/prebuilt/windows-x86_64/sysroot   -I..\\..\\..\\..\\src\\main\\cpp\\vrb\\src\\..\\include  -g -DANDROID -fdata-sections -ffunction-sections -funwind-tables -fstack-protector-strong -no-canonical-prefixes -fno-addrsig -Wa,--noexecstack -Wformat -Werror=format-security  -std=c++14 -fexceptions -frtti -Werror -IC:\\Users\\olivi\\Documents\\wondavr\\wvrmobile\\app\\src\\main\\cpp -IC:\\Users\\olivi\\Documents\\wondavr\\wvrmobile\\app\\src\\main\\cpp\\vrb\\include  -IC:\\Users\\olivi\\Documents\\wondavr\\wvrmobile\\third_party\\ovr_mobile\\VrApi\\Include -IC:\\Users\\olivi\\Documents\\wondavr\\wvrmobile\\third_party\\OVRPlatformSDK\\Include -IC:\\Users\\olivi\\Documents\\wondavr\\wvrmobile\\app\\src\\oculusvr\\cpp -DOCULUSVR -DSTORE_BUILD=1 -O0 -fno-limit-debug-info  -fPIC    -c ",
					"src" : "C:/Users/olivi/Documents/wondavr/wvrmobile/app/src/main/cpp/vrb/src/SharedEGLContext.cpp",
					"workingDirectory" : "C:/Users/olivi/Documents/wondavr/wvrmobile/app/.cxx/cmake/oculusvr3dofStoreArm64Debug/arm64-v8a"
				},
				
				{
					"flags" : "  --target=aarch64-none-linux-android24 --gcc-toolchain=C:/Users/olivi/AppData/Local/Android/Sdk/ndk-bundle/toolchains/llvm/prebuilt/windows-x86_64 --sysroot=C:/Users/olivi/AppData/Local/Android/Sdk/ndk-bundle/toolchains/llvm/prebuilt/windows-x86_64/sysroot   -I..\\..\\..\\..\\src\\main\\cpp\\vrb\\src\\..\\include  -g -DANDROID -fdata-sections -ffunction-sections -funwind-tables -fstack-protector-strong -no-canonical-prefixes -fno-addrsig -Wa,--noexecstack -Wformat -Werror=format-security  -std=c++14 -fexceptions -frtti -Werror -IC:\\Users\\olivi\\Documents\\wondavr\\wvrmobile\\app\\src\\main\\cpp -IC:\\Users\\olivi\\Documents\\wondavr\\wvrmobile\\app\\src\\main\\cpp\\vrb\\include  -IC:\\Users\\olivi\\Documents\\wondavr\\wvrmobile\\third_party\\ovr_mobile\\VrApi\\Include -IC:\\Users\\olivi\\Documents\\wondavr\\wvrmobile\\third_party\\OVRPlatformSDK\\Include -IC:\\Users\\olivi\\Documents\\wondavr\\wvrmobile\\app\\src\\oculusvr\\cpp -DOCULUSVR -DSTORE_BUILD=1 -O0 -fno-limit-debug-info  -fPIC    -c ",
					"src" : "C:/Users/olivi/Documents/wondavr/wvrmobile/app/src/main/cpp/vrb/src/SurfaceTextureFactory.cpp",
					"workingDirectory" : "C:/Users/olivi/Documents/wondavr/wvrmobile/app/.cxx/cmake/oculusvr3dofStoreArm64Debug/arm64-v8a"
				},
				
				{
					"flags" : "  --target=aarch64-none-linux-android24 --gcc-toolchain=C:/Users/olivi/AppData/Local/Android/Sdk/ndk-bundle/toolchains/llvm/prebuilt/windows-x86_64 --sysroot=C:/Users/olivi/AppData/Local/Android/Sdk/ndk-bundle/toolchains/llvm/prebuilt/windows-x86_64/sysroot   -I..\\..\\..\\..\\src\\main\\cpp\\vrb\\src\\..\\include  -g -DANDROID -fdata-sections -ffunction-sections -funwind-tables -fstack-protector-strong -no-canonical-prefixes -fno-addrsig -Wa,--noexecstack -Wformat -Werror=format-security  -std=c++14 -fexceptions -frtti -Werror -IC:\\Users\\olivi\\Documents\\wondavr\\wvrmobile\\app\\src\\main\\cpp -IC:\\Users\\olivi\\Documents\\wondavr\\wvrmobile\\app\\src\\main\\cpp\\vrb\\include  -IC:\\Users\\olivi\\Documents\\wondavr\\wvrmobile\\third_party\\ovr_mobile\\VrApi\\Include -IC:\\Users\\olivi\\Documents\\wondavr\\wvrmobile\\third_party\\OVRPlatformSDK\\Include -IC:\\Users\\olivi\\Documents\\wondavr\\wvrmobile\\app\\src\\oculusvr\\cpp -DOCULUSVR -DSTORE_BUILD=1 -O0 -fno-limit-debug-info  -fPIC    -c ",
					"src" : "C:/Users/olivi/Documents/wondavr/wvrmobile/app/src/main/cpp/vrb/src/TextureSurface.cpp",
					"workingDirectory" : "C:/Users/olivi/Documents/wondavr/wvrmobile/app/.cxx/cmake/oculusvr3dofStoreArm64Debug/arm64-v8a"
				},
				
				{
					"flags" : "  --target=aarch64-none-linux-android24 --gcc-toolchain=C:/Users/olivi/AppData/Local/Android/Sdk/ndk-bundle/toolchains/llvm/prebuilt/windows-x86_64 --sysroot=C:/Users/olivi/AppData/Local/Android/Sdk/ndk-bundle/toolchains/llvm/prebuilt/windows-x86_64/sysroot   -I..\\..\\..\\..\\src\\main\\cpp\\vrb\\src\\..\\include  -g -DANDROID -fdata-sections -ffunction-sections -funwind-tables -fstack-protector-strong -no-canonical-prefixes -fno-addrsig -Wa,--noexecstack -Wformat -Werror=format-security  -std=c++14 -fexceptions -frtti -Werror -IC:\\Users\\olivi\\Documents\\wondavr\\wvrmobile\\app\\src\\main\\cpp -IC:\\Users\\olivi\\Documents\\wondavr\\wvrmobile\\app\\src\\main\\cpp\\vrb\\include  -IC:\\Users\\olivi\\Documents\\wondavr\\wvrmobile\\third_party\\ovr_mobile\\VrApi\\Include -IC:\\Users\\olivi\\Documents\\wondavr\\wvrmobile\\third_party\\OVRPlatformSDK\\Include -IC:\\Users\\olivi\\Documents\\wondavr\\wvrmobile\\app\\src\\oculusvr\\cpp -DOCULUSVR -DSTORE_BUILD=1 -O0 -fno-limit-debug-info  -fPIC    -c ",
					"src" : "C:/Users/olivi/Documents/wondavr/wvrmobile/app/src/main/cpp/vrb/src/ThreadUtils.cpp",
					"workingDirectory" : "C:/Users/olivi/Documents/wondavr/wvrmobile/app/.cxx/cmake/oculusvr3dofStoreArm64Debug/arm64-v8a"
				}
			],
			"output" : "C:/Users/olivi/Documents/wondavr/wvrmobile/app/.cxx/cmake/oculusvr3dofStoreArm64Debug/arm64-v8a/src/main/cpp/vrb/src/libvrb.a",
			"toolchain" : "2895662125"
		},
		"wavevr-lib-Debug-arm64-v8a" : 
		{
			"abi" : "arm64-v8a",
			"artifactName" : "wavevr-lib",
			"buildType" : "debug",
			"output" : "C:/Users/olivi/Documents/wondavr/wvrmobile/app/../third_party/wavesdk/build/wvr_client/jni/arm64-v8a/libwvr_api.so",
			"toolchain" : "2895662125"
		}
	},
	"toolchains" : 
	{
		"2895662125" : 
		{
			"cCompilerExecutable" : "C:/Users/olivi/AppData/Local/Android/Sdk/ndk-bundle/toolchains/llvm/prebuilt/windows-x86_64/bin/clang.exe",
			"cppCompilerExecutable" : "C:/Users/olivi/AppData/Local/Android/Sdk/ndk-bundle/toolchains/llvm/prebuilt/windows-x86_64/bin/clang++.exe"
		}
	}
}
