{
  "buildFiles": [
    "C:\\Users\\olivi\\Documents\\wondavr\\wvrmobile\\app\\CMakeLists.txt",
    "C:\\Users\\olivi\\Documents\\wondavr\\wvrmobile\\app\\src\\main\\cpp\\vrb\\src\\CMakeLists.txt"
  ],
  "cleanCommands": [
    "C:\\Users\\olivi\\AppData\\Local\\Android\\Sdk\\cmake\\3.6.4111459\\bin\\cmake.exe --build C:\\Users\\olivi\\Documents\\wondavr\\wvrmobile\\app\\.cxx\\cmake\\wavevrArm64Debug\\arm64-v8a --target clean"
  ],
  "libraries": {
    "vrb-Debug-arm64-v8a": {
      "artifactName": "vrb",
      "buildCommand": "C:\\Users\\olivi\\AppData\\Local\\Android\\Sdk\\cmake\\3.6.4111459\\bin\\cmake.exe --build C:\\Users\\olivi\\Documents\\wondavr\\wvrmobile\\app\\.cxx\\cmake\\wavevrArm64Debug\\arm64-v8a --target vrb",
      "abi": "arm64-v8a",
      "output": "C:\\Users\\olivi\\Documents\\wondavr\\wvrmobile\\app\\.cxx\\cmake\\wavevrArm64Debug\\arm64-v8a\\src\\main\\cpp\\vrb\\src\\libvrb.a"
    },
    "wavevr-lib-Debug-arm64-v8a": {
      "artifactName": "wavevr-lib",
      "abi": "arm64-v8a",
      "output": "C:\\Users\\olivi\\Documents\\wondavr\\wvrmobile\\app\\..\\third_party\\wavesdk\\build\\wvr_client\\jni\\arm64-v8a\\libwvr_api.so"
    },
    "oculusvr-lib-Debug-arm64-v8a": {
      "artifactName": "oculusvr-lib",
      "abi": "arm64-v8a",
      "output": "C:\\Users\\olivi\\Documents\\wondavr\\wvrmobile\\app\\..\\third_party\\ovr_mobile\\VrApi\\Libs\\Android\\arm64-v8a\\Release\\libvrapi.so"
    },
    "native-lib-Debug-arm64-v8a": {
      "artifactName": "native-lib",
      "buildCommand": "C:\\Users\\olivi\\AppData\\Local\\Android\\Sdk\\cmake\\3.6.4111459\\bin\\cmake.exe --build C:\\Users\\olivi\\Documents\\wondavr\\wvrmobile\\app\\.cxx\\cmake\\wavevrArm64Debug\\arm64-v8a --target native-lib",
      "abi": "arm64-v8a",
      "output": "C:\\Users\\olivi\\Documents\\wondavr\\wvrmobile\\app\\build\\intermediates\\cmake\\wavevrArm64Debug\\obj\\arm64-v8a\\libnative-lib.so"
    },
    "ovrplatform-lib-Debug-arm64-v8a": {
      "artifactName": "ovrplatform-lib",
      "abi": "arm64-v8a",
      "output": "C:\\Users\\olivi\\Documents\\wondavr\\wvrmobile\\app\\..\\third_party\\OVRPlatformSDK\\Android\\libs\\arm64-v8a\\libovrplatformloader.so"
    },
    "svr-lib-Debug-arm64-v8a": {
      "artifactName": "svr-lib",
      "abi": "arm64-v8a",
      "output": "C:\\Users\\olivi\\Documents\\wondavr\\wvrmobile\\app\\..\\third_party\\svr\\libs\\arm64-v8a\\libsvrapi.so"
    },
    "googlevr-lib-Debug-arm64-v8a": {
      "artifactName": "googlevr-lib",
      "abi": "arm64-v8a",
      "output": "C:\\Users\\olivi\\Documents\\wondavr\\wvrmobile\\app\\..\\gvr-android-sdk\\libraries\\jni\\arm64-v8a\\libgvr.so"
    }
  }
}