{
  "buildFiles": [
    "C:\\Users\\olivi\\Documents\\wondavr\\wvrmobile\\app\\CMakeLists.txt",
    "C:\\Users\\olivi\\Documents\\wondavr\\wvrmobile\\app\\src\\main\\cpp\\vrb\\src\\CMakeLists.txt"
  ],
  "cleanCommands": [
    "C:\\Users\\olivi\\AppData\\Local\\Android\\Sdk\\cmake\\3.6.4111459\\bin\\cmake.exe --build C:\\Users\\olivi\\Documents\\wondavr\\wvrmobile\\app\\.cxx\\cmake\\oculusvrArmDebug\\armeabi-v7a --target clean"
  ],
  "libraries": {
    "native_app_glue-Debug-armeabi-v7a": {
      "artifactName": "native_app_glue",
      "buildCommand": "C:\\Users\\olivi\\AppData\\Local\\Android\\Sdk\\cmake\\3.6.4111459\\bin\\cmake.exe --build C:\\Users\\olivi\\Documents\\wondavr\\wvrmobile\\app\\.cxx\\cmake\\oculusvrArmDebug\\armeabi-v7a --target native_app_glue",
      "abi": "armeabi-v7a",
      "output": "C:\\Users\\olivi\\Documents\\wondavr\\wvrmobile\\app\\.cxx\\cmake\\oculusvrArmDebug\\armeabi-v7a\\libnative_app_glue.a"
    },
    "ovrplatform-lib-Debug-armeabi-v7a": {
      "artifactName": "ovrplatform-lib",
      "abi": "armeabi-v7a",
      "output": "C:\\Users\\olivi\\Documents\\wondavr\\wvrmobile\\app\\..\\third_party\\OVRPlatformSDK\\Android\\libs\\armeabi-v7a\\libovrplatformloader.so"
    },
    "vrb-Debug-armeabi-v7a": {
      "artifactName": "vrb",
      "buildCommand": "C:\\Users\\olivi\\AppData\\Local\\Android\\Sdk\\cmake\\3.6.4111459\\bin\\cmake.exe --build C:\\Users\\olivi\\Documents\\wondavr\\wvrmobile\\app\\.cxx\\cmake\\oculusvrArmDebug\\armeabi-v7a --target vrb",
      "abi": "armeabi-v7a",
      "output": "C:\\Users\\olivi\\Documents\\wondavr\\wvrmobile\\app\\.cxx\\cmake\\oculusvrArmDebug\\armeabi-v7a\\src\\main\\cpp\\vrb\\src\\libvrb.a"
    },
    "oculusvr-lib-Debug-armeabi-v7a": {
      "artifactName": "oculusvr-lib",
      "abi": "armeabi-v7a",
      "output": "C:\\Users\\olivi\\Documents\\wondavr\\wvrmobile\\app\\..\\third_party\\ovr_mobile\\VrApi\\Libs\\Android\\armeabi-v7a\\Release\\libvrapi.so"
    },
    "googlevr-lib-Debug-armeabi-v7a": {
      "artifactName": "googlevr-lib",
      "abi": "armeabi-v7a",
      "output": "C:\\Users\\olivi\\Documents\\wondavr\\wvrmobile\\app\\..\\gvr-android-sdk\\libraries\\jni\\armeabi-v7a\\libgvr.so"
    },
    "native-lib-Debug-armeabi-v7a": {
      "artifactName": "native-lib",
      "buildCommand": "C:\\Users\\olivi\\AppData\\Local\\Android\\Sdk\\cmake\\3.6.4111459\\bin\\cmake.exe --build C:\\Users\\olivi\\Documents\\wondavr\\wvrmobile\\app\\.cxx\\cmake\\oculusvrArmDebug\\armeabi-v7a --target native-lib",
      "abi": "armeabi-v7a",
      "output": "C:\\Users\\olivi\\Documents\\wondavr\\wvrmobile\\app\\build\\intermediates\\cmake\\oculusvrArmDebug\\obj\\armeabi-v7a\\libnative-lib.so"
    },
    "svr-lib-Debug-armeabi-v7a": {
      "artifactName": "svr-lib",
      "abi": "armeabi-v7a",
      "output": "C:\\Users\\olivi\\Documents\\wondavr\\wvrmobile\\app\\..\\third_party\\svr\\libs\\armeabi-v7a\\libsvrapi.so"
    },
    "wavevr-lib-Debug-armeabi-v7a": {
      "artifactName": "wavevr-lib",
      "abi": "armeabi-v7a",
      "output": "C:\\Users\\olivi\\Documents\\wondavr\\wvrmobile\\app\\..\\third_party\\wavesdk\\build\\wvr_client\\jni\\armeabi-v7a\\libwvr_api.so"
    }
  }
}