{
  "variant": {
    "module": {
      "rootBuildGradleFolder": "C:\\Users\\olivi\\Documents\\wondavr\\wvrmobile",
      "sdkFolder": "C:\\Users\\olivi\\AppData\\Local\\Android\\Sdk",
      "isNativeCompilerSettingsCacheEnabled": false,
      "isBuildOnlyTargetAbiEnabled": true,
      "splitsAbiFilterSet": [],
      "intermediatesFolder": "C:\\Users\\olivi\\Documents\\wondavr\\wvrmobile\\app\\build\\intermediates",
      "gradleModulePathName": ":app",
      "moduleRootFolder": "C:\\Users\\olivi\\Documents\\wondavr\\wvrmobile\\app",
      "makeFile": "C:\\Users\\olivi\\Documents\\wondavr\\wvrmobile\\app\\CMakeLists.txt",
      "buildSystem": "CMAKE",
      "compilerSettingsCacheFolder": "C:\\Users\\olivi\\Documents\\wondavr\\wvrmobile\\.cxx",
      "cxxFolder": "C:\\Users\\olivi\\Documents\\wondavr\\wvrmobile\\app\\.cxx",
      "ndkFolder": "C:\\Users\\olivi\\AppData\\Local\\Android\\Sdk\\ndk-bundle",
      "ndkVersion": "20.0.5594570",
      "ndkSupportedAbiList": [
        "ARMEABI_V7A",
        "ARM64_V8A",
        "X86",
        "X86_64"
      ],
      "ndkDefaultAbiList": [
        "ARMEABI_V7A",
        "ARM64_V8A",
        "X86",
        "X86_64"
      ],
      "cmakeToolchainFile": "."
    },
    "buildSystemArgumentList": [
      "-DANDROID_STL\u003dc++_shared",
      "-DVR_SDK_LIB\u003doculusvr-lib",
      "-DVR_SDK_EXTRA_LIB\u003dovrplatform-lib",
      "-DOCULUSVR\u003dON"
    ],
    "cFlagList": [],
    "cppFlagsList": [
      "-std\u003dc++14 -fexceptions -frtti -Werror -IC:\\Users\\olivi\\Documents\\wondavr\\wvrmobile\\app\\src\\main\\cpp -IC:\\Users\\olivi\\Documents\\wondavr\\wvrmobile\\app\\src\\main\\cpp\\vrb\\include",
      " -IC:\\Users\\olivi\\Documents\\wondavr\\wvrmobile\\third_party\\ovr_mobile\\VrApi\\Include -IC:\\Users\\olivi\\Documents\\wondavr\\wvrmobile\\third_party\\OVRPlatformSDK\\Include -IC:\\Users\\olivi\\Documents\\wondavr\\wvrmobile\\app\\src\\oculusvr\\cpp -DOCULUSVR -DSTORE_BUILD\u003d0"
    ],
    "variantName": "oculusvrArmDebug",
    "soFolder": "C:\\Users\\olivi\\Documents\\wondavr\\wvrmobile\\app\\build\\intermediates\\cmake\\oculusvrArmDebug\\lib",
    "objFolder": "C:\\Users\\olivi\\Documents\\wondavr\\wvrmobile\\app\\build\\intermediates\\cmake\\oculusvrArmDebug\\obj",
    "jsonFolder": "C:\\Users\\olivi\\Documents\\wondavr\\wvrmobile\\app\\.cxx\\cmake\\oculusvrArmDebug",
    "gradleBuildOutputFolder": "C:\\Users\\olivi\\Documents\\wondavr\\wvrmobile\\app\\.cxx\\cxx\\oculusvrArmDebug",
    "isDebuggableEnabled": true,
    "validAbiList": [
      "ARMEABI_V7A"
    ],
    "buildTargetSet": []
  },
  "abi": "ARMEABI_V7A",
  "abiPlatformVersion": 24,
  "cxxBuildFolder": "C:\\Users\\olivi\\Documents\\wondavr\\wvrmobile\\app\\.cxx\\cmake\\oculusvrArmDebug\\armeabi-v7a",
  "jsonFile": "C:\\Users\\olivi\\Documents\\wondavr\\wvrmobile\\app\\.cxx\\cmake\\oculusvrArmDebug\\armeabi-v7a\\android_gradle_build.json",
  "gradleBuildOutputFolder": "C:\\Users\\olivi\\Documents\\wondavr\\wvrmobile\\app\\.cxx\\cxx\\oculusvrArmDebug\\armeabi-v7a",
  "objFolder": "C:\\Users\\olivi\\Documents\\wondavr\\wvrmobile\\app\\build\\intermediates\\cmake\\oculusvrArmDebug\\obj\\armeabi-v7a",
  "buildCommandFile": "C:\\Users\\olivi\\Documents\\wondavr\\wvrmobile\\app\\.cxx\\cmake\\oculusvrArmDebug\\armeabi-v7a\\build_command.txt",
  "buildOutputFile": "C:\\Users\\olivi\\Documents\\wondavr\\wvrmobile\\app\\.cxx\\cmake\\oculusvrArmDebug\\armeabi-v7a\\build_output.txt",
  "modelOutputFile": "C:\\Users\\olivi\\Documents\\wondavr\\wvrmobile\\app\\.cxx\\cmake\\oculusvrArmDebug\\armeabi-v7a\\build_model.json",
  "cmake": {
    "cmakeListsWrapperFile": "C:\\Users\\olivi\\Documents\\wondavr\\wvrmobile\\app\\.cxx\\cxx\\oculusvrArmDebug\\armeabi-v7a\\CMakeLists.txt",
    "toolchainWrapperFile": "C:\\Users\\olivi\\Documents\\wondavr\\wvrmobile\\app\\.cxx\\cxx\\oculusvrArmDebug\\armeabi-v7a\\android_gradle_build.toolchain.cmake",
    "buildGenerationStateFile": "C:\\Users\\olivi\\Documents\\wondavr\\wvrmobile\\app\\.cxx\\cxx\\oculusvrArmDebug\\armeabi-v7a\\build_generation_state.json",
    "cacheKeyFile": "C:\\Users\\olivi\\Documents\\wondavr\\wvrmobile\\app\\.cxx\\cxx\\oculusvrArmDebug\\armeabi-v7a\\compiler_cache_key.json",
    "compilerCacheUseFile": "C:\\Users\\olivi\\Documents\\wondavr\\wvrmobile\\app\\.cxx\\cxx\\oculusvrArmDebug\\armeabi-v7a\\compiler_cache_use.json",
    "compilerCacheWriteFile": "C:\\Users\\olivi\\Documents\\wondavr\\wvrmobile\\app\\.cxx\\cxx\\oculusvrArmDebug\\armeabi-v7a\\compiler_cache_write.json",
    "toolchainSettingsFromCacheFile": "C:\\Users\\olivi\\Documents\\wondavr\\wvrmobile\\app\\.cxx\\cxx\\oculusvrArmDebug\\armeabi-v7a\\compiler_settings_cache.cmake",
    "cmakeWrappingBaseFolder": "."
  },
  "jsonGenerationLoggingRecordFile": "C:\\Users\\olivi\\Documents\\wondavr\\wvrmobile\\app\\.cxx\\cmake\\oculusvrArmDebug\\armeabi-v7a\\json_generation_record.json",
  "compileCommandsJsonFile": "C:\\Users\\olivi\\Documents\\wondavr\\wvrmobile\\app\\.cxx\\cmake\\oculusvrArmDebug\\armeabi-v7a\\compile_commands.json"
}