Scenario,Channel,Cost,CPC
S1,AdWordsKeyword1,100,2.46
S1,AdWordsKeyword2,100,0.81
S1,AdWordsKeyword3,100,1.22
S1,Blogger1,100,1.67
S1,Blogger2,100,0.38
S1,CompanyWebpage,100,0.75
S1,Email1,100,1.26
S1,Email2,100,1.56
S1,Email3,100,1.32
S1,Email4,100,8.62
S1,Influencer1,100,0.93
S1,Influencer5,100,0.55
S1,Influencer6,100,5.26
S1,Influencer7,100,0.35
S1,Movie_PPL,100,14.27
S1,Newspaper1,100,5.18
S1,Newspaper2,100,1.26
S1,Newspaper3,100,0.2
S1,PriceCompare,100,0.15
S1,Retargeting1,100,0.11
S1,Retargeting2,100,3.69
S1,Search1,100,0.07
S1,Search2,100,10.58
S1,Search3,100,0.16
S1,SNS1,100,22.83
S1,SNS2,100,0.12
S1,SNS3,100,14.29
S1,SNS4,100,4.78
S1,TV_Show,100,0.8
S1,Youtuber1,100,0.26
S1,Youtuber2,100,0.22
S1,Youtuber3,100,2.86
S1,Youtuber4,100,2.86
S1,Youtuber5,100,0.49
S2,AdWordsKeyword1,120,2.95
S2,AdWordsKeyword2,120,0.98
S2,AdWordsKeyword3,120,1.46
S2,Blogger1,63,1.05
S2,Blogger2,63,0.24
S2,CompanyWebpage,77,0.57
S2,Email1,77,0.97
S2,Email2,77,1.2
S2,Email3,77,1.02
S2,Email4,77,6.64
S2,Influencer1,63,0.58
S2,Influencer5,63,0.35
S2,Influencer6,63,3.32
S2,Influencer7,63,0.22
S2,Movie_PPL,352.5,50.29
S2,Newspaper1,77,3.99
S2,Newspaper2,77,0.97
S2,Newspaper3,77,0.15
S2,PriceCompare,120,0.19
S2,Retargeting1,77,0.08
S2,Retargeting2,77,2.84
S2,Search1,120,0.09
S2,Search2,120,12.7
S2,Search3,120,0.2
S2,SNS1,63,14.38
S2,SNS2,63,0.08
S2,SNS3,63,9
S2,SNS4,63,3.01
S2,TV_Show,352.5,2.82
S2,Youtuber1,91,0.23
S2,Youtuber2,91,0.2
S2,Youtuber3,91,2.6
S2,Youtuber4,91,2.6
S2,Youtuber5,91,0.45
S3,AdWordsKeyword1,18,0.44
S3,AdWordsKeyword2,53,0.43
S3,AdWordsKeyword3,36,0.44
S3,Blogger1,26,0.43
S3,Blogger2,114,0.43
S3,CompanyWebpage,58,0.43
S3,Email1,34,0.43
S3,Email2,28,0.44
S3,Email3,33,0.44
S3,Email4,5,0.43
S3,Influencer1,47,0.44
S3,Influencer5,79,0.43
S3,Influencer6,8,0.42
S3,Influencer7,125,0.43
S3,Movie_PPL,3,0.43
S3,Newspaper1,8,0.41
S3,Newspaper2,34,0.43
S3,Newspaper3,218,0.43
S3,PriceCompare,280,0.43
S3,Retargeting1,398,0.43
S3,Retargeting2,12,0.44
S3,Search1,602,0.43
S3,Search2,4,0.42
S3,Search3,265,0.43
S3,SNS1,2,0.46
S3,SNS2,364,0.43
S3,SNS3,3,0.43
S3,SNS4,9,0.43
S3,TV_Show,54,0.43
S3,Youtuber1,168,0.43
S3,Youtuber2,194,0.43
S3,Youtuber3,15,0.43
S3,Youtuber4,15,0.43
S3,Youtuber5,88,0.43
S4,AdWordsKeyword1,12,0.29
S4,AdWordsKeyword2,12,0.1
S4,AdWordsKeyword3,12,0.15
S4,Blogger1,118,1.97
S4,Blogger2,118,0.45
S4,CompanyWebpage,118,0.88
S4,Email1,118,1.49
S4,Email2,118,1.84
S4,Email3,118,1.56
S4,Email4,118,10.17
S4,Influencer1,59,0.55
S4,Influencer5,59,0.32
S4,Influencer6,59,3.11
S4,Influencer7,59,0.2
S4,Movie_PPL,236,33.67
S4,Newspaper1,118,6.11
S4,Newspaper2,118,1.49
S4,Newspaper3,118,0.23
S4,PriceCompare,118,0.18
S4,Retargeting1,118,0.13
S4,Retargeting2,118,4.35
S4,Search1,118,0.08
S4,Search2,118,12.49
S4,Search3,118,0.19
S4,SNS1,118,26.94
S4,SNS2,118,0.14
S4,SNS3,118,16.86
S4,SNS4,118,5.65
S4,TV_Show,237,1.89
S4,Youtuber1,59,0.15
S4,Youtuber2,59,0.13
S4,Youtuber3,59,1.69
S4,Youtuber4,59,1.69
S4,Youtuber5,59,0.29
S5,AdWordsKeyword1,10,0.25
S5,AdWordsKeyword2,10,0.08
S5,AdWordsKeyword3,10,0.12
S5,Blogger1,104,1.74
S5,Blogger2,104,0.39
S5,CompanyWebpage,104,0.78
S5,Email1,104,1.31
S5,Email2,104,1.63
S5,Email3,104,1.38
S5,Email4,104,8.97
S5,Influencer1,52,0.48
S5,Influencer5,52,0.29
S5,Influencer6,52,2.74
S5,Influencer7,52,0.18
S5,Movie_PPL,206,29.39
S5,Newspaper1,104,5.39
S5,Newspaper2,104,1.31
S5,Newspaper3,104,0.21
S5,PriceCompare,104,0.16
S5,Retargeting1,309,0.34
S5,Retargeting2,309,11.4
S5,Search1,104,0.07
S5,Search2,104,11.01
S5,Search3,104,0.17
S5,SNS1,104,23.74
S5,SNS2,104,0.12
S5,SNS3,104,14.86
S5,SNS4,104,4.98
S5,TV_Show,206,1.65
S5,Youtuber1,52,0.13
S5,Youtuber2,52,0.12
S5,Youtuber3,52,1.49
S5,Youtuber4,52,1.49
S5,Youtuber5,52,0.25
PO1,Conversion1,1,
PO1,Conversion2,1,
PO1,Conversion3,1,
PO1,Conversion4,1,
PO1,Conversion5,1,
PO1,Conversion6,1,
PO1,Conversion7,1,
PO1,Conversion8,1,
PO1,Conversion9,1,
PO1,Conversion10,1,
PO1,Conversion11,1,
PO1,Conversion12,1,
PO1,Conversion13,1,
PO2,Conversion1,50,
PO2,Conversion2,55,
PO2,Conversion3,60,
PO2,Conversion4,65,
PO2,Conversion5,70,
PO2,Conversion6,75,
PO2,Conversion7,80,
PO2,Conversion8,85,
PO2,Conversion9,90,
PO2,Conversion10,95,
PO2,Conversion11,100,
PO2,Conversion12,0,
PO2,Conversion13,0,
PO3,Conversion1,50,
PO3,Conversion2,55,
PO3,Conversion3,60,
PO3,Conversion4,65,
PO3,Conversion5,70,
PO3,Conversion6,75,
PO3,Conversion7,80,
PO3,Conversion8,85,
PO3,Conversion9,90,
PO3,Conversion10,190,
PO3,Conversion11,200,
PO3,Conversion12,0,
PO3,Conversion13,0,
PO4,Conversion1,45,
PO4,Conversion2,49.5,
PO4,Conversion3,54,
PO4,Conversion4,58.5,
PO4,Conversion5,63,
PO4,Conversion6,67.5,
PO4,Conversion7,72,
PO4,Conversion8,76.5,
PO4,Conversion9,81,
PO4,Conversion10,114,
PO4,Conversion11,120,
PO4,Conversion12,0,
PO4,Conversion13,0,
PO5,Conversion1,0.1,
PO5,Conversion2,0.1,
PO5,Conversion3,0.1,
PO5,Conversion4,0.1,
PO5,Conversion5,0.1,
PO5,Conversion6,0.1,
PO5,Conversion7,0.1,
PO5,Conversion8,0.1,
PO5,Conversion9,0.1,
PO5,Conversion10,0.4,
PO5,Conversion11,0.4,
PO5,Conversion12,0,
PO5,Conversion13,0,
