{"nodes":[
{"name":"TV_Show"},
{"name":"Youtuber1"},
{"name":"PriceCompare"},
{"name":"NoConversion"},
{"name":"Youtuber2"},
{"name":"Youtuber5"},
{"name":"Youtuber4"},
{"name":"Youtuber3"},
{"name":"Email4"},
{"name":"Email3"},
{"name":"Email2"},
{"name":"Email1"},
{"name":"Conversion13"},
{"name":"Conversion3"},
{"name":"Conversion4"},
{"name":"Retargeting1"},
{"name":"Conversion12"},
{"name":"Retargeting2"},
{"name":"Conversion7"},
{"name":"Conversion5"},
{"name":"Conversion6"},
{"name":"Conversion1"},
{"name":"Conversion2"},
{"name":"AdWordsKeyword1"},
{"name":"AdWordsKeyword2"},
{"name":"AdWordsKeyword3"},
{"name":"Search1"},
{"name":"Movie_PPL"},
{"name":"SNS4"},
{"name":"SNS3"},
{"name":"Conversion11"},
{"name":"Conversion10"},
{"name":"Conversion9"},
{"name":"Conversion8"},
{"name":"SNS1"},
{"name":"SNS2"},
{"name":"Newspaper3"},
{"name":"Search3"},
{"name":"Influencer1"},
{"name":"CompanyWebpage"},
{"name":"Blogger2"},
{"name":"Blogger1"},
{"name":"Newspaper1"},
{"name":"Newspaper2"},
{"name":"Search2"},
{"name":"Influencer5"},
{"name":"Influencer6"},
{"name":"Influencer7"}
],
"links":[
{"source":0,"target":1,"value":35.384},
{"source":1,"target":2,"value":0.656},
{"source":1,"target":3,"value":29.519},
{"source":1,"target":4,"value":308.046},
{"source":1,"target":5,"value":89.169},
{"source":6,"target":2,"value":38.462
},
{"source":7,"target":4,"value":38.462
},
{"source":8,"target":9,"value":15.073
},
{"source":10,"target":9,"value":83.071
},
{"source":9,"target":4,"value":98.144
},
{"source":11,"target":12,"value":13.817
},
{"source":11,"target":13,"value":29.227
},
{"source":11,"target":14,"value":59.979
},
{"source":15,"target":16,"value":135.653
},
{"source":15,"target":14,"value":147.696
},
{"source":15,"target":17,"value":35.247
},
{"source":15,"target":12,"value":444.37
},
{"source":15,"target":18,"value":49.087
},
{"source":15,"target":19,"value":5.73
},
{"source":15,"target":13,"value":53.062
},
{"source":15,"target":3,"value":73.625
},
{"source":15,"target":20,"value":10.212
},
{"source":15,"target":21,"value":116.894
},
{"source":15,"target":22,"value":121.421
},
{"source":23,"target":24,"value":33.933
},
{"source":25,"target":24,"value":68.528
},
{"source":5,"target":13,"value":0.142
},
{"source":5,"target":3,"value":1.54
},
{"source":5,"target":26,"value":166.913
},
{"source":5,"target":19,"value":2.303
},
{"source":5,"target":12,"value":53.385
},
{"source":27,"target":15,"value":1.99
},
{"source":17,"target":28,"value":27.139
},
{"source":17,"target":3,"value":8.106
},
{"source":28,"target":18,"value":33.17
},
{"source":29,"target":15,"value":11.103
},
{"source":2,"target":12,"value":100.888
},
{"source":2,"target":30,"value":107.242
},
{"source":2,"target":18,"value":113.196
},
{"source":2,"target":31,"value":12.048
},
{"source":2,"target":32,"value":171.889
},
{"source":2,"target":19,"value":3.033
},
{"source":2,"target":33,"value":27.682
},
{"source":2,"target":20,"value":3.678
},
{"source":34,"target":1,"value":6.944
},
{"source":24,"target":5,"value":102.46
},
{"source":35,"target":26,"value":1333.298
},
{"source":36,"target":37,"value":654.918
},
{"source":38,"target":37,"value":170.957
},
{"source":37,"target":2,"value":509.992
},
{"source":39,"target":4,"value":73.49
},
{"source":39,"target":1,"value":101.052
},
{"source":40,"target":14,"value":306.39
},
{"source":40,"target":13,"value":112.178
},
{"source":41,"target":15,"value":95.081
},
{"source":42,"target":14,"value":25.017
},
{"source":43,"target":42,"value":25.017
},
{"source":43,"target":41,"value":77.794
},
{"source":4,"target":19,"value":0.969
},
{"source":4,"target":26,"value":439.692
},
{"source":4,"target":12,"value":51.074
},
{"source":26,"target":15,"value":437.943
},
{"source":26,"target":3,"value":655.941
},
{"source":26,"target":11,"value":66.108
},
{"source":44,"target":15,"value":7.877
},
{"source":45,"target":1,"value":288.905
},
{"source":46,"target":15,"value":30.179
},
{"source":47,"target":15,"value":459.311
}
]}
