{
  "version": 1,
  "notes": "",
  "documentation": "\"This file is a QMK Configurator export. You can import this at <https://config.qmk.fm>. It can also be used directly with QMK's source code.\n\nTo setup your QMK environment check out the tutorial: <https://docs.qmk.fm/#/newbs>\n\nYou can convert this file to a keymap.c using this command: `qmk json2c {keymap}`\n\nYou can compile this keymap using this command: `qmk compile {keymap}`\"\n",
  "keyboard": "keebio/iris/rev6",
  "keymap": "keebio_iris_rev6_layout_mine",
  "layout": "LAYOUT",
  "layers": [
    [
      "QK_GESC",
      "KC_1",
      "KC_2",
      "KC_3",
      "KC_4",
      "KC_5",
      "KC_6",
      "KC_7",
      "KC_8",
      "KC_9",
      "KC_0",
      "KC_BSPC",
      "KC_TAB",
      "KC_Q",
      "KC_W",
      "KC_E",
      "KC_R",
      "KC_T",
      "KC_Y",
      "KC_U",
      "KC_I",
      "KC_O",
      "KC_P",
      "KC_EQL",
      "KC_LCTL",
      "KC_A",
      "KC_S",
      "KC_D",
      "KC_F",
      "KC_G",
      "KC_H",
      "KC_J",
      "KC_K",
      "KC_L",
      "KC_SCLN",
      "KC_QUOT",
      "LSFT_T(KC_CAPS)",
      "KC_Z",
      "KC_X",
      "KC_C",
      "KC_V",
      "KC_B",
      "KC_ENT",
      "KC_ENT",
      "KC_N",
      "KC_M",
      "KC_COMM",
      "KC_DOT",
      "KC_SLSH",
      "LSFT_T(KC_CAPS)",
      "KC_LGUI",
      "MO(2)",
      "LALT_T(KC_SPC)",
      "RALT_T(KC_SPC)",
      "MO(1)",
      "KC_BSLS"
    ],
    [
      "KC_GRV",
      "KC_EXLM",
      "KC_AT",
      "KC_HASH",
      "KC_DLR",
      "KC_PERC",
      "KC_CIRC",
      "KC_AMPR",
      "KC_ASTR",
      "KC_LPRN",
      "KC_RPRN",
      "KC_DEL",
      "KC_NO",
      "KC_NO",
      "KC_NO",
      "KC_NO",
      "KC_NO",
      "KC_NO",
      "KC_NO",
      "KC_NO",
      "KC_MINS",
      "KC_LBRC",
      "KC_RBRC",
      "KC_BSLS",
      "KC_LCTL",
      "BL_STEP",
      "KC_NO",
      "KC_NO",
      "KC_NO",
      "KC_NO",
      "KC_LEFT",
      "KC_DOWN",
      "KC_UP",
      "KC_RGHT",
      "KC_NO",
      "KC_NO",
      "KC_LSFT",
      "KC_NO",
      "KC_NO",
      "KC_NO",
      "KC_NO",
      "KC_LCBR",
      "KC_LPRN",
      "KC_RPRN",
      "KC_RCBR",
      "KC_NO",
      "KC_NO",
      "KC_NO",
      "KC_NO",
      "KC_RSFT",
      "KC_LGUI",
      "MO(3)",
      "LALT_T(KC_SPC)",
      "RALT_T(KC_SPC)",
      "KC_NO",
      "KC_NO"
    ],
    [
      "KC_F1",
      "KC_F2",
      "KC_F3",
      "KC_F4",
      "KC_F5",
      "KC_F6",
      "KC_F7",
      "KC_F8",
      "KC_F9",
      "KC_F10",
      "KC_F11",
      "KC_F12",
      "RGB_TOG",
      "KC_NO",
      "KC_NO",
      "KC_NO",
      "KC_BSPC",
      "KC_DEL",
      "KC_NO",
      "KC_MPLY",
      "KC_MSTP",
      "KC_NO",
      "KC_NO",
      "KC_NO",
      "RGB_MOD",
      "KC_NO",
      "KC_HOME",
      "KC_PGDN",
      "KC_PGUP",
      "KC_END",
      "KC_MPRV",
      "KC_VOLD",
      "KC_VOLU",
      "KC_MNXT",
      "RGB_VAI",
      "KC_BSLS",
      "KC_PSCR",
      "KC_NO",
      "KC_NO",
      "KC_NO",
      "KC_NO",
      "KC_NO",
      "KC_NO",
      "KC_NO",
      "KC_NO",
      "KC_NO",
      "KC_NO",
      "KC_NO",
      "KC_NO",
      "KC_NO",
      "KC_LGUI",
      "KC_NO",
      "LALT_T(KC_SPC)",
      "RALT_T(KC_SPC)",
      "MO(3)",
      "KC_NO"
    ],
    [
      "QK_BOOT",
      "RGB_MOD",
      "RGB_HUI",
      "RGB_SAI",
      "RGB_VAI",
      "RGB_SPI",
      "KC_TRNS",
      "KC_TRNS",
      "KC_TRNS",
      "KC_TRNS",
      "KC_TRNS",
      "RGB_TOG",
      "KC_TRNS",
      "RGB_RMOD",
      "RGB_HUD",
      "RGB_SAD",
      "RGB_VAD",
      "RGB_SPD",
      "KC_TRNS",
      "KC_TRNS",
      "KC_TRNS",
      "KC_TRNS",
      "KC_TRNS",
      "KC_TRNS",
      "RGB_M_SW",
      "RGB_M_SN",
      "RGB_M_K",
      "RGB_M_X",
      "RGB_M_G",
      "RGB_M_T",
      "RGB_M_P",
      "RGB_M_B",
      "RGB_M_R",
      "KC_TRNS",
      "KC_TRNS",
      "KC_TRNS",
      "KC_TRNS",
      "KC_TRNS",
      "KC_TRNS",
      "KC_TRNS",
      "KC_TRNS",
      "KC_TRNS",
      "KC_TRNS",
      "KC_TRNS",
      "KC_TRNS",
      "KC_TRNS",
      "KC_TRNS",
      "KC_TRNS",
      "KC_TRNS",
      "KC_TRNS",
      "KC_LGUI",
      "KC_TRNS",
      "KC_TRNS",
      "KC_TRNS",
      "KC_TRNS",
      "KC_TRNS"
    ]
  ],
  "author": ""
}