M48
;Layer_Color=9474304
;FILE_FORMAT=2:4
INCH,TZ
;TYPE=PLATED
T2F00S00C0.0177
T5F00S00C0.0315
;TYPE=NON_PLATED
%
G90
G05
T02
G00X11841Y421
M15
G01Y854
M16
G00X14065Y421
M15
G01Y854
M16
T05
G00X4508Y7559
M15
G01X3642
M16
G00X2972Y9016
M15
G01Y9882
M16
G00X5256Y9016
M15
G01Y9882
M16
M17
M30
