M48
;Layer_Color=9474304
;FILE_FORMAT=2:4
INCH,TZ
;TYPE=PLATED
T1F00S00C0.0157
T2F00S00C0.0433
T3F00S00C0.0591
T4F00S00C0.0669
;TYPE=NON_PLATED
T5F00S00C0.0433
%
T01
X1772Y1575
X2559Y3150
X5542Y2323
X6496Y1575
X8071
X9646
X11220
X12795
X12008Y3150
X10433
X8858
X7008Y2913
X6063Y3949
X6496Y4724
X8071
X9646
X11220
X11085Y7125
X11650Y7492
X12215Y7886
X12780Y7886
X13201Y9291
X12780Y11364
X12215
X11650
X11085Y11364
X11085Y10070
X10709Y9517
X11085Y8890
X10320
X9449Y8818
X8762Y8746
Y8170
X8312Y7830
X8064Y8818
X7229Y8873
X6837Y9055
X6446Y9238
X6054Y9420
X5663Y9603
X5271Y9785
X4880Y9968
X4334Y10012
X4567Y11614
X5295
X5728
X6161
X6594
X7028
X7461
X7821Y11874
X8661Y11890
X9267
X8858Y12598
X8445Y14045
X9646Y14173
X10433Y15748
X12008
X13359Y15380
Y14281
Y13375
X11732Y12402
X9193Y10480
X8760
X7820Y10422
X6496Y7874
X5551Y7930
X5010
X3346Y7874
X4050Y6339
X2559Y6299
X2570Y5748
X1772Y11024
X2469Y12677
X1874Y13425
X2283Y15007
X2531Y15827
Y16240
X1950Y15886
X1772Y17323
X1545Y18125
X2008
X2471
Y19224
X2008
X1545
X5245Y19271
Y19726
X5292Y20177
X6196Y19950
X6732Y19409
X7283Y18898
X7028Y17795
X6594
X6212Y18133
Y18587
X5245Y18363
Y18817
Y17908
X4893Y17224
X4839Y15000
X4921Y14173
X4800Y13701
Y13268
X4754Y12627
X5876Y14409
X6329Y15433
X7283Y15748
X7008Y16575
X7894
Y17813
X8922Y17937
X8858Y15748
X11220Y17323
X12795
X12810Y19220
X12008Y18898
X12090Y6575
X9395Y7222
X9570Y7830
X8071Y20472
X6185Y20481
X5251Y20611
X5245Y21065
X6732Y21102
X6690Y22992
X4763
X5728Y23973
X8071Y23622
X9646
X11220
X12008Y22047
X10433
X8858
X12810Y20652
X2047Y21361
X3346Y23622
T02
X591Y2886
Y3886
X13976
Y2886
Y4886
Y5886
Y6886
Y7886
Y8886
Y9886
Y10886
Y11886
Y12886
Y13886
Y14886
Y15886
Y16886
Y17886
Y18886
Y19886
X591
Y18886
Y17886
Y16886
Y15886
Y14886
Y13886
Y12886
Y11886
Y10886
Y9886
Y8886
Y7886
Y6886
Y5886
Y4886
Y20886
Y21886
Y22886
Y23886
X13976
Y22886
Y21886
Y20886
T03
X2687Y1343
X5049
X4971Y4540
X2766
X3868Y4815
X5728Y22992
T04
X4728Y21992
Y23992
X6728
Y21992
T05
X3868Y799
Y3555
M30
