G04*
G04 #@! TF.GenerationSoftware,Altium Limited,Altium Designer,20.2.4 (192)*
G04*
G04 Layer_Physical_Order=2*
G04 Layer_Color=14186556*
%FSLAX25Y25*%
%MOIN*%
G70*
G04*
G04 #@! TF.SameCoordinates,F46D5B9C-7259-40F9-AC0D-4A53EF35EDC1*
G04*
G04*
G04 #@! TF.FilePolarity,Positive*
G04*
G01*
G75*
%ADD33C,0.01500*%
%ADD38R,0.03543X0.02362*%
%ADD39R,0.02362X0.03543*%
%ADD50C,0.01000*%
%ADD51C,0.00700*%
%ADD52C,0.02000*%
%ADD56R,0.03150X0.03150*%
%ADD57C,0.09843*%
%ADD58C,0.09055*%
%ADD59C,0.08858*%
%ADD60C,0.10039*%
%ADD61C,0.07874*%
%ADD62R,0.07874X0.07874*%
%ADD63C,0.03543*%
G04:AMPARAMS|DCode=64|XSize=15.75mil|YSize=68.9mil|CornerRadius=0mil|HoleSize=0mil|Usage=FLASHONLY|Rotation=90.000|XOffset=0mil|YOffset=0mil|HoleType=Round|Shape=Octagon|*
%AMOCTAGOND64*
4,1,8,-0.03445,-0.00394,-0.03445,0.00394,-0.03051,0.00787,0.03051,0.00787,0.03445,0.00394,0.03445,-0.00394,0.03051,-0.00787,-0.03051,-0.00787,-0.03445,-0.00394,0.0*
%
%ADD64OCTAGOND64*%

%ADD65O,0.06890X0.01575*%
%ADD66R,0.02165X0.03150*%
%ADD67R,0.02756X0.02362*%
%ADD68C,0.00800*%
G36*
X144353Y241441D02*
X144042Y241300D01*
X143753Y241276D01*
X143071Y242165D01*
X142102Y242909D01*
X140974Y243376D01*
X139764Y243535D01*
X138553Y243376D01*
X137425Y242909D01*
X136457Y242165D01*
X135713Y241197D01*
X135246Y240069D01*
X135087Y238858D01*
X135246Y237648D01*
X135713Y236520D01*
X136457Y235551D01*
X137425Y234808D01*
X138553Y234341D01*
X139764Y234181D01*
X140974Y234341D01*
X142102Y234808D01*
X143071Y235551D01*
X143753Y236441D01*
X144042Y236417D01*
X144353Y236275D01*
Y231441D01*
X144042Y231300D01*
X143753Y231276D01*
X143071Y232165D01*
X142102Y232909D01*
X140974Y233376D01*
X139764Y233535D01*
X138553Y233376D01*
X137425Y232909D01*
X136457Y232165D01*
X135713Y231197D01*
X135357Y230337D01*
X128254D01*
X125645Y232945D01*
X125166Y233266D01*
X124600Y233378D01*
X122353D01*
Y234361D01*
X118591D01*
Y229418D01*
X118945D01*
Y228357D01*
X118591D01*
Y226362D01*
X118504Y226303D01*
X116404Y224203D01*
X114676D01*
Y228357D01*
X111111D01*
Y223808D01*
X111111D01*
X111253Y223208D01*
X108912Y220867D01*
X108592Y220387D01*
X108479Y219821D01*
Y201883D01*
X108176Y201680D01*
X107629Y200862D01*
X107438Y199898D01*
X107629Y198933D01*
X108176Y198116D01*
X108993Y197570D01*
X109958Y197378D01*
X110922Y197570D01*
X111740Y198116D01*
X112286Y198933D01*
X112478Y199898D01*
X112286Y200862D01*
X111740Y201680D01*
X111436Y201883D01*
Y214359D01*
X114193D01*
X114751Y214259D01*
X115235Y214259D01*
X116134D01*
Y216634D01*
X117134D01*
Y214259D01*
X118033D01*
X118517Y214259D01*
X119090Y214196D01*
X119164Y213296D01*
X118985Y213102D01*
X118985D01*
Y208158D01*
X122747D01*
Y209006D01*
X123347Y209389D01*
X124063Y209246D01*
X125027Y209438D01*
X125845Y209985D01*
X126391Y210802D01*
X126583Y211767D01*
X126391Y212731D01*
X125845Y213548D01*
X125027Y214095D01*
X124063Y214287D01*
X123098Y214095D01*
X122690Y213822D01*
X122543Y213893D01*
X122157Y214359D01*
X122157Y214359D01*
X122157D01*
Y215155D01*
X123917D01*
X124483Y215268D01*
X124963Y215588D01*
X125997Y216623D01*
X128850D01*
Y220385D01*
X123906D01*
Y218714D01*
X123305Y218112D01*
X122157D01*
Y218909D01*
X121852D01*
Y219646D01*
X121740Y220212D01*
X121419Y220692D01*
X120541Y221570D01*
X120061Y221891D01*
X119495Y222003D01*
X119169D01*
X118940Y222558D01*
X120128Y223746D01*
X120510Y223364D01*
X120989Y223044D01*
X121555Y222931D01*
X123906D01*
Y222528D01*
X128850D01*
Y226291D01*
X123906D01*
Y225888D01*
X122167D01*
X122157Y225899D01*
Y228357D01*
X121902D01*
Y229418D01*
X122353D01*
Y230422D01*
X123988D01*
X126596Y227813D01*
X127076Y227492D01*
X127642Y227380D01*
X135357D01*
X135713Y226520D01*
X136457Y225551D01*
X137425Y224808D01*
X138553Y224341D01*
X139536Y224211D01*
Y223606D01*
X138527Y223473D01*
X137375Y222996D01*
X136385Y222237D01*
X135626Y221247D01*
X135149Y220095D01*
X135117Y219858D01*
X139764D01*
Y217858D01*
X135117D01*
X135149Y217622D01*
X135626Y216469D01*
X136385Y215480D01*
X137375Y214721D01*
X138527Y214243D01*
X139153Y214161D01*
Y213556D01*
X138527Y213473D01*
X137375Y212996D01*
X136385Y212237D01*
X135626Y211247D01*
X135149Y210095D01*
X135117Y209858D01*
X139764D01*
Y207858D01*
X135117D01*
X135149Y207622D01*
X135626Y206469D01*
X136385Y205480D01*
X137375Y204720D01*
X138527Y204243D01*
X139536Y204110D01*
Y203505D01*
X138553Y203376D01*
X137425Y202909D01*
X136457Y202165D01*
X135713Y201197D01*
X135246Y200069D01*
X135087Y198858D01*
X135246Y197648D01*
X135713Y196520D01*
X136457Y195551D01*
X137425Y194808D01*
X138553Y194341D01*
X139764Y194181D01*
X140974Y194341D01*
X142102Y194808D01*
X143071Y195551D01*
X143753Y196441D01*
X144042Y196417D01*
X144353Y196275D01*
Y191442D01*
X144042Y191300D01*
X143753Y191276D01*
X143071Y192165D01*
X142102Y192909D01*
X140974Y193376D01*
X139764Y193535D01*
X138553Y193376D01*
X137425Y192909D01*
X136457Y192165D01*
X135713Y191197D01*
X135246Y190069D01*
X135087Y188858D01*
X135246Y187648D01*
X135713Y186520D01*
X136457Y185551D01*
X137425Y184808D01*
X138553Y184341D01*
X139764Y184181D01*
X140974Y184341D01*
X142102Y184808D01*
X143071Y185551D01*
X143753Y186441D01*
X144042Y186417D01*
X144353Y186275D01*
Y181441D01*
X144042Y181300D01*
X143753Y181276D01*
X143071Y182165D01*
X142102Y182909D01*
X140974Y183376D01*
X139764Y183535D01*
X138553Y183376D01*
X137425Y182909D01*
X136457Y182165D01*
X135713Y181197D01*
X135246Y180069D01*
X135087Y178858D01*
X135246Y177648D01*
X135713Y176520D01*
X136457Y175551D01*
X137425Y174808D01*
X138553Y174341D01*
X139764Y174181D01*
X140974Y174341D01*
X142102Y174808D01*
X143071Y175551D01*
X143753Y176441D01*
X144042Y176417D01*
X144353Y176275D01*
Y171441D01*
X144042Y171300D01*
X143753Y171276D01*
X143071Y172165D01*
X142102Y172909D01*
X140974Y173376D01*
X139764Y173535D01*
X138553Y173376D01*
X137425Y172909D01*
X136457Y172165D01*
X135713Y171197D01*
X135246Y170069D01*
X135087Y168858D01*
X135246Y167648D01*
X135713Y166520D01*
X136457Y165551D01*
X137425Y164808D01*
X138553Y164341D01*
X139764Y164181D01*
X140974Y164341D01*
X142102Y164808D01*
X143071Y165551D01*
X143753Y166441D01*
X144042Y166417D01*
X144353Y166275D01*
Y161442D01*
X144042Y161300D01*
X143753Y161276D01*
X143071Y162165D01*
X142102Y162909D01*
X140974Y163376D01*
X139764Y163535D01*
X138553Y163376D01*
X137425Y162909D01*
X136457Y162165D01*
X135713Y161197D01*
X135246Y160069D01*
X135087Y158858D01*
X135246Y157648D01*
X135713Y156520D01*
X136457Y155551D01*
X137425Y154808D01*
X138553Y154341D01*
X139764Y154181D01*
X140974Y154341D01*
X142102Y154808D01*
X143071Y155551D01*
X143753Y156441D01*
X144042Y156417D01*
X144353Y156275D01*
Y151442D01*
X144042Y151300D01*
X143753Y151276D01*
X143071Y152165D01*
X142102Y152909D01*
X140974Y153376D01*
X139764Y153535D01*
X138553Y153376D01*
X137425Y152909D01*
X136457Y152165D01*
X135713Y151197D01*
X135246Y150069D01*
X135087Y148858D01*
X135246Y147648D01*
X135713Y146520D01*
X136457Y145551D01*
X137425Y144808D01*
X138553Y144341D01*
X139536Y144211D01*
Y143606D01*
X138527Y143473D01*
X137375Y142996D01*
X136385Y142237D01*
X135626Y141247D01*
X135149Y140095D01*
X135117Y139858D01*
X139764D01*
Y137858D01*
X135117D01*
X135149Y137622D01*
X135626Y136469D01*
X136385Y135480D01*
X137375Y134721D01*
X138527Y134243D01*
X139536Y134110D01*
Y133505D01*
X138553Y133376D01*
X137425Y132909D01*
X136457Y132165D01*
X135713Y131197D01*
X135246Y130069D01*
X135087Y128858D01*
X135246Y127648D01*
X135713Y126520D01*
X136457Y125551D01*
X137425Y124808D01*
X138553Y124341D01*
X139764Y124181D01*
X140974Y124341D01*
X142102Y124808D01*
X143071Y125551D01*
X143753Y126441D01*
X144042Y126417D01*
X144353Y126275D01*
Y121441D01*
X144042Y121300D01*
X143753Y121276D01*
X143071Y122165D01*
X142102Y122909D01*
X140974Y123376D01*
X139764Y123535D01*
X138553Y123376D01*
X137425Y122909D01*
X136457Y122165D01*
X135713Y121197D01*
X135246Y120069D01*
X135087Y118858D01*
X135246Y117648D01*
X135713Y116520D01*
X136457Y115551D01*
X137425Y114808D01*
X138553Y114341D01*
X139764Y114181D01*
X140974Y114341D01*
X142102Y114808D01*
X143071Y115551D01*
X143753Y116441D01*
X144042Y116417D01*
X144353Y116275D01*
Y111442D01*
X144042Y111300D01*
X143753Y111276D01*
X143071Y112165D01*
X142102Y112909D01*
X140974Y113376D01*
X139764Y113535D01*
X138553Y113376D01*
X137425Y112909D01*
X136457Y112165D01*
X135713Y111197D01*
X135246Y110069D01*
X135087Y108858D01*
X135246Y107648D01*
X135713Y106520D01*
X136457Y105551D01*
X137425Y104808D01*
X138553Y104341D01*
X139764Y104181D01*
X140974Y104341D01*
X142102Y104808D01*
X143071Y105551D01*
X143753Y106441D01*
X144042Y106417D01*
X144353Y106275D01*
Y101442D01*
X144042Y101300D01*
X143753Y101276D01*
X143071Y102165D01*
X142102Y102909D01*
X140974Y103376D01*
X139764Y103535D01*
X138553Y103376D01*
X137425Y102909D01*
X136457Y102165D01*
X135713Y101197D01*
X135246Y100069D01*
X135087Y98858D01*
X135246Y97648D01*
X135713Y96520D01*
X136457Y95551D01*
X137425Y94808D01*
X138553Y94341D01*
X139536Y94211D01*
Y93606D01*
X138527Y93473D01*
X137375Y92996D01*
X136385Y92237D01*
X135626Y91247D01*
X135149Y90095D01*
X135117Y89858D01*
X139764D01*
Y87858D01*
X135117D01*
X135149Y87622D01*
X135626Y86469D01*
X136385Y85480D01*
X137375Y84720D01*
X138527Y84243D01*
X139536Y84110D01*
Y83505D01*
X138553Y83376D01*
X137425Y82909D01*
X136457Y82165D01*
X135713Y81197D01*
X135246Y80069D01*
X135087Y78858D01*
X135246Y77648D01*
X135713Y76520D01*
X136457Y75551D01*
X137425Y74808D01*
X138553Y74341D01*
X139764Y74181D01*
X140974Y74341D01*
X142102Y74808D01*
X143071Y75551D01*
X143753Y76441D01*
X144042Y76417D01*
X144353Y76275D01*
Y71442D01*
X144042Y71300D01*
X143753Y71276D01*
X143071Y72165D01*
X142102Y72909D01*
X140974Y73376D01*
X139764Y73535D01*
X138553Y73376D01*
X137425Y72909D01*
X136457Y72165D01*
X135713Y71197D01*
X135246Y70069D01*
X135087Y68858D01*
X135246Y67648D01*
X135713Y66520D01*
X136457Y65551D01*
X137425Y64808D01*
X138553Y64341D01*
X139764Y64181D01*
X140974Y64341D01*
X142102Y64808D01*
X143071Y65551D01*
X143753Y66441D01*
X144042Y66417D01*
X144353Y66275D01*
Y61441D01*
X144042Y61300D01*
X143753Y61276D01*
X143071Y62165D01*
X142102Y62909D01*
X140974Y63376D01*
X139764Y63535D01*
X138553Y63376D01*
X137425Y62909D01*
X137102Y62661D01*
X134525Y65237D01*
X134630Y65765D01*
X134439Y66730D01*
X133892Y67547D01*
X133075Y68094D01*
X132110Y68285D01*
X131146Y68094D01*
X130328Y67547D01*
X130223Y67390D01*
X129623D01*
X129518Y67547D01*
X128701Y68094D01*
X127737Y68285D01*
X126772Y68094D01*
X126480Y67898D01*
X125880Y68219D01*
Y69213D01*
X125880Y69213D01*
X125799Y69622D01*
X125567Y69970D01*
X123375Y72161D01*
X123542Y73000D01*
X123351Y73964D01*
X122804Y74782D01*
X121987Y75328D01*
X121022Y75520D01*
X120058Y75328D01*
X119240Y74782D01*
X118694Y73964D01*
X118502Y73000D01*
X118694Y72036D01*
X119240Y71218D01*
X120058Y70672D01*
X121022Y70480D01*
X121861Y70647D01*
X123739Y68769D01*
Y67862D01*
X123139Y67680D01*
X123042Y67825D01*
X122224Y68372D01*
X121260Y68563D01*
X120296Y68372D01*
X119478Y67825D01*
X118932Y67008D01*
X118740Y66043D01*
X118932Y65079D01*
X119478Y64261D01*
X119781Y64059D01*
Y61724D01*
X118788D01*
Y57961D01*
X123732D01*
Y59206D01*
X124331Y59455D01*
X132229Y51557D01*
Y45322D01*
X132311Y44912D01*
X132543Y44565D01*
X135799Y41309D01*
X135713Y41197D01*
X135246Y40069D01*
X135087Y38858D01*
X135246Y37648D01*
X135713Y36520D01*
X136457Y35551D01*
X137425Y34808D01*
X138553Y34341D01*
X139657Y34195D01*
X139618Y33595D01*
X135027D01*
Y29858D01*
X139764D01*
Y28858D01*
X140764D01*
Y24121D01*
X144353D01*
Y1316D01*
X1316D01*
Y24221D01*
X10543D01*
Y33495D01*
X1316D01*
Y36275D01*
X1628Y36417D01*
X1916Y36441D01*
X2598Y35551D01*
X3567Y34808D01*
X4695Y34341D01*
X5906Y34181D01*
X7116Y34341D01*
X8244Y34808D01*
X9213Y35551D01*
X9956Y36520D01*
X10423Y37648D01*
X10582Y38858D01*
X10423Y40069D01*
X9956Y41197D01*
X9213Y42165D01*
X8244Y42909D01*
X7116Y43376D01*
X5906Y43535D01*
X4695Y43376D01*
X3567Y42909D01*
X2598Y42165D01*
X1916Y41276D01*
X1628Y41300D01*
X1316Y41442D01*
Y46275D01*
X1628Y46417D01*
X1916Y46441D01*
X2598Y45551D01*
X3567Y44808D01*
X4695Y44341D01*
X5906Y44181D01*
X7116Y44341D01*
X8244Y44808D01*
X9213Y45551D01*
X9956Y46520D01*
X10423Y47648D01*
X10582Y48858D01*
X10423Y50069D01*
X9956Y51197D01*
X9213Y52165D01*
X8244Y52909D01*
X7116Y53376D01*
X5906Y53535D01*
X4695Y53376D01*
X3567Y52909D01*
X2598Y52165D01*
X1916Y51276D01*
X1628Y51300D01*
X1316Y51442D01*
Y56275D01*
X1628Y56417D01*
X1916Y56441D01*
X2598Y55551D01*
X3567Y54808D01*
X4695Y54341D01*
X5906Y54181D01*
X7116Y54341D01*
X8244Y54808D01*
X9213Y55551D01*
X9956Y56520D01*
X10423Y57648D01*
X10582Y58858D01*
X10423Y60069D01*
X9956Y61197D01*
X9213Y62165D01*
X8244Y62909D01*
X7116Y63376D01*
X5906Y63535D01*
X4695Y63376D01*
X3567Y62909D01*
X2598Y62165D01*
X1916Y61276D01*
X1628Y61300D01*
X1316Y61441D01*
Y66275D01*
X1628Y66417D01*
X1916Y66441D01*
X2598Y65551D01*
X3567Y64808D01*
X4695Y64341D01*
X5906Y64181D01*
X7116Y64341D01*
X8244Y64808D01*
X9213Y65551D01*
X9956Y66520D01*
X10423Y67648D01*
X10582Y68858D01*
X10423Y70069D01*
X9956Y71197D01*
X9213Y72165D01*
X8244Y72909D01*
X7116Y73376D01*
X5906Y73535D01*
X4695Y73376D01*
X3567Y72909D01*
X2598Y72165D01*
X1916Y71276D01*
X1628Y71300D01*
X1316Y71442D01*
Y76275D01*
X1628Y76417D01*
X1916Y76441D01*
X2598Y75551D01*
X3567Y74808D01*
X4695Y74341D01*
X5906Y74181D01*
X7116Y74341D01*
X8244Y74808D01*
X9213Y75551D01*
X9956Y76520D01*
X10423Y77648D01*
X10582Y78858D01*
X10423Y80069D01*
X9956Y81197D01*
X9213Y82165D01*
X8244Y82909D01*
X7116Y83376D01*
X5906Y83535D01*
X4695Y83376D01*
X3567Y82909D01*
X2598Y82165D01*
X1916Y81276D01*
X1628Y81300D01*
X1316Y81441D01*
Y86275D01*
X1628Y86417D01*
X1916Y86441D01*
X2598Y85551D01*
X3567Y84808D01*
X4695Y84341D01*
X5906Y84181D01*
X7116Y84341D01*
X8244Y84808D01*
X9213Y85551D01*
X9956Y86520D01*
X10423Y87648D01*
X10582Y88858D01*
X10423Y90069D01*
X9956Y91197D01*
X9213Y92165D01*
X8244Y92909D01*
X7116Y93376D01*
X5906Y93535D01*
X4695Y93376D01*
X3567Y92909D01*
X2598Y92165D01*
X1916Y91276D01*
X1628Y91300D01*
X1316Y91442D01*
Y96275D01*
X1628Y96417D01*
X1916Y96441D01*
X2598Y95551D01*
X3567Y94808D01*
X4695Y94341D01*
X5906Y94181D01*
X7116Y94341D01*
X8244Y94808D01*
X9213Y95551D01*
X9956Y96520D01*
X10423Y97648D01*
X10582Y98858D01*
X10423Y100069D01*
X9956Y101197D01*
X9213Y102165D01*
X8244Y102909D01*
X7116Y103376D01*
X5906Y103535D01*
X4695Y103376D01*
X3567Y102909D01*
X2598Y102165D01*
X1916Y101276D01*
X1628Y101300D01*
X1316Y101442D01*
Y106275D01*
X1628Y106417D01*
X1916Y106441D01*
X2598Y105551D01*
X3567Y104808D01*
X4695Y104341D01*
X5906Y104181D01*
X7116Y104341D01*
X8244Y104808D01*
X9213Y105551D01*
X9956Y106520D01*
X10423Y107648D01*
X10582Y108858D01*
X10423Y110069D01*
X9956Y111197D01*
X9213Y112165D01*
X8244Y112909D01*
X7116Y113376D01*
X5906Y113535D01*
X4695Y113376D01*
X3567Y112909D01*
X2598Y112165D01*
X1916Y111276D01*
X1628Y111300D01*
X1316Y111442D01*
Y116275D01*
X1628Y116417D01*
X1916Y116441D01*
X2598Y115551D01*
X3567Y114808D01*
X4695Y114341D01*
X5906Y114181D01*
X7116Y114341D01*
X8244Y114808D01*
X9213Y115551D01*
X9956Y116520D01*
X10423Y117648D01*
X10582Y118858D01*
X10423Y120069D01*
X9956Y121197D01*
X9213Y122165D01*
X8244Y122909D01*
X7116Y123376D01*
X6134Y123505D01*
Y124110D01*
X7142Y124243D01*
X8294Y124721D01*
X9284Y125480D01*
X10043Y126469D01*
X10521Y127622D01*
X10552Y127858D01*
X5906D01*
Y129858D01*
X10552D01*
X10521Y130095D01*
X10043Y131247D01*
X9284Y132237D01*
X8294Y132996D01*
X7142Y133473D01*
X6134Y133606D01*
Y134211D01*
X7116Y134341D01*
X8244Y134808D01*
X9213Y135551D01*
X9956Y136520D01*
X10423Y137648D01*
X10582Y138858D01*
X10423Y140069D01*
X9956Y141197D01*
X9683Y141552D01*
X13853Y146320D01*
X13895Y146394D01*
X14168Y146803D01*
X14255Y147236D01*
X14285Y147339D01*
X14285Y147341D01*
X14284Y147345D01*
X14285Y147349D01*
X15541Y163574D01*
X15588Y163688D01*
X18004Y167145D01*
X20521Y167140D01*
X20831Y166540D01*
X20650Y166269D01*
X20627Y166150D01*
X24803D01*
Y165650D01*
X25303D01*
Y164031D01*
X27461D01*
X27494Y164038D01*
X28004Y163527D01*
X27919Y163102D01*
X28111Y162137D01*
X28657Y161320D01*
X29475Y160774D01*
X30439Y160582D01*
X30965Y160686D01*
X31260Y160133D01*
X30739Y159612D01*
X30507Y159265D01*
X30426Y158855D01*
Y158556D01*
X29714Y158081D01*
X29168Y157264D01*
X28976Y156299D01*
X29168Y155335D01*
X29714Y154517D01*
X30532Y153971D01*
X31496Y153779D01*
X32460Y153971D01*
X33278Y154517D01*
X33367Y154650D01*
X33967Y154468D01*
Y145279D01*
X34049Y144869D01*
X34280Y144522D01*
X36252Y142550D01*
X36600Y142318D01*
X37009Y142236D01*
X37561D01*
X38037Y141525D01*
X38161Y141442D01*
Y140842D01*
X38037Y140758D01*
X37490Y139941D01*
X37298Y138976D01*
X37490Y138012D01*
X38037Y137194D01*
X38854Y136648D01*
X39819Y136456D01*
X40783Y136648D01*
X41600Y137194D01*
X42076Y137906D01*
X42606D01*
X43016Y137987D01*
X43363Y138219D01*
X44302Y139158D01*
X44534Y139505D01*
X44616Y139915D01*
Y148995D01*
X57441Y161820D01*
X57995Y161590D01*
Y146195D01*
X50239Y138439D01*
X50007Y138091D01*
X49926Y137682D01*
Y132572D01*
X49214Y132097D01*
X48668Y131279D01*
X48476Y130315D01*
X48668Y129351D01*
X49214Y128533D01*
X50032Y127987D01*
X50996Y127795D01*
X51960Y127987D01*
X52778Y128533D01*
X53324Y129351D01*
X53516Y130315D01*
X53324Y131279D01*
X53055Y131682D01*
X53416Y132222D01*
X53900Y132126D01*
X54864Y132317D01*
X55682Y132864D01*
X56228Y133681D01*
X56420Y134646D01*
X56228Y135610D01*
X55682Y136428D01*
X54971Y136903D01*
Y137874D01*
X61228Y144131D01*
X61460Y144478D01*
X61541Y144888D01*
Y174808D01*
X61460Y175218D01*
X61228Y175565D01*
X61228Y175565D01*
X55032Y181761D01*
X54685Y181993D01*
X54275Y182074D01*
X50969D01*
X50944Y182101D01*
X50711Y182655D01*
X50722Y182703D01*
X50909Y182983D01*
X50923Y183055D01*
X50989Y183153D01*
X51071Y183563D01*
X50989Y183973D01*
X50932Y184058D01*
X50944Y184121D01*
X51008Y184278D01*
X51287Y184658D01*
X52056D01*
Y183686D01*
X55818D01*
Y188630D01*
X55818Y188630D01*
X55822Y189228D01*
X56325Y189980D01*
X56517Y190945D01*
X56325Y191909D01*
X55779Y192727D01*
X54961Y193273D01*
X53997Y193465D01*
X53032Y193273D01*
X52215Y192727D01*
X51669Y191909D01*
X51477Y190945D01*
X51669Y189980D01*
X52170Y189230D01*
X52056Y188630D01*
X52056D01*
Y187615D01*
X51129D01*
X50995Y187937D01*
Y188303D01*
X51071Y188681D01*
X50995Y189060D01*
Y189425D01*
X50252Y190168D01*
X43449D01*
X43032Y189752D01*
X42224D01*
X41815Y189670D01*
X41467Y189438D01*
X31286Y179257D01*
X31054Y178910D01*
X30973Y178500D01*
Y165989D01*
X30509Y165608D01*
X30439Y165622D01*
X29654Y165466D01*
X29526Y165507D01*
X29160Y165739D01*
X29037Y165859D01*
X28956Y166269D01*
X28758Y166565D01*
X28533Y167136D01*
X28862Y167628D01*
X28977Y168209D01*
X28862Y168789D01*
X28675Y169069D01*
X28580Y169488D01*
X28675Y169908D01*
X28862Y170187D01*
X28977Y170768D01*
X28862Y171348D01*
X28533Y171840D01*
Y172254D01*
X28862Y172746D01*
X28977Y173327D01*
X28862Y173907D01*
X28675Y174187D01*
X28580Y174606D01*
X28675Y175026D01*
X28862Y175305D01*
X28977Y175886D01*
X28862Y176466D01*
X28675Y176746D01*
X28580Y177165D01*
X28675Y177585D01*
X28862Y177865D01*
X28977Y178445D01*
X28862Y179025D01*
X28675Y179305D01*
X28580Y179724D01*
X28675Y180144D01*
X28862Y180424D01*
X28977Y181004D01*
X28862Y181584D01*
X28675Y181864D01*
X28580Y182283D01*
X28675Y182703D01*
X28862Y182983D01*
X28977Y183563D01*
X28862Y184143D01*
X28758Y184299D01*
X29079Y184898D01*
X29761D01*
X30229Y184992D01*
X30626Y185257D01*
X31967Y186599D01*
X32233Y186996D01*
X32326Y187464D01*
Y192410D01*
X32983D01*
Y197353D01*
X29221D01*
Y196105D01*
X28460D01*
X27243Y197322D01*
X26846Y197587D01*
X26378Y197680D01*
X25955D01*
X25582Y198239D01*
X24764Y198785D01*
X23800Y198977D01*
X22836Y198785D01*
X22018Y198239D01*
X21472Y197421D01*
X21280Y196457D01*
X21472Y195492D01*
X22018Y194675D01*
X22836Y194128D01*
X23800Y193937D01*
X24764Y194128D01*
X25582Y194675D01*
X25659Y194790D01*
X26256Y194849D01*
X27088Y194017D01*
X27485Y193752D01*
X27953Y193658D01*
X29221D01*
Y192410D01*
X29879D01*
Y188144D01*
X29390Y187704D01*
X29324Y187713D01*
X29239Y187784D01*
X28916Y188374D01*
X28977Y188681D01*
X28862Y189261D01*
X28533Y189753D01*
X28041Y190082D01*
X27461Y190198D01*
X22146D01*
X21565Y190082D01*
X21073Y189753D01*
X21065Y189741D01*
X17894Y189683D01*
X11667Y203876D01*
X11433Y204426D01*
Y204426D01*
X11433D01*
X11094Y204933D01*
X11094D01*
X11086Y204933D01*
X9791Y206304D01*
X9956Y206520D01*
X10423Y207648D01*
X10582Y208858D01*
X10423Y210069D01*
X9956Y211197D01*
X9213Y212165D01*
X8244Y212909D01*
X7116Y213376D01*
X5906Y213535D01*
X4695Y213376D01*
X3567Y212909D01*
X2598Y212165D01*
X1916Y211276D01*
X1628Y211300D01*
X1316Y211441D01*
Y216275D01*
X1628Y216417D01*
X1916Y216441D01*
X2598Y215551D01*
X3567Y214808D01*
X4695Y214341D01*
X5906Y214181D01*
X7116Y214341D01*
X8244Y214808D01*
X9213Y215551D01*
X9956Y216520D01*
X10423Y217648D01*
X10582Y218858D01*
X10423Y220069D01*
X9956Y221197D01*
X9213Y222165D01*
X8244Y222909D01*
X7116Y223376D01*
X5906Y223535D01*
X4695Y223376D01*
X3567Y222909D01*
X2598Y222165D01*
X1916Y221276D01*
X1628Y221300D01*
X1316Y221442D01*
Y226275D01*
X1628Y226417D01*
X1916Y226441D01*
X2598Y225551D01*
X3567Y224808D01*
X4695Y224341D01*
X5906Y224181D01*
X7116Y224341D01*
X8244Y224808D01*
X9213Y225551D01*
X9956Y226520D01*
X10423Y227648D01*
X10582Y228858D01*
X10423Y230069D01*
X9956Y231197D01*
X9213Y232165D01*
X8244Y232909D01*
X7116Y233376D01*
X5906Y233535D01*
X4695Y233376D01*
X3567Y232909D01*
X2598Y232165D01*
X1916Y231276D01*
X1628Y231300D01*
X1316Y231441D01*
Y236275D01*
X1628Y236417D01*
X1916Y236441D01*
X2598Y235551D01*
X3567Y234808D01*
X4695Y234341D01*
X5906Y234181D01*
X7116Y234341D01*
X8244Y234808D01*
X9213Y235551D01*
X9956Y236520D01*
X10423Y237648D01*
X10582Y238858D01*
X10423Y240069D01*
X9956Y241197D01*
X9213Y242165D01*
X8244Y242909D01*
X7116Y243376D01*
X5906Y243535D01*
X4695Y243376D01*
X3567Y242909D01*
X2598Y242165D01*
X1916Y241276D01*
X1628Y241300D01*
X1316Y241441D01*
Y246716D01*
X73514D01*
X73603Y246116D01*
X73589Y246111D01*
X72578Y245571D01*
X71692Y244844D01*
X70964Y243957D01*
X70424Y242947D01*
X70091Y241849D01*
X70077Y241709D01*
X75827D01*
X81576D01*
X81562Y241849D01*
X81230Y242947D01*
X80689Y243957D01*
X79962Y244844D01*
X79076Y245571D01*
X78065Y246111D01*
X78050Y246116D01*
X78139Y246716D01*
X93514D01*
X93603Y246116D01*
X93589Y246111D01*
X92578Y245571D01*
X91692Y244844D01*
X90965Y243957D01*
X90424Y242947D01*
X90091Y241849D01*
X90077Y241709D01*
X95827D01*
X101576D01*
X101562Y241849D01*
X101230Y242947D01*
X100689Y243957D01*
X99962Y244844D01*
X99076Y245571D01*
X98065Y246111D01*
X98050Y246116D01*
X98139Y246716D01*
X144353D01*
Y241441D01*
D02*
G37*
%LPC*%
G36*
X132283Y244488D02*
X123622D01*
Y235827D01*
X132283D01*
Y244488D01*
D02*
G37*
G36*
X94827Y239709D02*
X90077D01*
X90091Y239568D01*
X90424Y238471D01*
X90965Y237460D01*
X91692Y236574D01*
X92578Y235846D01*
X93589Y235306D01*
X94686Y234973D01*
X94827Y234959D01*
Y239709D01*
D02*
G37*
G36*
X74827D02*
X70077D01*
X70091Y239568D01*
X70424Y238471D01*
X70964Y237460D01*
X71692Y236574D01*
X72578Y235846D01*
X73589Y235306D01*
X74686Y234973D01*
X74827Y234959D01*
Y239709D01*
D02*
G37*
G36*
X101576D02*
X96827D01*
Y234959D01*
X96968Y234973D01*
X98065Y235306D01*
X99076Y235846D01*
X99962Y236574D01*
X100689Y237460D01*
X101230Y238471D01*
X101562Y239568D01*
X101576Y239709D01*
D02*
G37*
G36*
X81576D02*
X76827D01*
Y234959D01*
X76968Y234973D01*
X78065Y235306D01*
X79076Y235846D01*
X79962Y236574D01*
X80689Y237460D01*
X81230Y238471D01*
X81562Y239568D01*
X81576Y239709D01*
D02*
G37*
G36*
X116548Y234461D02*
X115067D01*
Y232390D01*
X116548D01*
Y234461D01*
D02*
G37*
G36*
X114067D02*
X112586D01*
Y232390D01*
X114067D01*
Y234461D01*
D02*
G37*
G36*
X116548Y231390D02*
X115067D01*
Y229318D01*
X116548D01*
Y231390D01*
D02*
G37*
G36*
X114067D02*
X112586D01*
Y229318D01*
X114067D01*
Y231390D01*
D02*
G37*
G36*
X85827Y238126D02*
X84380Y237984D01*
X82988Y237562D01*
X81706Y236876D01*
X80582Y235954D01*
X79659Y234830D01*
X78974Y233547D01*
X78552Y232156D01*
X78409Y230709D01*
X78552Y229262D01*
X78974Y227870D01*
X79659Y226588D01*
X80582Y225464D01*
X81706Y224541D01*
X82988Y223856D01*
X84380Y223434D01*
X85827Y223291D01*
X87274Y223434D01*
X88665Y223856D01*
X89948Y224541D01*
X91072Y225464D01*
X91994Y226588D01*
X92680Y227870D01*
X93102Y229262D01*
X93244Y230709D01*
X93102Y232156D01*
X92680Y233547D01*
X91994Y234830D01*
X91072Y235954D01*
X89948Y236876D01*
X88665Y237562D01*
X87274Y237984D01*
X85827Y238126D01*
D02*
G37*
G36*
X96827Y226458D02*
Y221709D01*
X101576D01*
X101562Y221849D01*
X101230Y222947D01*
X100689Y223957D01*
X99962Y224844D01*
X99076Y225571D01*
X98065Y226111D01*
X96968Y226444D01*
X96827Y226458D01*
D02*
G37*
G36*
X76827D02*
Y221709D01*
X81576D01*
X81562Y221849D01*
X81230Y222947D01*
X80689Y223957D01*
X79962Y224844D01*
X79076Y225571D01*
X78065Y226111D01*
X76968Y226444D01*
X76827Y226458D01*
D02*
G37*
G36*
X94827D02*
X94686Y226444D01*
X93589Y226111D01*
X92578Y225571D01*
X91692Y224844D01*
X90965Y223957D01*
X90424Y222947D01*
X90091Y221849D01*
X90077Y221709D01*
X94827D01*
Y226458D01*
D02*
G37*
G36*
X74827D02*
X74686Y226444D01*
X73589Y226111D01*
X72578Y225571D01*
X71692Y224844D01*
X70964Y223957D01*
X70424Y222947D01*
X70091Y221849D01*
X70077Y221709D01*
X74827D01*
Y226458D01*
D02*
G37*
G36*
X94827Y219709D02*
X90077D01*
X90091Y219568D01*
X90424Y218471D01*
X90965Y217460D01*
X91692Y216574D01*
X92578Y215846D01*
X93589Y215306D01*
X94686Y214973D01*
X94827Y214959D01*
Y219709D01*
D02*
G37*
G36*
X74827D02*
X70077D01*
X70091Y219568D01*
X70424Y218471D01*
X70964Y217460D01*
X71692Y216574D01*
X72578Y215846D01*
X73589Y215306D01*
X74686Y214973D01*
X74827Y214959D01*
Y219709D01*
D02*
G37*
G36*
X101576D02*
X96827D01*
Y214959D01*
X96968Y214973D01*
X98065Y215306D01*
X99076Y215846D01*
X99962Y216574D01*
X100689Y217460D01*
X101230Y218471D01*
X101562Y219568D01*
X101576Y219709D01*
D02*
G37*
G36*
X81576D02*
X76827D01*
Y214959D01*
X76968Y214973D01*
X78065Y215306D01*
X79076Y215846D01*
X79962Y216574D01*
X80689Y217460D01*
X81230Y218471D01*
X81562Y219568D01*
X81576Y219709D01*
D02*
G37*
G36*
X116942Y213202D02*
X115461D01*
Y211130D01*
X116942D01*
Y213202D01*
D02*
G37*
G36*
X114461D02*
X112979D01*
Y211130D01*
X114461D01*
Y213202D01*
D02*
G37*
G36*
X116942Y210130D02*
X115461D01*
Y208058D01*
X116942D01*
Y210130D01*
D02*
G37*
G36*
X114461D02*
X112979D01*
Y208058D01*
X114461D01*
Y210130D01*
D02*
G37*
G36*
X38989Y197453D02*
X37508D01*
Y195382D01*
X38989D01*
Y197453D01*
D02*
G37*
G36*
X36508D02*
X35027D01*
Y195382D01*
X36508D01*
Y197453D01*
D02*
G37*
G36*
X38989Y194382D02*
X37508D01*
Y192310D01*
X38989D01*
Y194382D01*
D02*
G37*
G36*
X36508D02*
X35027D01*
Y192310D01*
X36508D01*
Y194382D01*
D02*
G37*
G36*
X61824Y188730D02*
X60343D01*
Y186658D01*
X61824D01*
Y188730D01*
D02*
G37*
G36*
X59342D02*
X57861D01*
Y186658D01*
X59342D01*
Y188730D01*
D02*
G37*
G36*
X61824Y185658D02*
X60343D01*
Y183586D01*
X61824D01*
Y185658D01*
D02*
G37*
G36*
X59342D02*
X57861D01*
Y183586D01*
X59342D01*
Y185658D01*
D02*
G37*
G36*
X24303Y165150D02*
X20627D01*
X20650Y165030D01*
X21001Y164505D01*
X21526Y164154D01*
X22146Y164031D01*
X24303D01*
Y165150D01*
D02*
G37*
G36*
X100394Y186772D02*
X99429Y186580D01*
X98612Y186034D01*
X98065Y185216D01*
X97874Y184252D01*
X98065Y183288D01*
X98612Y182470D01*
X98915Y182267D01*
Y158093D01*
X91907Y151085D01*
X90961D01*
X90758Y151388D01*
X89941Y151935D01*
X88976Y152126D01*
X88012Y151935D01*
X87194Y151388D01*
X86648Y150571D01*
X86456Y149606D01*
X86648Y148642D01*
X87194Y147824D01*
X88012Y147278D01*
X88976Y147086D01*
X89941Y147278D01*
X90758Y147824D01*
X90961Y148128D01*
X92520D01*
X93085Y148240D01*
X93565Y148561D01*
X101439Y156435D01*
X101760Y156914D01*
X101872Y157480D01*
Y182267D01*
X102176Y182470D01*
X102722Y183288D01*
X102914Y184252D01*
X102722Y185216D01*
X102176Y186034D01*
X101358Y186580D01*
X100394Y186772D01*
D02*
G37*
G36*
X113479Y159727D02*
X112515Y159535D01*
X111697Y158989D01*
X111151Y158171D01*
X110959Y157207D01*
X111151Y156243D01*
X111697Y155425D01*
X112408Y154950D01*
Y150847D01*
X112490Y150437D01*
X112722Y150090D01*
X114356Y148456D01*
X114356Y148456D01*
X114703Y148223D01*
X115113Y148142D01*
X122419D01*
X122894Y147431D01*
X123712Y146884D01*
X124676Y146693D01*
X125640Y146884D01*
X126458Y147431D01*
X127004Y148248D01*
X127196Y149213D01*
X127004Y150177D01*
X126458Y150995D01*
X125640Y151541D01*
X124676Y151733D01*
X123712Y151541D01*
X122894Y150995D01*
X122419Y150283D01*
X115557D01*
X114550Y151290D01*
Y154950D01*
X115261Y155425D01*
X115807Y156243D01*
X115999Y157207D01*
X115807Y158171D01*
X115261Y158989D01*
X114444Y159535D01*
X113479Y159727D01*
D02*
G37*
G36*
X131085Y128504D02*
X130121Y128312D01*
X129304Y127766D01*
X128757Y126949D01*
X128565Y125984D01*
X128757Y125020D01*
X128967Y124706D01*
X128606Y124166D01*
X128570Y124174D01*
X127605Y123982D01*
X126788Y123435D01*
X126241Y122618D01*
X126050Y121653D01*
X126241Y120689D01*
X126451Y120376D01*
X126090Y119836D01*
X126054Y119843D01*
X125090Y119651D01*
X124272Y119105D01*
X123726Y118287D01*
X123534Y117323D01*
X123726Y116358D01*
X123935Y116045D01*
X123574Y115505D01*
X123538Y115512D01*
X122574Y115320D01*
X121756Y114774D01*
X121210Y113956D01*
X121018Y112992D01*
X121210Y112028D01*
X121407Y111732D01*
X121046Y111193D01*
X121022Y111197D01*
X120058Y111005D01*
X119240Y110459D01*
X118694Y109642D01*
X118502Y108677D01*
X118694Y107713D01*
X119240Y106895D01*
X119952Y106420D01*
Y89457D01*
X119240Y88982D01*
X118694Y88164D01*
X118502Y87200D01*
X118694Y86236D01*
X119240Y85418D01*
X120058Y84872D01*
X121022Y84680D01*
X121987Y84872D01*
X122247Y85045D01*
X122847Y84725D01*
Y81968D01*
X122418Y81682D01*
X121872Y80864D01*
X121680Y79900D01*
X121872Y78936D01*
X122418Y78118D01*
X123236Y77572D01*
X124200Y77380D01*
X125164Y77572D01*
X125982Y78118D01*
X126528Y78936D01*
X126720Y79900D01*
X126528Y80864D01*
X126191Y81369D01*
X126552Y81909D01*
X127200Y81780D01*
X128164Y81972D01*
X128982Y82518D01*
X129528Y83336D01*
X129720Y84300D01*
X129662Y84591D01*
X129968Y84844D01*
X130197Y84980D01*
X131109Y84798D01*
X132074Y84990D01*
X132891Y85536D01*
X133438Y86354D01*
X133630Y87318D01*
X133438Y88283D01*
X132891Y89100D01*
X132074Y89646D01*
X131109Y89838D01*
X130783Y89773D01*
X129768Y90789D01*
X129822Y91395D01*
X130319Y91656D01*
X130876Y91284D01*
X131841Y91092D01*
X132805Y91284D01*
X133623Y91830D01*
X134169Y92647D01*
X134361Y93612D01*
X134169Y94576D01*
X133623Y95394D01*
X132853Y95908D01*
Y96498D01*
X133569Y97214D01*
X133801Y97561D01*
X133882Y97971D01*
Y123803D01*
X133882Y123803D01*
X133801Y124212D01*
X133569Y124560D01*
X133291Y124837D01*
X133414Y125020D01*
X133606Y125984D01*
X133414Y126949D01*
X132867Y127766D01*
X132050Y128312D01*
X131085Y128504D01*
D02*
G37*
G36*
X24016Y137276D02*
X23051Y137084D01*
X22234Y136538D01*
X21688Y135721D01*
X21496Y134756D01*
X21688Y133792D01*
X22234Y132974D01*
X23051Y132428D01*
X24016Y132236D01*
X24980Y132428D01*
X25798Y132974D01*
X26000Y133278D01*
X32667D01*
X42188Y123758D01*
X42667Y123437D01*
X43233Y123325D01*
X55889D01*
X56092Y123021D01*
X56910Y122475D01*
X57874Y122283D01*
X58838Y122475D01*
X59656Y123021D01*
X60202Y123839D01*
X60394Y124803D01*
X60202Y125768D01*
X59656Y126585D01*
X58838Y127131D01*
X57874Y127323D01*
X56910Y127131D01*
X56092Y126585D01*
X55889Y126282D01*
X43845D01*
X34325Y135802D01*
X33846Y136122D01*
X33280Y136235D01*
X26000D01*
X25798Y136538D01*
X24980Y137084D01*
X24016Y137276D01*
D02*
G37*
G36*
X111024Y137166D02*
X110059Y136974D01*
X109242Y136428D01*
X108695Y135610D01*
X108503Y134646D01*
X108695Y133681D01*
X109242Y132864D01*
X109545Y132661D01*
Y85056D01*
X109242Y84853D01*
X108695Y84035D01*
X108503Y83071D01*
X108695Y82107D01*
X109242Y81289D01*
X110059Y80743D01*
X111024Y80551D01*
X111988Y80743D01*
X112806Y81289D01*
X113352Y82107D01*
X113544Y83071D01*
X113352Y84035D01*
X112806Y84853D01*
X112502Y85056D01*
Y132661D01*
X112806Y132864D01*
X113352Y133681D01*
X113544Y134646D01*
X113352Y135610D01*
X112806Y136428D01*
X111988Y136974D01*
X111024Y137166D01*
D02*
G37*
G36*
X117222Y145896D02*
X116257Y145704D01*
X115440Y145158D01*
X114893Y144340D01*
X114702Y143376D01*
X114893Y142411D01*
X115440Y141594D01*
X115859Y141314D01*
Y128039D01*
X114743Y126923D01*
X114511Y126576D01*
X114429Y126166D01*
Y78143D01*
X113128Y76842D01*
X112508D01*
Y77652D01*
X107565D01*
Y73890D01*
X112508D01*
Y74701D01*
X113571D01*
X113981Y74782D01*
X114328Y75014D01*
X116257Y76943D01*
X116257Y76943D01*
X116489Y77290D01*
X116571Y77700D01*
X116571Y77700D01*
Y125723D01*
X117686Y126839D01*
X117686Y126839D01*
X117918Y127186D01*
X118000Y127595D01*
X118000Y127596D01*
Y141010D01*
X118186Y141047D01*
X119004Y141594D01*
X119550Y142411D01*
X119742Y143376D01*
X119550Y144340D01*
X119004Y145158D01*
X118186Y145704D01*
X117222Y145896D01*
D02*
G37*
G36*
X106112Y66926D02*
X104631D01*
Y64854D01*
X106112D01*
Y66926D01*
D02*
G37*
G36*
X103631D02*
X102150D01*
Y64854D01*
X103631D01*
Y66926D01*
D02*
G37*
G36*
X106112Y63854D02*
X104631D01*
Y61782D01*
X106112D01*
Y63854D01*
D02*
G37*
G36*
X103631D02*
X102150D01*
Y61782D01*
X103631D01*
Y63854D01*
D02*
G37*
G36*
X72509Y62414D02*
X71028D01*
Y60343D01*
X72509D01*
Y62414D01*
D02*
G37*
G36*
X70028D02*
X68547D01*
Y60343D01*
X70028D01*
Y62414D01*
D02*
G37*
G36*
X103356Y60036D02*
X101678D01*
Y58555D01*
X103356D01*
Y60036D01*
D02*
G37*
G36*
X100678D02*
X99000D01*
Y58555D01*
X100678D01*
Y60036D01*
D02*
G37*
G36*
X64801Y66920D02*
X63836Y66728D01*
X63019Y66182D01*
X62472Y65364D01*
X62281Y64400D01*
X62472Y63436D01*
X62821Y62914D01*
X62741Y62314D01*
X62742Y62314D01*
Y57371D01*
X66504D01*
Y62314D01*
X66504D01*
X66720Y62824D01*
X67129Y63436D01*
X67321Y64400D01*
X67129Y65364D01*
X66583Y66182D01*
X65765Y66728D01*
X64801Y66920D01*
D02*
G37*
G36*
X72509Y59342D02*
X71028D01*
Y57271D01*
X72509D01*
Y59342D01*
D02*
G37*
G36*
X70028D02*
X68547D01*
Y57271D01*
X70028D01*
Y59342D01*
D02*
G37*
G36*
X103356Y57555D02*
X101678D01*
Y56073D01*
X103356D01*
Y57555D01*
D02*
G37*
G36*
X100678D02*
X99000D01*
Y56073D01*
X100678D01*
Y57555D01*
D02*
G37*
G36*
X99713Y50977D02*
Y46169D01*
X104520D01*
X104403Y47060D01*
X103866Y48356D01*
X103012Y49469D01*
X101899Y50323D01*
X100603Y50860D01*
X99713Y50977D01*
D02*
G37*
G36*
X98713D02*
X97822Y50860D01*
X96526Y50323D01*
X95413Y49469D01*
X94559Y48356D01*
X94022Y47060D01*
X93905Y46169D01*
X98713D01*
Y50977D01*
D02*
G37*
G36*
X112508Y71747D02*
X107565D01*
Y67984D01*
X108403D01*
Y66825D01*
X108155D01*
Y61882D01*
X108403D01*
Y59936D01*
X108155D01*
Y56173D01*
X108403D01*
Y53324D01*
X107600Y52991D01*
X106508Y52153D01*
X105670Y51061D01*
X105143Y49790D01*
X104964Y48425D01*
X105143Y47060D01*
X105670Y45789D01*
X106508Y44697D01*
X107600Y43859D01*
X108872Y43332D01*
X110236Y43152D01*
X111601Y43332D01*
X112873Y43859D01*
X113965Y44697D01*
X114803Y45789D01*
X115329Y47060D01*
X115509Y48425D01*
X115329Y49790D01*
X114803Y51061D01*
X113965Y52153D01*
X112873Y52991D01*
X111870Y53407D01*
Y56173D01*
X112311D01*
Y59936D01*
X111870D01*
Y61882D01*
X111917D01*
Y66825D01*
X111870D01*
Y67984D01*
X112508D01*
Y71747D01*
D02*
G37*
G36*
X104520Y45169D02*
X99713D01*
Y40362D01*
X100603Y40479D01*
X101899Y41016D01*
X103012Y41870D01*
X103866Y42983D01*
X104403Y44278D01*
X104520Y45169D01*
D02*
G37*
G36*
X98713D02*
X93905D01*
X94022Y44278D01*
X94559Y42983D01*
X95413Y41870D01*
X96526Y41016D01*
X97822Y40479D01*
X98713Y40362D01*
Y45169D01*
D02*
G37*
G36*
X110236Y39023D02*
X109409Y38914D01*
X108638Y38594D01*
X107976Y38087D01*
X107468Y37425D01*
X107149Y36654D01*
X107040Y35827D01*
X107149Y35000D01*
X107468Y34229D01*
X107976Y33567D01*
X108638Y33059D01*
X109409Y32740D01*
X110236Y32631D01*
X111063Y32740D01*
X111834Y33059D01*
X112496Y33567D01*
X113004Y34229D01*
X113323Y35000D01*
X113432Y35827D01*
X113323Y36654D01*
X113004Y37425D01*
X112496Y38087D01*
X111834Y38594D01*
X111063Y38914D01*
X110236Y39023D01*
D02*
G37*
G36*
X117729Y32493D02*
X116248D01*
Y30421D01*
X117729D01*
Y32493D01*
D02*
G37*
G36*
X115248D02*
X113767D01*
Y30421D01*
X115248D01*
Y32493D01*
D02*
G37*
G36*
X117729Y29421D02*
X116248D01*
Y27350D01*
X117729D01*
Y29421D01*
D02*
G37*
G36*
X115248D02*
X113767D01*
Y27350D01*
X115248D01*
Y29421D01*
D02*
G37*
G36*
X114973Y25997D02*
X113295D01*
Y24516D01*
X114973D01*
Y25997D01*
D02*
G37*
G36*
X112295D02*
X110617D01*
Y24516D01*
X112295D01*
Y25997D01*
D02*
G37*
G36*
X138764Y27858D02*
X135027D01*
Y24121D01*
X138764D01*
Y27858D01*
D02*
G37*
G36*
X114973Y23516D02*
X113295D01*
Y22035D01*
X114973D01*
Y23516D01*
D02*
G37*
G36*
X112295D02*
X110617D01*
Y22035D01*
X112295D01*
Y23516D01*
D02*
G37*
G36*
X123732Y55818D02*
X118788D01*
Y52056D01*
X119527D01*
Y50610D01*
X118623Y50236D01*
X117532Y49398D01*
X116694Y48306D01*
X116167Y47034D01*
X115987Y45669D01*
X116167Y44305D01*
X116694Y43033D01*
X117532Y41941D01*
X118623Y41103D01*
X119895Y40576D01*
X119920Y40573D01*
Y32393D01*
X119773D01*
Y27450D01*
X119920D01*
Y25897D01*
X119772D01*
Y22135D01*
X119920D01*
Y18904D01*
X119212Y18611D01*
X118038Y17710D01*
X117137Y16536D01*
X116681Y15434D01*
X103792D01*
X103335Y16536D01*
X102434Y17710D01*
X101260Y18611D01*
X99893Y19177D01*
X98425Y19371D01*
X96958Y19177D01*
X95590Y18611D01*
X94416Y17710D01*
X93515Y16536D01*
X92949Y15168D01*
X92755Y13701D01*
X92949Y12233D01*
X93515Y10866D01*
X94416Y9692D01*
X95590Y8791D01*
X96958Y8224D01*
X98425Y8031D01*
X99893Y8224D01*
X101260Y8791D01*
X102434Y9692D01*
X103335Y10866D01*
X103792Y11968D01*
X109467D01*
X109506Y11367D01*
X109409Y11355D01*
X108638Y11035D01*
X107976Y10527D01*
X107468Y9866D01*
X107149Y9095D01*
X107040Y8268D01*
X107149Y7441D01*
X107468Y6670D01*
X107976Y6008D01*
X108638Y5500D01*
X109409Y5181D01*
X110236Y5072D01*
X111063Y5181D01*
X111834Y5500D01*
X112496Y6008D01*
X113004Y6670D01*
X113323Y7441D01*
X113432Y8268D01*
X113323Y9095D01*
X113004Y9866D01*
X112496Y10527D01*
X111834Y11035D01*
X111063Y11355D01*
X110966Y11367D01*
X111005Y11968D01*
X116681D01*
X117137Y10866D01*
X118038Y9692D01*
X119212Y8791D01*
X120580Y8224D01*
X122047Y8031D01*
X123515Y8224D01*
X124882Y8791D01*
X126056Y9692D01*
X126957Y10866D01*
X127524Y12233D01*
X127717Y13701D01*
X127524Y15168D01*
X126957Y16536D01*
X126056Y17710D01*
X124882Y18611D01*
X123515Y19177D01*
X123387Y19194D01*
Y22135D01*
X123928D01*
Y25897D01*
X123387D01*
Y27450D01*
X123535D01*
Y32393D01*
X123387D01*
Y40892D01*
X123896Y41103D01*
X124988Y41941D01*
X125826Y43033D01*
X126353Y44305D01*
X126532Y45669D01*
X126353Y47034D01*
X125826Y48306D01*
X124988Y49398D01*
X123896Y50236D01*
X122993Y50610D01*
Y52056D01*
X123732D01*
Y55818D01*
D02*
G37*
G36*
X87314Y27044D02*
X17669D01*
Y19379D01*
X41681D01*
X42245Y19291D01*
X42245Y18779D01*
Y12292D01*
X58574D01*
X58574Y19291D01*
X59138Y19379D01*
X87314D01*
Y27044D01*
D02*
G37*
G36*
X12205Y12205D02*
X3543D01*
Y3543D01*
X12205D01*
Y12205D01*
D02*
G37*
%LPD*%
D33*
X64623Y59842D02*
G03*
X64801Y60273I-430J430D01*
G01*
X38206Y166190D02*
Y172290D01*
X39300Y165650D02*
X46850D01*
X38759Y166190D02*
X39300Y165650D01*
X38206Y166190D02*
X38759D01*
X53937Y186158D02*
X53967Y186188D01*
Y190568D01*
X53956Y190579D02*
X53967Y190568D01*
X53997Y190619D02*
Y190746D01*
X53956Y190579D02*
X53997Y190619D01*
X53915Y186136D02*
X53937Y186158D01*
X46850Y186122D02*
X46865Y186136D01*
X53915D01*
X125787Y218504D02*
X126378D01*
X123917Y216634D02*
X125787Y218504D01*
X120374Y216634D02*
X123917D01*
X64801Y60273D02*
Y64400D01*
X109958Y199898D02*
Y219821D01*
X112861Y222725D01*
X128240Y90226D02*
X131128Y87338D01*
X128240Y90226D02*
Y99964D01*
X130200Y101924D01*
X128570Y121653D02*
X130200Y120023D01*
Y101924D02*
Y120023D01*
X128570Y121101D02*
Y121653D01*
X121260Y59842D02*
Y66043D01*
X111024Y134646D02*
X111024Y134646D01*
Y83071D02*
Y134646D01*
Y83071D02*
X111024Y83071D01*
X24016Y134756D02*
X33280D01*
X43233Y124803D02*
X57874D01*
X33280Y134756D02*
X43233Y124803D01*
X88976Y149606D02*
X92520D01*
X100394Y157480D02*
Y184252D01*
X92520Y149606D02*
X100394Y157480D01*
X120041Y225258D02*
X120374Y225590D01*
X119549Y225258D02*
X120041D01*
X117016Y222725D02*
X119549Y225258D01*
X112861Y222725D02*
X117016D01*
X120866Y210630D02*
Y210945D01*
X121297Y211376D01*
X123672D01*
X124063Y211767D01*
X120473Y231890D02*
X120483Y231900D01*
X120423Y231840D02*
X120473Y231890D01*
X120483Y231900D02*
X124600D01*
X127642Y228858D01*
X139764D01*
X112894Y216634D02*
Y219646D01*
X113772Y220525D02*
X119495D01*
X112894Y219646D02*
X113772Y220525D01*
X119495D02*
X120374Y219646D01*
Y216634D02*
Y219646D01*
Y216634D02*
X120866Y210630D01*
X121555Y224410D02*
X126378D01*
X120374Y225590D02*
X121555Y224410D01*
X120374Y225590D02*
Y226083D01*
X120423Y226132D01*
Y231840D01*
D38*
X110036Y69866D02*
D03*
Y75771D02*
D03*
X121260Y53937D02*
D03*
Y59842D02*
D03*
X126378Y218504D02*
D03*
Y224410D02*
D03*
D39*
X70528Y59842D02*
D03*
X64623D02*
D03*
X110036Y64354D02*
D03*
X104131D02*
D03*
X115748Y29921D02*
D03*
X121653D02*
D03*
X120866Y210630D02*
D03*
X114961D02*
D03*
X120473Y231890D02*
D03*
X114567D02*
D03*
X31102Y194882D02*
D03*
X37008D02*
D03*
X53937Y186158D02*
D03*
X59842D02*
D03*
D50*
X24803Y186122D02*
X29761D01*
X31102Y187464D02*
Y194882D01*
X29761Y186122D02*
X31102Y187464D01*
X27953Y194882D02*
X31102D01*
X26378Y196457D02*
X27953Y194882D01*
X23800Y196457D02*
X26378D01*
D51*
X14554Y175900D02*
G03*
X14103Y175735I0J-700D01*
G01*
X16590Y183893D02*
G03*
X17157Y183597I572J404D01*
G01*
X10448Y203991D02*
G03*
X10315Y204190I-640J-283D01*
G01*
X17013Y189027D02*
G03*
X17666Y188609I641J281D01*
G01*
X13047Y147025D02*
G03*
X13218Y147431I-527J461D01*
G01*
X14609Y164156D02*
G03*
X14485Y163810I574J-401D01*
G01*
X17811Y168215D02*
G03*
X17237Y167916I0J-700D01*
G01*
X11569Y153510D02*
G03*
X11824Y153996I-442J543D01*
G01*
X12817Y164960D02*
G03*
X12684Y164602I564J-414D01*
G01*
X17457Y170798D02*
G03*
X16888Y170511I-4J-700D01*
G01*
X17352Y173395D02*
G03*
X16785Y173119I-10J-700D01*
G01*
X15097Y181181D02*
G03*
X15541Y181020I447J539D01*
G01*
X111024Y75771D02*
X113571D01*
X115500Y77700D01*
X42820Y168209D02*
X50000D01*
X41763Y169266D02*
Y174182D01*
Y169266D02*
X42820Y168209D01*
X40579Y175366D02*
X41763Y174182D01*
X36445Y175366D02*
X40579D01*
X32043Y164706D02*
Y178500D01*
X42224Y188681D02*
X46850D01*
X32043Y178500D02*
X42224Y188681D01*
X46850D02*
X50000D01*
X30439Y163102D02*
X32043Y164706D01*
X116929Y143083D02*
X117222Y143376D01*
X116929Y127595D02*
Y143083D01*
X115500Y126166D02*
X116929Y127595D01*
X115500Y77700D02*
Y126166D01*
X60471Y144888D02*
Y174808D01*
X53900Y134646D02*
Y138317D01*
X60471Y144888D01*
X50996Y130315D02*
Y137682D01*
X59066Y145751D02*
Y173605D01*
X50996Y137682D02*
X59066Y145751D01*
X42606Y138976D02*
X43545Y139915D01*
Y149438D02*
X57648Y163542D01*
X43545Y139915D02*
Y149438D01*
X39819Y138976D02*
X42606D01*
X57648Y163542D02*
Y172449D01*
X54275Y181004D02*
X60471Y174808D01*
X54226Y178445D02*
X59066Y173605D01*
X54211Y175886D02*
X57648Y172449D01*
X44032Y151969D02*
X56190Y164127D01*
X54180Y173327D02*
X56190Y171316D01*
Y164127D02*
Y171316D01*
X39819Y151969D02*
X44032D01*
X50000Y181004D02*
X54275D01*
X50000Y178445D02*
X54226D01*
X50000Y175886D02*
X54211D01*
X50000Y173327D02*
X54180D01*
X54722Y164788D02*
Y169672D01*
X50190Y170578D02*
X53816D01*
X54722Y169672D01*
X31496Y158855D02*
X33564Y160923D01*
Y174464D01*
X42663Y183563D01*
X35037Y145279D02*
Y173958D01*
X36445Y175366D01*
X42663Y183563D02*
X50000D01*
X35037Y145279D02*
X37009Y143307D01*
X39819D01*
X36533Y160938D02*
X38685Y163090D01*
X36533Y150923D02*
Y160938D01*
X38685Y163090D02*
X53023D01*
X50000Y170768D02*
X50190Y170578D01*
X53023Y163090D02*
X54722Y164788D01*
X131782Y96942D02*
X132812Y97971D01*
Y123803D01*
X131085Y125529D02*
X132812Y123803D01*
X131085Y125529D02*
Y125984D01*
X124810Y60490D02*
Y69213D01*
X133300Y45322D02*
X139764Y38858D01*
X124810Y60490D02*
X133300Y52000D01*
Y45322D02*
Y52000D01*
X131782Y93992D02*
Y96942D01*
X127162Y84662D02*
Y88131D01*
X126360Y88933D02*
Y117017D01*
Y88933D02*
X127162Y88131D01*
X127737Y60886D02*
Y65765D01*
X121022Y73000D02*
X124810Y69213D01*
X139391Y58858D02*
X139764D01*
X132483Y65765D02*
X139391Y58858D01*
X132110Y65765D02*
X132483D01*
X126054Y117323D02*
X126360Y117017D01*
X123538Y112992D02*
X123917Y112613D01*
Y80822D02*
Y112613D01*
X121022Y87200D02*
Y108677D01*
X113479Y150847D02*
Y157207D01*
Y150847D02*
X115113Y149213D01*
X124676D01*
X31496Y156299D02*
Y158855D01*
X36533Y150923D02*
X39819Y147638D01*
X14554Y175900D02*
X14556D01*
X21654Y175886D01*
X5906Y168858D02*
X14103Y175735D01*
X5906Y198858D02*
X16590Y183893D01*
X17157Y183597D02*
X17157Y183597D01*
X21654Y183563D01*
X10448Y203991D02*
X10449Y203989D01*
X17013Y189027D01*
X17666Y188609D02*
Y188609D01*
X5906Y208858D02*
X10315Y204190D01*
X17666Y188609D02*
X21654Y188681D01*
X5906Y138858D02*
X13047Y147025D01*
X13218Y147431D02*
X13218Y147432D01*
X14485Y163810D01*
X14609Y164156D02*
X17237Y167916D01*
X17811Y168215D02*
X17812D01*
X21654Y168209D01*
X11824Y153996D02*
X11824Y153996D01*
X12684Y164602D01*
X12817Y164960D02*
X16888Y170511D01*
X17457Y170798D02*
X17458D01*
X5906Y148858D02*
X11569Y153510D01*
X17458Y170798D02*
X21654Y170768D01*
X5906Y158858D02*
X16785Y173119D01*
X17352Y173395D02*
X17353Y173394D01*
X21654Y173327D01*
X15541Y181020D02*
X21654Y181004D01*
X15094Y181182D02*
X15097Y181181D01*
X5906Y188858D02*
X15094Y181182D01*
X5906Y178858D02*
X21654Y178445D01*
X127737Y60886D02*
X139764Y48858D01*
D52*
X110136Y48525D02*
X110236Y48425D01*
X110136Y48525D02*
Y69766D01*
X110036Y69866D02*
X110136Y69766D01*
X121653Y14095D02*
Y45276D01*
X121260Y45669D02*
Y53937D01*
X121653Y14095D02*
X122047Y13701D01*
X121260Y45669D02*
X121653Y45276D01*
X98425Y13701D02*
X122047D01*
D56*
X129527Y238583D02*
D03*
X126378Y241732D02*
D03*
X9449Y6299D02*
D03*
X6299Y9449D02*
D03*
D57*
X122047Y13701D02*
D03*
X98425D02*
D03*
D58*
X121260Y45669D02*
D03*
X110236Y48425D02*
D03*
X99213Y45669D02*
D03*
D59*
X85827Y230709D02*
D03*
D60*
X95827Y240709D02*
D03*
X75827D02*
D03*
Y220709D02*
D03*
X95827D02*
D03*
D61*
X139764Y208858D02*
D03*
Y198858D02*
D03*
Y188858D02*
D03*
Y178858D02*
D03*
Y158858D02*
D03*
Y148858D02*
D03*
Y108858D02*
D03*
Y78858D02*
D03*
Y58858D02*
D03*
Y38858D02*
D03*
Y48858D02*
D03*
Y68858D02*
D03*
Y88858D02*
D03*
Y98858D02*
D03*
Y118858D02*
D03*
Y128858D02*
D03*
Y138858D02*
D03*
Y168858D02*
D03*
Y218858D02*
D03*
Y228858D02*
D03*
Y238858D02*
D03*
X5906Y208858D02*
D03*
Y198858D02*
D03*
Y188858D02*
D03*
Y178858D02*
D03*
Y158858D02*
D03*
Y148858D02*
D03*
Y108858D02*
D03*
Y78858D02*
D03*
Y58858D02*
D03*
Y38858D02*
D03*
Y48858D02*
D03*
Y68858D02*
D03*
Y88858D02*
D03*
Y98858D02*
D03*
Y118858D02*
D03*
Y128858D02*
D03*
Y138858D02*
D03*
Y168858D02*
D03*
Y218858D02*
D03*
Y228858D02*
D03*
Y238858D02*
D03*
D62*
X139764Y28858D02*
D03*
X5906D02*
D03*
D63*
X53997Y190945D02*
D03*
X117222Y143376D02*
D03*
X68504Y183000D02*
D03*
X64173Y157480D02*
D03*
X75100Y122900D02*
D03*
X55800Y129300D02*
D03*
X88300Y104134D02*
D03*
X57400D02*
D03*
X52165Y112992D02*
D03*
X52067Y150923D02*
D03*
X93504Y137300D02*
D03*
X94400Y130315D02*
D03*
X93504Y112992D02*
D03*
X76968Y102300D02*
D03*
X83333Y157480D02*
D03*
X78084D02*
D03*
X85827Y77300D02*
D03*
X94488D02*
D03*
X100197Y82200D02*
D03*
X106200Y87008D02*
D03*
X120263Y166930D02*
D03*
X40802Y215000D02*
D03*
Y223500D02*
D03*
X13900Y107300D02*
D03*
X45472Y82400D02*
D03*
X39764Y91339D02*
D03*
X42663Y196457D02*
D03*
X112205Y236220D02*
D03*
X104331Y220472D02*
D03*
X96457Y204724D02*
D03*
X104331Y31496D02*
D03*
X88583Y157480D02*
D03*
X80709Y141732D02*
D03*
X88583Y125984D02*
D03*
X80709Y110236D02*
D03*
X88583Y31496D02*
D03*
X80709Y15748D02*
D03*
X64961Y236220D02*
D03*
Y204724D02*
D03*
X72835Y188976D02*
D03*
Y157480D02*
D03*
X64961Y141732D02*
D03*
Y110236D02*
D03*
X72835Y31496D02*
D03*
X64961Y15748D02*
D03*
X49213Y236220D02*
D03*
X57087Y220472D02*
D03*
Y31496D02*
D03*
X33465Y236220D02*
D03*
Y47244D02*
D03*
X41339Y31496D02*
D03*
X33465Y15748D02*
D03*
X17717Y204724D02*
D03*
X25591Y62992D02*
D03*
Y31496D02*
D03*
X17717Y15748D02*
D03*
X76200Y211319D02*
D03*
Y195177D02*
D03*
X81260Y201101D02*
D03*
X80992Y187478D02*
D03*
X81001Y182935D02*
D03*
X90662Y186583D02*
D03*
Y191126D02*
D03*
Y195669D02*
D03*
X90539Y200211D02*
D03*
X76255Y230696D02*
D03*
X81035Y206708D02*
D03*
X90396Y205600D02*
D03*
X90662Y210135D02*
D03*
Y214679D02*
D03*
X95408Y230696D02*
D03*
X85827Y240345D02*
D03*
X64801Y64400D02*
D03*
X62900Y54470D02*
D03*
X67419D02*
D03*
X109958Y199898D02*
D03*
X106800Y130200D02*
D03*
X121600D02*
D03*
X131841Y93612D02*
D03*
X133471Y163127D02*
D03*
X125213Y143318D02*
D03*
X127737Y65765D02*
D03*
X132110Y65765D02*
D03*
X131109Y87318D02*
D03*
X127200Y84300D02*
D03*
X124200Y79900D02*
D03*
X121022Y73000D02*
D03*
X121022Y87200D02*
D03*
X131085Y125984D02*
D03*
X128570Y121653D02*
D03*
X126054Y117323D02*
D03*
X123538Y112992D02*
D03*
X121022Y108677D02*
D03*
X121260Y66043D02*
D03*
X111024Y83071D02*
D03*
X111024Y134646D02*
D03*
X24016Y134756D02*
D03*
X57874Y124803D02*
D03*
X88976Y149606D02*
D03*
X100394Y184252D02*
D03*
X132881Y181038D02*
D03*
X113479Y157207D02*
D03*
X124676Y149213D02*
D03*
X115704Y162856D02*
D03*
X124063Y211767D02*
D03*
X40802Y219291D02*
D03*
X31280Y113059D02*
D03*
X33280Y123780D02*
D03*
X30439Y163102D02*
D03*
X31496Y156299D02*
D03*
X39819Y143307D02*
D03*
X39819Y138976D02*
D03*
X53900Y134646D02*
D03*
X50996Y130315D02*
D03*
X39819Y147638D02*
D03*
Y151969D02*
D03*
X21654Y162400D02*
D03*
X38206Y172290D02*
D03*
Y166190D02*
D03*
X23800Y196457D02*
D03*
D64*
X46850Y188681D02*
D03*
D65*
Y186122D02*
D03*
Y183563D02*
D03*
Y181004D02*
D03*
Y178445D02*
D03*
Y175886D02*
D03*
Y173327D02*
D03*
Y170768D02*
D03*
Y168209D02*
D03*
Y165650D02*
D03*
X24803Y188681D02*
D03*
Y186122D02*
D03*
Y183563D02*
D03*
Y181004D02*
D03*
Y178445D02*
D03*
Y175886D02*
D03*
Y173327D02*
D03*
Y170768D02*
D03*
Y168209D02*
D03*
Y165650D02*
D03*
D66*
X120374Y226083D02*
D03*
X112894Y216634D02*
D03*
X120374D02*
D03*
X116634D02*
D03*
X112894Y226083D02*
D03*
D67*
X110233Y58055D02*
D03*
X101178D02*
D03*
X121850Y24016D02*
D03*
X112795D02*
D03*
D68*
X57074Y16458D02*
X55741Y13792D01*
X54408Y16458D01*
X53075Y13792D02*
X51742D01*
X52409D01*
Y17791D01*
X53075Y17124D01*
X49743Y13792D02*
Y14459D01*
X49077D01*
Y13792D01*
X49743D01*
X46411Y17124D02*
X45744Y17791D01*
X44411D01*
X43745Y17124D01*
Y14459D01*
X44411Y13792D01*
X45744D01*
X46411Y14459D01*
Y17124D01*
X83148Y24877D02*
X83815Y25544D01*
X85148D01*
X85814Y24877D01*
Y22212D01*
X85148Y21545D01*
X83815D01*
X83148Y22212D01*
Y23544D01*
X84481D01*
X79150Y24877D02*
X79816Y25544D01*
X81149D01*
X81815Y24877D01*
Y24211D01*
X81149Y23544D01*
X79816D01*
X79150Y22878D01*
Y22212D01*
X79816Y21545D01*
X81149D01*
X81815Y22212D01*
X77817Y21545D02*
Y25544D01*
X76484Y24211D01*
X75151Y25544D01*
Y21545D01*
X73818Y20879D02*
X71152D01*
X67154Y24877D02*
X67820Y25544D01*
X69153D01*
X69819Y24877D01*
Y24211D01*
X69153Y23544D01*
X67820D01*
X67154Y22878D01*
Y22212D01*
X67820Y21545D01*
X69153D01*
X69819Y22212D01*
X65821Y21545D02*
Y24211D01*
X64488Y25544D01*
X63155Y24211D01*
Y21545D01*
Y23544D01*
X65821D01*
X61822Y21545D02*
Y25544D01*
X59823D01*
X59156Y24877D01*
Y23544D01*
X59823Y22878D01*
X61822D01*
X60489D02*
X59156Y21545D01*
X57823D02*
Y24211D01*
X56490Y25544D01*
X55157Y24211D01*
Y21545D01*
Y23544D01*
X57823D01*
X53825Y20879D02*
X51159D01*
X47160Y24877D02*
X47826Y25544D01*
X49159D01*
X49826Y24877D01*
Y22212D01*
X49159Y21545D01*
X47826D01*
X47160Y22212D01*
Y23544D01*
X48493D01*
X45827Y24877D02*
X45161Y25544D01*
X43828D01*
X43161Y24877D01*
Y24211D01*
X43828Y23544D01*
X44494D01*
X43828D01*
X43161Y22878D01*
Y22212D01*
X43828Y21545D01*
X45161D01*
X45827Y22212D01*
X39829Y21545D02*
Y25544D01*
X41828Y23544D01*
X39163D01*
X37830Y24877D02*
X37163Y25544D01*
X35830D01*
X35164Y24877D01*
Y22212D01*
X35830Y21545D01*
X37163D01*
X37830Y22212D01*
Y24877D01*
X33831Y20879D02*
X31165D01*
X27166Y25544D02*
X29832D01*
Y21545D01*
X27166D01*
X29832Y23544D02*
X28499D01*
X25833Y25544D02*
Y22878D01*
X24501Y21545D01*
X23168Y22878D01*
Y25544D01*
X21835D02*
Y21545D01*
X19836D01*
X19169Y22212D01*
Y22878D01*
X19836Y23544D01*
X21835D01*
X19836D01*
X19169Y24211D01*
Y24877D01*
X19836Y25544D01*
X21835D01*
M02*
