G04*
G04 #@! TF.GenerationSoftware,Altium Limited,Altium Designer,20.2.4 (192)*
G04*
G04 Layer_Physical_Order=1*
G04 Layer_Color=255*
%FSLAX25Y25*%
%MOIN*%
G70*
G04*
G04 #@! TF.SameCoordinates,7291716C-FE6B-40AD-B32D-3444B0661B20*
G04*
G04*
G04 #@! TF.FilePolarity,Positive*
G04*
G01*
G75*
%ADD32R,0.06693X0.09055*%
%ADD33R,0.03543X0.02362*%
%ADD34R,0.02362X0.03543*%
%ADD35O,0.02953X0.09449*%
%ADD36O,0.09449X0.02953*%
G04:AMPARAMS|DCode=37|XSize=29.53mil|YSize=94.49mil|CornerRadius=7.38mil|HoleSize=0mil|Usage=FLASHONLY|Rotation=270.000|XOffset=0mil|YOffset=0mil|HoleType=Round|Shape=RoundedRectangle|*
%AMROUNDEDRECTD37*
21,1,0.02953,0.07972,0,0,270.0*
21,1,0.01476,0.09449,0,0,270.0*
1,1,0.01476,-0.03986,-0.00738*
1,1,0.01476,-0.03986,0.00738*
1,1,0.01476,0.03986,0.00738*
1,1,0.01476,0.03986,-0.00738*
%
%ADD37ROUNDEDRECTD37*%
%ADD38R,0.02126X0.03150*%
%ADD39R,0.02559X0.04528*%
%ADD40R,0.05512X0.06693*%
%ADD41R,0.01772X0.05118*%
%ADD42R,0.05118X0.02756*%
%ADD43R,0.03543X0.05118*%
%ADD44R,0.13386X0.04724*%
%ADD45R,0.02362X0.02362*%
%ADD46C,0.00700*%
%ADD47C,0.01000*%
%ADD48C,0.02000*%
%ADD49C,0.04000*%
%ADD50C,0.01500*%
%ADD51R,0.03150X0.03150*%
%ADD52C,0.09843*%
%ADD53C,0.09055*%
%ADD54C,0.10039*%
%ADD55C,0.08858*%
%ADD56C,0.07874*%
%ADD57R,0.07874X0.07874*%
%ADD58C,0.03543*%
G36*
X144353Y241201D02*
X143853Y241102D01*
X143814Y241197D01*
X143071Y242165D01*
X142102Y242909D01*
X140974Y243376D01*
X139764Y243535D01*
X138553Y243376D01*
X137425Y242909D01*
X136457Y242165D01*
X135713Y241197D01*
X135246Y240069D01*
X135228Y239929D01*
X115458D01*
X115049Y239847D01*
X114701Y239615D01*
X110643Y235557D01*
X110411Y235210D01*
X110329Y234800D01*
Y233771D01*
X98119D01*
Y227646D01*
X109477D01*
X109495Y227588D01*
X109594Y227147D01*
X109072Y226364D01*
X108880Y225400D01*
X109072Y224436D01*
X109618Y223618D01*
X110436Y223072D01*
X111400Y222880D01*
X112364Y223072D01*
X113182Y223618D01*
X113728Y224436D01*
X113920Y225400D01*
X113728Y226364D01*
X113182Y227182D01*
X113112Y227228D01*
X112905Y227646D01*
X112905D01*
X112905Y227646D01*
Y233771D01*
X112471D01*
Y234357D01*
X115902Y237788D01*
X135228D01*
X135246Y237648D01*
X135713Y236520D01*
X136457Y235551D01*
X137425Y234808D01*
X138553Y234341D01*
X139764Y234181D01*
X140974Y234341D01*
X142102Y234808D01*
X143071Y235551D01*
X143814Y236520D01*
X143853Y236615D01*
X144353Y236515D01*
Y231346D01*
X143853Y231310D01*
X143142Y232237D01*
X142153Y232996D01*
X141000Y233473D01*
X140764Y233505D01*
Y228858D01*
Y224212D01*
X141000Y224243D01*
X142153Y224721D01*
X143142Y225480D01*
X143853Y226407D01*
X144353Y226371D01*
Y221201D01*
X143853Y221102D01*
X143814Y221197D01*
X143071Y222165D01*
X142102Y222909D01*
X140974Y223376D01*
X139764Y223535D01*
X138553Y223376D01*
X137425Y222909D01*
X136457Y222165D01*
X136009Y221582D01*
X130315D01*
X129610Y221489D01*
X128953Y221217D01*
X128389Y220784D01*
X122927Y215322D01*
X115070D01*
Y215858D01*
X110127D01*
Y209339D01*
X115070D01*
Y209875D01*
X124055D01*
X124760Y209968D01*
X125417Y210240D01*
X125981Y210673D01*
X131443Y216135D01*
X136009D01*
X136457Y215551D01*
X137425Y214808D01*
X138553Y214341D01*
X139764Y214181D01*
X140974Y214341D01*
X142102Y214808D01*
X143071Y215551D01*
X143814Y216520D01*
X143853Y216615D01*
X144353Y216515D01*
Y211202D01*
X143853Y211102D01*
X143814Y211197D01*
X143071Y212165D01*
X142102Y212909D01*
X140974Y213376D01*
X139764Y213535D01*
X138553Y213376D01*
X137425Y212909D01*
X136457Y212165D01*
X135713Y211197D01*
X135246Y210069D01*
X135087Y208858D01*
X135246Y207648D01*
X135713Y206520D01*
X135799Y206408D01*
X132243Y202852D01*
X132011Y202504D01*
X131929Y202095D01*
Y198139D01*
X131902Y197650D01*
X131429Y197650D01*
X124909D01*
Y194488D01*
Y191326D01*
X131429D01*
X131902Y191326D01*
X131929Y190837D01*
Y186498D01*
X130843Y185411D01*
X130611Y185064D01*
X130529Y184654D01*
Y177606D01*
X128394Y175471D01*
X104720D01*
X104310Y175389D01*
X104191Y175309D01*
X104090Y175289D01*
X103743Y175057D01*
X76999Y148313D01*
X76767Y147966D01*
X76685Y147556D01*
Y125580D01*
X76267Y125218D01*
X75612Y125348D01*
X74647Y125156D01*
X73830Y124610D01*
X73284Y123793D01*
X73092Y122828D01*
X73284Y121864D01*
X73830Y121046D01*
X74009Y120927D01*
Y120427D01*
X73830Y120307D01*
X73284Y119490D01*
X73092Y118525D01*
X73284Y117561D01*
X73830Y116744D01*
X74009Y116624D01*
Y116124D01*
X73830Y116005D01*
X73284Y115187D01*
X73092Y114223D01*
X73284Y113258D01*
X73830Y112441D01*
X74009Y112321D01*
Y111821D01*
X73830Y111702D01*
X73284Y110884D01*
X73092Y109920D01*
X73284Y108956D01*
X73830Y108138D01*
X74009Y108019D01*
Y107518D01*
X73830Y107399D01*
X73284Y106581D01*
X73092Y105617D01*
X73284Y104653D01*
X73830Y103835D01*
X74009Y103716D01*
Y103216D01*
X73830Y103096D01*
X73284Y102279D01*
X73092Y101314D01*
X73284Y100350D01*
X73830Y99532D01*
X74009Y99413D01*
Y98913D01*
X73830Y98794D01*
X73284Y97976D01*
X73092Y97012D01*
X73284Y96047D01*
X73830Y95230D01*
X74647Y94683D01*
X75612Y94491D01*
X76576Y94683D01*
X77394Y95230D01*
X77940Y96047D01*
X78132Y97012D01*
X77965Y97851D01*
X86975Y106861D01*
X87207Y107208D01*
X87289Y107618D01*
X87289Y107618D01*
Y143576D01*
X108643Y164929D01*
X130199D01*
X133339Y161789D01*
Y154212D01*
X133421Y153803D01*
X133653Y153455D01*
X135799Y151309D01*
X135713Y151197D01*
X135246Y150069D01*
X135087Y148858D01*
X135246Y147648D01*
X135713Y146520D01*
X136457Y145551D01*
X137425Y144808D01*
X138553Y144341D01*
X139764Y144181D01*
X140974Y144341D01*
X142102Y144808D01*
X143071Y145551D01*
X143814Y146520D01*
X143853Y146615D01*
X144353Y146515D01*
Y141346D01*
X143853Y141310D01*
X143142Y142237D01*
X142153Y142996D01*
X141000Y143473D01*
X140764Y143505D01*
Y138858D01*
Y134212D01*
X141000Y134243D01*
X142153Y134721D01*
X143142Y135480D01*
X143853Y136407D01*
X144353Y136371D01*
Y131202D01*
X143853Y131102D01*
X143814Y131197D01*
X143071Y132165D01*
X142102Y132909D01*
X140974Y133376D01*
X139764Y133535D01*
X138553Y133376D01*
X137425Y132909D01*
X136457Y132165D01*
X135713Y131197D01*
X135246Y130069D01*
X135087Y128858D01*
X135246Y127648D01*
X135713Y126520D01*
X136457Y125551D01*
X137425Y124808D01*
X138553Y124341D01*
X139764Y124181D01*
X140974Y124341D01*
X142102Y124808D01*
X143071Y125551D01*
X143814Y126520D01*
X143853Y126615D01*
X144353Y126515D01*
Y121202D01*
X143853Y121102D01*
X143814Y121197D01*
X143071Y122165D01*
X142102Y122909D01*
X140974Y123376D01*
X139764Y123535D01*
X138553Y123376D01*
X137425Y122909D01*
X136457Y122165D01*
X135713Y121197D01*
X135246Y120069D01*
X135087Y118858D01*
X135246Y117648D01*
X135713Y116520D01*
X136457Y115551D01*
X137425Y114808D01*
X138553Y114341D01*
X139764Y114181D01*
X140974Y114341D01*
X142102Y114808D01*
X143071Y115551D01*
X143814Y116520D01*
X143853Y116615D01*
X144353Y116515D01*
Y111202D01*
X143853Y111102D01*
X143814Y111197D01*
X143071Y112165D01*
X142102Y112909D01*
X140974Y113376D01*
X139764Y113535D01*
X138553Y113376D01*
X137425Y112909D01*
X136457Y112165D01*
X135713Y111197D01*
X135246Y110069D01*
X135087Y108858D01*
X135246Y107648D01*
X135713Y106520D01*
X136457Y105551D01*
X137425Y104808D01*
X138553Y104341D01*
X139764Y104181D01*
X140974Y104341D01*
X142102Y104808D01*
X143071Y105551D01*
X143814Y106520D01*
X143853Y106615D01*
X144353Y106515D01*
Y101201D01*
X143853Y101102D01*
X143814Y101197D01*
X143071Y102165D01*
X142102Y102909D01*
X140974Y103376D01*
X139764Y103535D01*
X138553Y103376D01*
X137425Y102909D01*
X136457Y102165D01*
X135713Y101197D01*
X135246Y100069D01*
X135087Y98858D01*
X135246Y97648D01*
X135713Y96520D01*
X136457Y95551D01*
X137425Y94808D01*
X138553Y94341D01*
X139764Y94181D01*
X140974Y94341D01*
X142102Y94808D01*
X143071Y95551D01*
X143814Y96520D01*
X143853Y96614D01*
X144353Y96515D01*
Y91346D01*
X143853Y91310D01*
X143142Y92237D01*
X142153Y92996D01*
X141000Y93473D01*
X140764Y93505D01*
Y88858D01*
Y84212D01*
X141000Y84243D01*
X142153Y84720D01*
X143142Y85480D01*
X143853Y86407D01*
X144353Y86371D01*
Y81201D01*
X143853Y81102D01*
X143814Y81197D01*
X143071Y82165D01*
X142102Y82909D01*
X140974Y83376D01*
X139764Y83535D01*
X138553Y83376D01*
X137425Y82909D01*
X136457Y82165D01*
X135713Y81197D01*
X135246Y80069D01*
X135087Y78858D01*
X135246Y77648D01*
X135713Y76520D01*
X136457Y75551D01*
X137425Y74808D01*
X138553Y74341D01*
X139764Y74181D01*
X140974Y74341D01*
X142102Y74808D01*
X143071Y75551D01*
X143814Y76520D01*
X143853Y76614D01*
X144353Y76515D01*
Y71201D01*
X143853Y71102D01*
X143814Y71197D01*
X143071Y72165D01*
X142102Y72909D01*
X140974Y73376D01*
X139764Y73535D01*
X138553Y73376D01*
X137425Y72909D01*
X136457Y72165D01*
X135713Y71197D01*
X135357Y70337D01*
X133651D01*
X132759Y71228D01*
Y148139D01*
X132647Y148705D01*
X132326Y149185D01*
X120623Y160888D01*
X120143Y161208D01*
X119578Y161321D01*
X116295D01*
X116234Y161412D01*
X115515Y161893D01*
X114665Y162062D01*
X108169D01*
X107320Y161893D01*
X106600Y161412D01*
X106119Y160692D01*
X105950Y159843D01*
X106119Y158993D01*
X106600Y158273D01*
X107043Y157978D01*
Y157377D01*
X106600Y157081D01*
X106119Y156361D01*
X105950Y155512D01*
X106119Y154663D01*
X106600Y153943D01*
X107043Y153647D01*
Y153046D01*
X106600Y152750D01*
X106119Y152030D01*
X105950Y151181D01*
X106119Y150332D01*
X106600Y149612D01*
X107043Y149316D01*
Y148715D01*
X106600Y148419D01*
X106119Y147700D01*
X105950Y146850D01*
X106119Y146001D01*
X106600Y145281D01*
X107043Y144986D01*
Y144385D01*
X106600Y144089D01*
X106119Y143369D01*
X105950Y142520D01*
X106119Y141671D01*
X106600Y140951D01*
X107320Y140470D01*
X108169Y140301D01*
X114665D01*
X115515Y140470D01*
X116234Y140951D01*
X116743Y140928D01*
X121922Y135749D01*
Y81548D01*
X121729Y81390D01*
X120764Y81198D01*
X119947Y80652D01*
X119400Y79834D01*
X119209Y78870D01*
X119400Y77905D01*
X119947Y77088D01*
X120764Y76542D01*
X121729Y76350D01*
X121922Y76191D01*
Y73412D01*
X119588Y71078D01*
X113301D01*
X112735Y70966D01*
X112255Y70645D01*
X110223Y68613D01*
X107961D01*
Y63670D01*
X108275D01*
Y62531D01*
X107686D01*
Y56871D01*
X106645D01*
Y62531D01*
X102686D01*
Y57435D01*
X102186Y57228D01*
X101645Y57769D01*
Y62531D01*
X97686D01*
Y57447D01*
X97224Y57256D01*
X96645Y57835D01*
Y62531D01*
X92686D01*
Y57447D01*
X92224Y57256D01*
X91645Y57835D01*
Y62531D01*
X87686D01*
Y56603D01*
X89848D01*
X95778Y50673D01*
X96126Y50441D01*
X96535Y50359D01*
X96535Y50359D01*
X107768D01*
X108244Y49648D01*
X109061Y49102D01*
X110025Y48910D01*
X110990Y49102D01*
X111807Y49648D01*
X112354Y50466D01*
X112546Y51430D01*
X112354Y52394D01*
X112063Y52829D01*
X112330Y53329D01*
X113144D01*
Y41986D01*
X113225Y41576D01*
X113457Y41229D01*
X119143Y35543D01*
X119490Y35311D01*
X119900Y35229D01*
X119900Y35229D01*
X126800D01*
X127210Y35311D01*
X127557Y35543D01*
X129802Y37788D01*
X135228D01*
X135246Y37648D01*
X135713Y36520D01*
X136457Y35551D01*
X137425Y34808D01*
X138553Y34341D01*
X139764Y34181D01*
X140974Y34341D01*
X142102Y34808D01*
X143071Y35551D01*
X143814Y36520D01*
X143853Y36615D01*
X144353Y36515D01*
Y33595D01*
X140764D01*
Y28858D01*
Y24121D01*
X144353D01*
Y1316D01*
X126890D01*
X126410Y1365D01*
X126410Y1816D01*
Y5012D01*
X122854D01*
X119298D01*
X119298Y1365D01*
X118819Y1316D01*
X78819D01*
X78339Y1365D01*
X78339Y1816D01*
Y5012D01*
X74783D01*
X71228D01*
X71228Y1365D01*
X70748Y1316D01*
X1316D01*
Y24121D01*
X4905D01*
Y28858D01*
X5906D01*
Y29858D01*
X10643D01*
Y33595D01*
X6052D01*
X6019Y34095D01*
X7142Y34243D01*
X8294Y34721D01*
X9284Y35480D01*
X10043Y36469D01*
X10521Y37622D01*
X10552Y37858D01*
X5906D01*
Y39858D01*
X10552D01*
X10521Y40095D01*
X10043Y41247D01*
X9284Y42237D01*
X8294Y42996D01*
X7142Y43473D01*
X6134Y43606D01*
Y44110D01*
X7142Y44243D01*
X8294Y44721D01*
X9284Y45480D01*
X10043Y46469D01*
X10521Y47622D01*
X10552Y47858D01*
X5906D01*
Y48858D01*
X4905D01*
Y53505D01*
X4669Y53473D01*
X3517Y52996D01*
X2527Y52237D01*
X1816Y51310D01*
X1316Y51345D01*
Y56515D01*
X1816Y56615D01*
X1855Y56520D01*
X2598Y55551D01*
X3567Y54808D01*
X4695Y54341D01*
X5906Y54181D01*
X7116Y54341D01*
X8244Y54808D01*
X9213Y55551D01*
X9956Y56520D01*
X10423Y57648D01*
X10442Y57788D01*
X11186D01*
X11596Y57869D01*
X11943Y58101D01*
X12844Y59002D01*
X12844Y59002D01*
X13076Y59350D01*
X13157Y59759D01*
X13157Y59759D01*
Y63772D01*
X13682Y64298D01*
X59239D01*
X59649Y64379D01*
X59654Y64382D01*
X59798Y64411D01*
X60145Y64643D01*
X62957Y67455D01*
X63189Y67802D01*
X63271Y68212D01*
Y71150D01*
X66842D01*
Y71961D01*
X67192D01*
X67602Y72042D01*
X67949Y72275D01*
X69384Y73709D01*
X72747D01*
Y77472D01*
X67804D01*
Y75158D01*
X67304Y74657D01*
X66842Y74849D01*
Y74913D01*
X63271D01*
Y77477D01*
X63189Y77886D01*
X62957Y78234D01*
X62218Y78973D01*
X62261Y79541D01*
X62396Y79632D01*
X62877Y80352D01*
X63046Y81201D01*
Y87697D01*
X62877Y88546D01*
X62396Y89266D01*
X61676Y89747D01*
X60827Y89916D01*
X59978Y89747D01*
X59258Y89266D01*
X58962Y88823D01*
X58361D01*
X58065Y89266D01*
X57345Y89747D01*
X56496Y89916D01*
X55647Y89747D01*
X54927Y89266D01*
X54631Y88823D01*
X54030D01*
X53734Y89266D01*
X53015Y89747D01*
X52165Y89916D01*
X51316Y89747D01*
X50596Y89266D01*
X50301Y88823D01*
X49700D01*
X49404Y89266D01*
X48684Y89747D01*
X47835Y89916D01*
X46986Y89747D01*
X46266Y89266D01*
X45785Y88546D01*
X45616Y87697D01*
Y81201D01*
X45785Y80352D01*
X46266Y79632D01*
X46764Y79299D01*
Y78677D01*
X46224Y78137D01*
X42235D01*
X41825Y78055D01*
X41478Y77823D01*
X39512Y75857D01*
X18018D01*
X12978Y80897D01*
Y87807D01*
X12978Y87807D01*
X12897Y88217D01*
X12664Y88564D01*
X12664Y88564D01*
X11671Y89557D01*
X11324Y89789D01*
X10915Y89871D01*
X10449D01*
X10423Y90069D01*
X9956Y91197D01*
X9213Y92165D01*
X8244Y92909D01*
X7116Y93376D01*
X5906Y93535D01*
X4695Y93376D01*
X3567Y92909D01*
X2598Y92165D01*
X1855Y91197D01*
X1816Y91102D01*
X1316Y91202D01*
Y96515D01*
X1816Y96614D01*
X1855Y96520D01*
X2598Y95551D01*
X3567Y94808D01*
X4695Y94341D01*
X5906Y94181D01*
X7116Y94341D01*
X8244Y94808D01*
X9213Y95551D01*
X9956Y96520D01*
X10423Y97648D01*
X10582Y98858D01*
X10423Y100069D01*
X9956Y101197D01*
X9213Y102165D01*
X8244Y102909D01*
X7116Y103376D01*
X5906Y103535D01*
X4695Y103376D01*
X3567Y102909D01*
X2598Y102165D01*
X1855Y101197D01*
X1816Y101102D01*
X1316Y101201D01*
Y106515D01*
X1816Y106615D01*
X1855Y106520D01*
X2598Y105551D01*
X3567Y104808D01*
X4695Y104341D01*
X5906Y104181D01*
X7116Y104341D01*
X8244Y104808D01*
X9213Y105551D01*
X9956Y106520D01*
X10423Y107648D01*
X10582Y108858D01*
X10423Y110069D01*
X9956Y111197D01*
X9213Y112165D01*
X8244Y112909D01*
X7116Y113376D01*
X5906Y113535D01*
X4695Y113376D01*
X3567Y112909D01*
X2598Y112165D01*
X1855Y111197D01*
X1816Y111102D01*
X1316Y111202D01*
Y116371D01*
X1816Y116407D01*
X2527Y115480D01*
X3517Y114720D01*
X4669Y114243D01*
X4905Y114212D01*
Y118858D01*
Y123504D01*
X4669Y123473D01*
X3517Y122996D01*
X2527Y122237D01*
X1816Y121310D01*
X1316Y121345D01*
Y126515D01*
X1816Y126615D01*
X1855Y126520D01*
X2598Y125551D01*
X3567Y124808D01*
X4695Y124341D01*
X5906Y124181D01*
X7116Y124341D01*
X8244Y124808D01*
X9213Y125551D01*
X9480Y125569D01*
X25206Y109842D01*
X21609Y106245D01*
X21233Y105683D01*
X21101Y105019D01*
Y86066D01*
X21053Y86034D01*
X20506Y85216D01*
X20315Y84252D01*
X20506Y83288D01*
X21053Y82470D01*
X21870Y81924D01*
X22835Y81732D01*
X23799Y81924D01*
X24617Y82470D01*
X25163Y83288D01*
X25355Y84252D01*
X25163Y85216D01*
X24617Y86034D01*
X24568Y86066D01*
Y104302D01*
X28376Y108109D01*
X29681D01*
X29877Y107978D01*
Y107377D01*
X29435Y107081D01*
X28954Y106361D01*
X28785Y105512D01*
X28954Y104663D01*
X29435Y103943D01*
X29877Y103647D01*
Y103046D01*
X29435Y102750D01*
X28954Y102030D01*
X28785Y101181D01*
X28954Y100332D01*
X29435Y99612D01*
X30155Y99131D01*
X31004Y98962D01*
X37500D01*
X38349Y99131D01*
X39069Y99612D01*
X39138Y99715D01*
X39739D01*
X39950Y99399D01*
X40768Y98853D01*
X41732Y98661D01*
X42697Y98853D01*
X43514Y99399D01*
X44061Y100217D01*
X44252Y101181D01*
X44061Y102145D01*
X43514Y102963D01*
X43315Y103096D01*
Y103596D01*
X43514Y103730D01*
X44061Y104547D01*
X44252Y105512D01*
X44061Y106476D01*
X43514Y107294D01*
X42697Y107840D01*
X41732Y108032D01*
X40768Y107840D01*
X39950Y107294D01*
X39739Y106978D01*
X39138D01*
X39069Y107081D01*
X38627Y107377D01*
Y107978D01*
X39069Y108273D01*
X39550Y108993D01*
X39719Y109842D01*
X39550Y110692D01*
X39069Y111411D01*
X38627Y111707D01*
Y112308D01*
X39069Y112604D01*
X39550Y113324D01*
X39719Y114173D01*
X39550Y115022D01*
X39069Y115742D01*
X38627Y116038D01*
Y116639D01*
X39069Y116935D01*
X39550Y117655D01*
X39719Y118504D01*
X39550Y119353D01*
X39069Y120073D01*
X38627Y120369D01*
Y120970D01*
X39069Y121265D01*
X39550Y121985D01*
X39719Y122835D01*
X39550Y123684D01*
X39069Y124404D01*
X38349Y124885D01*
X37500Y125054D01*
X31004D01*
X30155Y124885D01*
X29681Y124568D01*
X29000D01*
X20192Y133376D01*
Y140005D01*
X20060Y140668D01*
X19685Y141231D01*
X13757Y147158D01*
Y153645D01*
X13625Y154308D01*
X13250Y154870D01*
X10429Y157691D01*
X10582Y158858D01*
X10423Y160069D01*
X9956Y161197D01*
X9213Y162165D01*
X8244Y162909D01*
X7116Y163376D01*
X5906Y163535D01*
X4695Y163376D01*
X3567Y162909D01*
X2598Y162165D01*
X1855Y161197D01*
X1816Y161102D01*
X1316Y161202D01*
Y166515D01*
X1816Y166615D01*
X1855Y166520D01*
X2598Y165551D01*
X3567Y164808D01*
X4695Y164341D01*
X5906Y164181D01*
X7116Y164341D01*
X8244Y164808D01*
X9213Y165551D01*
X9956Y166520D01*
X10423Y167648D01*
X10442Y167788D01*
X16198D01*
X17829Y166157D01*
Y150720D01*
X17911Y150310D01*
X18143Y149963D01*
X23413Y144693D01*
X23413Y144693D01*
X23760Y144461D01*
X24170Y144380D01*
X24170Y144380D01*
X27630D01*
X28902Y143108D01*
X28785Y142520D01*
X28954Y141671D01*
X29435Y140951D01*
X30155Y140470D01*
X31004Y140301D01*
X37500D01*
X38349Y140470D01*
X39069Y140951D01*
X39550Y141671D01*
X39719Y142520D01*
X39550Y143369D01*
X39069Y144089D01*
X38627Y144385D01*
Y144986D01*
X39069Y145281D01*
X39550Y146001D01*
X39719Y146850D01*
X39550Y147700D01*
X39069Y148419D01*
X38719Y148653D01*
X38699Y149172D01*
X39045Y149473D01*
X39542Y149421D01*
X39557Y149399D01*
X40374Y148853D01*
X41339Y148661D01*
X42303Y148853D01*
X43011Y149326D01*
X43511Y149152D01*
Y128098D01*
X43592Y127689D01*
X43824Y127341D01*
X48269Y122897D01*
Y102584D01*
X34243Y88557D01*
X34011Y88210D01*
X33929Y87800D01*
Y83329D01*
X33543Y83012D01*
X33500Y83020D01*
X32536Y82828D01*
X31718Y82282D01*
X31172Y81464D01*
X30980Y80500D01*
X31172Y79536D01*
X31718Y78718D01*
X32536Y78172D01*
X33500Y77980D01*
X34464Y78172D01*
X35282Y78718D01*
X35400Y78895D01*
X35900D01*
X36018Y78718D01*
X36836Y78172D01*
X37800Y77980D01*
X38764Y78172D01*
X39582Y78718D01*
X40128Y79536D01*
X40320Y80500D01*
X40128Y81464D01*
X39834Y81904D01*
X40064Y82460D01*
X40284Y82504D01*
X41102Y83050D01*
X41648Y83868D01*
X41840Y84832D01*
X41648Y85796D01*
X41158Y86530D01*
X54022Y99394D01*
X54398Y99957D01*
X54530Y100620D01*
Y124763D01*
X54398Y125426D01*
X54022Y125988D01*
X49765Y130245D01*
Y154217D01*
X49633Y154881D01*
X49257Y155443D01*
X43632Y161068D01*
X43070Y161444D01*
X42406Y161576D01*
X39303D01*
X39275Y161618D01*
X38799Y161935D01*
X38238Y162047D01*
X35985D01*
Y191748D01*
X35853Y192411D01*
X35478Y192974D01*
X18367Y210084D01*
X17805Y210460D01*
X17142Y210592D01*
X10207D01*
X9956Y211197D01*
X9213Y212165D01*
X8244Y212909D01*
X7116Y213376D01*
X5906Y213535D01*
X4695Y213376D01*
X3567Y212909D01*
X2598Y212165D01*
X1855Y211197D01*
X1816Y211102D01*
X1316Y211202D01*
Y216371D01*
X1816Y216407D01*
X2527Y215480D01*
X3517Y214721D01*
X4669Y214243D01*
X4905Y214212D01*
Y218858D01*
X5906D01*
Y219858D01*
X10552D01*
X10521Y220095D01*
X10043Y221247D01*
X9284Y222237D01*
X8294Y222996D01*
X7142Y223473D01*
X6134Y223606D01*
Y224110D01*
X7142Y224243D01*
X8294Y224721D01*
X9284Y225480D01*
X10043Y226469D01*
X10521Y227622D01*
X10552Y227858D01*
X5906D01*
Y229858D01*
X10552D01*
X10521Y230095D01*
X10043Y231247D01*
X9284Y232237D01*
X8294Y232996D01*
X7142Y233473D01*
X6134Y233606D01*
Y234110D01*
X7142Y234243D01*
X8294Y234720D01*
X9284Y235480D01*
X10043Y236469D01*
X10521Y237622D01*
X10552Y237858D01*
X5906D01*
Y238858D01*
X4905D01*
Y243505D01*
X4669Y243473D01*
X3517Y242996D01*
X2527Y242237D01*
X1816Y241310D01*
X1316Y241346D01*
Y246716D01*
X144353D01*
Y241201D01*
D02*
G37*
G36*
X32519Y191030D02*
Y162047D01*
X30266D01*
X29705Y161935D01*
X29229Y161618D01*
X28911Y161142D01*
X28799Y160581D01*
Y159104D01*
X28911Y158543D01*
X29229Y158068D01*
X29620Y157806D01*
X29690Y157451D01*
X29680Y157245D01*
X29435Y157081D01*
X28954Y156361D01*
X28785Y155512D01*
X28785Y155512D01*
X28479Y155133D01*
X27987Y155119D01*
X27381Y155725D01*
Y190590D01*
X27381Y190590D01*
X27299Y191000D01*
X27067Y191347D01*
X27067Y191347D01*
X23131Y195283D01*
X22784Y195515D01*
X22374Y195596D01*
X10682D01*
X9870Y196408D01*
X9956Y196520D01*
X10423Y197648D01*
X10582Y198858D01*
X10423Y200069D01*
X9956Y201197D01*
X9213Y202165D01*
X8244Y202909D01*
X7116Y203376D01*
X5906Y203535D01*
X4695Y203376D01*
X3567Y202909D01*
X2598Y202165D01*
X1855Y201197D01*
X1816Y201102D01*
X1316Y201202D01*
Y206515D01*
X1816Y206615D01*
X1855Y206520D01*
X2598Y205551D01*
X3567Y204808D01*
X4695Y204341D01*
X5906Y204181D01*
X7116Y204341D01*
X8244Y204808D01*
X9213Y205551D01*
X9956Y206520D01*
X10207Y207125D01*
X16424D01*
X32519Y191030D01*
D02*
G37*
G36*
X23840Y189567D02*
Y154702D01*
X23921Y154292D01*
X24153Y153945D01*
X26208Y151890D01*
X26556Y151657D01*
X26965Y151576D01*
X26965Y151576D01*
X28469D01*
X28787Y151189D01*
X28785Y151181D01*
X28954Y150332D01*
X29435Y149612D01*
X29877Y149316D01*
Y148715D01*
X29435Y148419D01*
X29102Y147921D01*
X25193D01*
X21371Y151743D01*
Y167180D01*
X21371Y167180D01*
X21289Y167590D01*
X21057Y167937D01*
X21057Y167937D01*
X17973Y171021D01*
X17626Y171253D01*
X17216Y171334D01*
X13023D01*
X12271Y172086D01*
Y173563D01*
X12190Y173973D01*
X11958Y174320D01*
X11958Y174320D01*
X9870Y176408D01*
X9956Y176520D01*
X10423Y177648D01*
X10582Y178858D01*
X10423Y180069D01*
X9956Y181197D01*
X9213Y182165D01*
X8244Y182909D01*
X7116Y183376D01*
X5906Y183535D01*
X4695Y183376D01*
X3567Y182909D01*
X2598Y182165D01*
X1855Y181197D01*
X1816Y181102D01*
X1316Y181202D01*
Y186515D01*
X1816Y186615D01*
X1855Y186520D01*
X2598Y185551D01*
X3567Y184808D01*
X4695Y184341D01*
X5906Y184181D01*
X7116Y184341D01*
X8244Y184808D01*
X9213Y185551D01*
X9956Y186520D01*
X10423Y187648D01*
X10582Y188858D01*
X10423Y190069D01*
X9956Y191197D01*
X9870Y191309D01*
X10616Y192055D01*
X21351D01*
X23840Y189567D01*
D02*
G37*
G36*
X16151Y72595D02*
X16151Y72595D01*
X16498Y72363D01*
X16908Y72282D01*
X40553D01*
X40963Y72363D01*
X41310Y72595D01*
X43235Y74520D01*
X49694D01*
Y73709D01*
X54637D01*
Y74520D01*
X55599D01*
Y73709D01*
X59361D01*
X59729Y73391D01*
Y72843D01*
X59461Y72453D01*
X57980D01*
Y70473D01*
Y68144D01*
X58057Y67991D01*
X57944Y67839D01*
X54737D01*
Y69185D01*
X52165D01*
X49594D01*
Y67839D01*
X13712D01*
X11935Y69615D01*
X11588Y69847D01*
X11178Y69929D01*
X10442D01*
X10423Y70069D01*
X9956Y71197D01*
X9213Y72165D01*
X8244Y72909D01*
X7116Y73376D01*
X5906Y73535D01*
X4695Y73376D01*
X3567Y72909D01*
X2598Y72165D01*
X1855Y71197D01*
X1816Y71102D01*
X1316Y71201D01*
Y76515D01*
X1816Y76614D01*
X1855Y76520D01*
X2598Y75551D01*
X3567Y74808D01*
X4695Y74341D01*
X5906Y74181D01*
X7116Y74341D01*
X8244Y74808D01*
X9213Y75551D01*
X9956Y76520D01*
X10423Y77648D01*
X10442Y77788D01*
X10959D01*
X16151Y72595D01*
D02*
G37*
G36*
X128368Y146930D02*
Y58563D01*
X126852Y57047D01*
X126620Y56699D01*
X126538Y56290D01*
Y55888D01*
X125756Y55365D01*
X125209Y54547D01*
X125177Y54383D01*
X124004D01*
Y51524D01*
X125190D01*
Y51748D01*
X125690Y51899D01*
X125756Y51801D01*
X126573Y51255D01*
X127538Y51063D01*
X128502Y51255D01*
X129320Y51801D01*
X129866Y52618D01*
X130058Y53583D01*
X129866Y54547D01*
X129320Y55365D01*
X129071Y55531D01*
X129008Y56174D01*
X130196Y57362D01*
X130428Y57710D01*
X130509Y58119D01*
X130509Y58119D01*
Y68643D01*
X130971Y68835D01*
X131993Y67813D01*
X132473Y67492D01*
X133038Y67380D01*
X135357D01*
X135713Y66520D01*
X136457Y65551D01*
X137425Y64808D01*
X138553Y64341D01*
X139764Y64181D01*
X140974Y64341D01*
X142102Y64808D01*
X143071Y65551D01*
X143814Y66520D01*
X143853Y66615D01*
X144353Y66515D01*
Y61202D01*
X143853Y61102D01*
X143814Y61197D01*
X143071Y62165D01*
X142102Y62909D01*
X140974Y63376D01*
X139764Y63535D01*
X138553Y63376D01*
X137425Y62909D01*
X136457Y62165D01*
X135713Y61197D01*
X135246Y60069D01*
X135087Y58858D01*
X135246Y57648D01*
X135713Y56520D01*
X136457Y55551D01*
X137425Y54808D01*
X138553Y54341D01*
X139764Y54181D01*
X140974Y54341D01*
X142102Y54808D01*
X143071Y55551D01*
X143814Y56520D01*
X143853Y56615D01*
X144353Y56515D01*
Y51201D01*
X143853Y51102D01*
X143814Y51197D01*
X143071Y52165D01*
X142102Y52909D01*
X140974Y53376D01*
X139764Y53535D01*
X138553Y53376D01*
X137425Y52909D01*
X136457Y52165D01*
X135713Y51197D01*
X135246Y50069D01*
X135087Y48858D01*
X135246Y47648D01*
X135713Y46520D01*
X136457Y45551D01*
X137425Y44808D01*
X138553Y44341D01*
X139764Y44181D01*
X140974Y44341D01*
X142102Y44808D01*
X143071Y45551D01*
X143814Y46520D01*
X143853Y46615D01*
X144353Y46515D01*
Y41201D01*
X143853Y41102D01*
X143814Y41197D01*
X143071Y42165D01*
X142102Y42909D01*
X140974Y43376D01*
X139764Y43535D01*
X138553Y43376D01*
X137425Y42909D01*
X136457Y42165D01*
X135713Y41197D01*
X135246Y40069D01*
X135228Y39929D01*
X129358D01*
X128949Y39847D01*
X128601Y39615D01*
X126356Y37371D01*
X120343D01*
X115285Y42429D01*
Y53329D01*
X117376D01*
X117786Y53411D01*
X118133Y53643D01*
X127357Y62867D01*
X127589Y63214D01*
X127671Y63624D01*
Y141757D01*
X127589Y142167D01*
X127357Y142514D01*
X117933Y151938D01*
X117586Y152170D01*
X117176Y152252D01*
X116568D01*
X116234Y152750D01*
X115792Y153046D01*
Y153647D01*
X116234Y153943D01*
X116568Y154441D01*
X120857D01*
X128368Y146930D01*
D02*
G37*
%LPC*%
G36*
X63165Y246064D02*
Y241315D01*
X67915D01*
X67901Y241456D01*
X67568Y242553D01*
X67028Y243564D01*
X66300Y244450D01*
X65414Y245177D01*
X64403Y245718D01*
X63306Y246051D01*
X63165Y246064D01*
D02*
G37*
G36*
X43165D02*
Y241315D01*
X47915D01*
X47901Y241456D01*
X47568Y242553D01*
X47028Y243564D01*
X46300Y244450D01*
X45414Y245177D01*
X44403Y245718D01*
X43306Y246051D01*
X43165Y246064D01*
D02*
G37*
G36*
X61165D02*
X61024Y246051D01*
X59927Y245718D01*
X58916Y245177D01*
X58030Y244450D01*
X57303Y243564D01*
X56763Y242553D01*
X56430Y241456D01*
X56416Y241315D01*
X61165D01*
Y246064D01*
D02*
G37*
G36*
X41165D02*
X41025Y246051D01*
X39928Y245718D01*
X38917Y245177D01*
X38030Y244450D01*
X37303Y243564D01*
X36763Y242553D01*
X36430Y241456D01*
X36416Y241315D01*
X41165D01*
Y246064D01*
D02*
G37*
G36*
X6905Y243505D02*
Y239858D01*
X10552D01*
X10521Y240095D01*
X10043Y241247D01*
X9284Y242237D01*
X8294Y242996D01*
X7142Y243473D01*
X6905Y243505D01*
D02*
G37*
G36*
X22047Y244488D02*
X13386D01*
Y235827D01*
X22047D01*
Y244488D01*
D02*
G37*
G36*
X67915Y239315D02*
X63165D01*
Y234566D01*
X63306Y234579D01*
X64403Y234912D01*
X65414Y235453D01*
X66300Y236180D01*
X67028Y237066D01*
X67568Y238077D01*
X67901Y239174D01*
X67915Y239315D01*
D02*
G37*
G36*
X47915D02*
X43165D01*
Y234566D01*
X43306Y234579D01*
X44403Y234912D01*
X45414Y235453D01*
X46300Y236180D01*
X47028Y237066D01*
X47568Y238077D01*
X47901Y239174D01*
X47915Y239315D01*
D02*
G37*
G36*
X61165D02*
X56416D01*
X56430Y239174D01*
X56763Y238077D01*
X57303Y237066D01*
X58030Y236180D01*
X58916Y235453D01*
X59927Y234912D01*
X61024Y234579D01*
X61165Y234566D01*
Y239315D01*
D02*
G37*
G36*
X41165D02*
X36416D01*
X36430Y239174D01*
X36763Y238077D01*
X37303Y237066D01*
X38030Y236180D01*
X38917Y235453D01*
X39928Y234912D01*
X41025Y234579D01*
X41165Y234566D01*
Y239315D01*
D02*
G37*
G36*
X131902Y233871D02*
X124909D01*
Y231209D01*
X131902D01*
Y233871D01*
D02*
G37*
G36*
X123909D02*
X116917D01*
Y231209D01*
X123909D01*
Y233871D01*
D02*
G37*
G36*
X138764Y233505D02*
X138527Y233473D01*
X137375Y232996D01*
X136385Y232237D01*
X135626Y231247D01*
X135149Y230095D01*
X135117Y229858D01*
X138764D01*
Y233505D01*
D02*
G37*
G36*
X131902Y230209D02*
X124909D01*
Y227547D01*
X131902D01*
Y230209D01*
D02*
G37*
G36*
X123909D02*
X116917D01*
Y227547D01*
X123909D01*
Y230209D01*
D02*
G37*
G36*
X138764Y227858D02*
X135117D01*
X135149Y227622D01*
X135626Y226469D01*
X136385Y225480D01*
X137375Y224721D01*
X138527Y224243D01*
X138764Y224212D01*
Y227858D01*
D02*
G37*
G36*
X43165Y226064D02*
Y221315D01*
X47915D01*
X47901Y221456D01*
X47568Y222553D01*
X47028Y223564D01*
X46300Y224450D01*
X45414Y225177D01*
X44403Y225718D01*
X43306Y226050D01*
X43165Y226064D01*
D02*
G37*
G36*
X63165D02*
Y221315D01*
X67915D01*
X67901Y221456D01*
X67568Y222553D01*
X67028Y223564D01*
X66300Y224450D01*
X65414Y225177D01*
X64403Y225718D01*
X63306Y226050D01*
X63165Y226064D01*
D02*
G37*
G36*
X41165D02*
X41025Y226050D01*
X39928Y225718D01*
X38917Y225177D01*
X38030Y224450D01*
X37303Y223564D01*
X36763Y222553D01*
X36430Y221456D01*
X36416Y221315D01*
X41165D01*
Y226064D01*
D02*
G37*
G36*
X61165D02*
X61024Y226050D01*
X59927Y225718D01*
X58916Y225177D01*
X58030Y224450D01*
X57303Y223564D01*
X56763Y222553D01*
X56430Y221456D01*
X56416Y221315D01*
X61165D01*
Y226064D01*
D02*
G37*
G36*
X94698Y220682D02*
X91051D01*
Y215854D01*
X94698D01*
Y220682D01*
D02*
G37*
G36*
X90051D02*
X86405D01*
Y215854D01*
X90051D01*
Y220682D01*
D02*
G37*
G36*
X67915Y219315D02*
X63165D01*
Y214566D01*
X63306Y214580D01*
X64403Y214912D01*
X65414Y215453D01*
X66300Y216180D01*
X67028Y217066D01*
X67568Y218077D01*
X67901Y219174D01*
X67915Y219315D01*
D02*
G37*
G36*
X47915D02*
X43165D01*
Y214566D01*
X43306Y214580D01*
X44403Y214912D01*
X45414Y215453D01*
X46300Y216180D01*
X47028Y217066D01*
X47568Y218077D01*
X47901Y219174D01*
X47915Y219315D01*
D02*
G37*
G36*
X61165D02*
X56416D01*
X56430Y219174D01*
X56763Y218077D01*
X57303Y217066D01*
X58030Y216180D01*
X58916Y215453D01*
X59927Y214912D01*
X61024Y214580D01*
X61165Y214566D01*
Y219315D01*
D02*
G37*
G36*
X41165D02*
X36416D01*
X36430Y219174D01*
X36763Y218077D01*
X37303Y217066D01*
X38030Y216180D01*
X38917Y215453D01*
X39928Y214912D01*
X41025Y214580D01*
X41165Y214566D01*
Y219315D01*
D02*
G37*
G36*
X10552Y217858D02*
X6905D01*
Y214212D01*
X7142Y214243D01*
X8294Y214721D01*
X9284Y215480D01*
X10043Y216469D01*
X10521Y217622D01*
X10552Y217858D01*
D02*
G37*
G36*
X48181Y212808D02*
X46700D01*
Y210736D01*
X48181D01*
Y212808D01*
D02*
G37*
G36*
X45700D02*
X44219D01*
Y210736D01*
X45700D01*
Y212808D01*
D02*
G37*
G36*
X94698Y214854D02*
X91051D01*
Y210027D01*
X94698D01*
Y214854D01*
D02*
G37*
G36*
X90051D02*
X86405D01*
Y210027D01*
X90051D01*
Y214854D01*
D02*
G37*
G36*
X48181Y209736D02*
X46700D01*
Y207665D01*
X48181D01*
Y209736D01*
D02*
G37*
G36*
X45700D02*
X44219D01*
Y207665D01*
X45700D01*
Y209736D01*
D02*
G37*
G36*
X107984Y215858D02*
X103040D01*
Y210284D01*
X99235Y204848D01*
X93799D01*
X93732Y204834D01*
X93663Y204834D01*
X93661Y204834D01*
X86505D01*
Y196372D01*
X86011Y195879D01*
X85856Y195647D01*
X85802Y195374D01*
X85802Y181184D01*
X85324Y181039D01*
X85303Y181070D01*
X84550Y181573D01*
X84161Y181651D01*
Y176181D01*
Y170712D01*
X84550Y170789D01*
X85303Y171292D01*
X85586Y171716D01*
X86188D01*
X86423Y171364D01*
X86769Y171133D01*
Y166899D01*
X71793Y151924D01*
X67116D01*
X66743Y152482D01*
X65925Y153028D01*
X64961Y153220D01*
X63996Y153028D01*
X63179Y152482D01*
X62632Y151664D01*
X62441Y150700D01*
X62632Y149736D01*
X63179Y148918D01*
X63996Y148372D01*
X64961Y148180D01*
X65925Y148372D01*
X66743Y148918D01*
X67116Y149477D01*
X72300D01*
X72768Y149570D01*
X73165Y149835D01*
X88857Y165527D01*
X89122Y165924D01*
X89216Y166392D01*
Y171133D01*
X89561Y171364D01*
X89857Y171807D01*
X90458D01*
X90754Y171364D01*
X91474Y170883D01*
X92323Y170714D01*
X93172Y170883D01*
X93892Y171364D01*
X94188Y171807D01*
X94789D01*
X95085Y171364D01*
X95804Y170883D01*
X96653Y170714D01*
X97503Y170883D01*
X98223Y171364D01*
X98704Y172084D01*
X98873Y172933D01*
Y179429D01*
X98704Y180278D01*
X98223Y180998D01*
X98231Y181512D01*
X98522Y181829D01*
X111000D01*
X111410Y181911D01*
X111757Y182143D01*
X115857Y186243D01*
X115857Y186243D01*
X116089Y186590D01*
X116171Y187000D01*
X116171Y187000D01*
Y203298D01*
X116089Y203708D01*
X115857Y204055D01*
X115857Y204056D01*
X114952Y204961D01*
X115119Y205800D01*
X114927Y206764D01*
X114380Y207582D01*
X113563Y208128D01*
X112598Y208320D01*
X111634Y208128D01*
X110817Y207582D01*
X110270Y206764D01*
X110078Y205800D01*
X110270Y204836D01*
X110817Y204018D01*
X111634Y203472D01*
X112598Y203280D01*
X113438Y203447D01*
X114029Y202855D01*
Y187443D01*
X110556Y183971D01*
X97744D01*
X97334Y183889D01*
X96987Y183657D01*
X95897Y182566D01*
X95664Y182219D01*
X95583Y181809D01*
Y181331D01*
X95085Y180998D01*
X94915Y180744D01*
X94415Y180895D01*
Y189271D01*
X96555Y191412D01*
X105512D01*
X105581Y191426D01*
X112905D01*
Y197550D01*
X107997D01*
Y210039D01*
X107984Y210108D01*
Y215858D01*
D02*
G37*
G36*
X123909Y197650D02*
X116917D01*
Y194988D01*
X123909D01*
Y197650D01*
D02*
G37*
G36*
X48181Y195879D02*
X46700D01*
Y193807D01*
X48181D01*
Y195879D01*
D02*
G37*
G36*
X45700D02*
X44219D01*
Y193807D01*
X45700D01*
Y195879D01*
D02*
G37*
G36*
X83871Y193517D02*
X82390D01*
Y191445D01*
X83871D01*
Y193517D01*
D02*
G37*
G36*
X81390D02*
X79909D01*
Y191445D01*
X81390D01*
Y193517D01*
D02*
G37*
G36*
X123909Y193988D02*
X116917D01*
Y191326D01*
X123909D01*
Y193988D01*
D02*
G37*
G36*
X48181Y192807D02*
X46700D01*
Y190735D01*
X48181D01*
Y192807D01*
D02*
G37*
G36*
X45700D02*
X44219D01*
Y190735D01*
X45700D01*
Y192807D01*
D02*
G37*
G36*
X83871Y190445D02*
X82390D01*
Y188373D01*
X83871D01*
Y190445D01*
D02*
G37*
G36*
X81390D02*
X79909D01*
Y188373D01*
X81390D01*
Y190445D01*
D02*
G37*
G36*
X100406Y190367D02*
X98925D01*
Y188295D01*
X100406D01*
Y190367D01*
D02*
G37*
G36*
X97925D02*
X96444D01*
Y188295D01*
X97925D01*
Y190367D01*
D02*
G37*
G36*
X83871Y187611D02*
X82390D01*
Y185539D01*
X83871D01*
Y187611D01*
D02*
G37*
G36*
X81390D02*
X79909D01*
Y185539D01*
X81390D01*
Y187611D01*
D02*
G37*
G36*
X100406Y187295D02*
X98925D01*
Y185224D01*
X100406D01*
Y187295D01*
D02*
G37*
G36*
X97925D02*
X96444D01*
Y185224D01*
X97925D01*
Y187295D01*
D02*
G37*
G36*
X83871Y184539D02*
X82390D01*
Y182468D01*
X83871D01*
Y184539D01*
D02*
G37*
G36*
X81390D02*
X79909D01*
Y182468D01*
X81390D01*
Y184539D01*
D02*
G37*
G36*
X52165Y237733D02*
X50718Y237590D01*
X49327Y237168D01*
X48044Y236483D01*
X46920Y235560D01*
X45998Y234436D01*
X45312Y233154D01*
X44890Y231762D01*
X44748Y230315D01*
X44890Y228868D01*
X45312Y227476D01*
X45998Y226194D01*
X46920Y225070D01*
X48044Y224147D01*
X49327Y223462D01*
X49442Y223427D01*
Y205900D01*
Y197365D01*
Y181623D01*
X49001Y181387D01*
X48723Y181573D01*
X48335Y181651D01*
Y176181D01*
Y170712D01*
X48723Y170789D01*
X49476Y171292D01*
X49760Y171716D01*
X50361D01*
X50596Y171364D01*
X51316Y170883D01*
X52165Y170714D01*
X53014Y170883D01*
X53734Y171364D01*
X53970Y171716D01*
X54571D01*
X54855Y171292D01*
X55608Y170789D01*
X55996Y170712D01*
Y176181D01*
Y181651D01*
X55608Y181573D01*
X55330Y181387D01*
X54889Y181623D01*
Y197365D01*
Y205900D01*
Y223427D01*
X55004Y223462D01*
X56286Y224147D01*
X57410Y225070D01*
X58333Y226194D01*
X59018Y227476D01*
X59440Y228868D01*
X59583Y230315D01*
X59440Y231762D01*
X59018Y233154D01*
X58333Y234436D01*
X57410Y235560D01*
X56286Y236483D01*
X55004Y237168D01*
X53613Y237590D01*
X52165Y237733D01*
D02*
G37*
G36*
X83161Y181651D02*
X82773Y181573D01*
X82020Y181070D01*
X81797Y180736D01*
X81195D01*
X80972Y181070D01*
X80219Y181573D01*
X79831Y181651D01*
Y176181D01*
Y170712D01*
X80219Y170789D01*
X80972Y171292D01*
X81195Y171626D01*
X81797D01*
X82020Y171292D01*
X82773Y170789D01*
X83161Y170712D01*
Y176181D01*
Y181651D01*
D02*
G37*
G36*
X60327D02*
X59939Y181573D01*
X59186Y181070D01*
X58962Y180736D01*
X58361D01*
X58137Y181070D01*
X57384Y181573D01*
X56996Y181651D01*
Y176181D01*
Y170712D01*
X57384Y170789D01*
X58137Y171292D01*
X58361Y171626D01*
X58962D01*
X59186Y171292D01*
X59939Y170789D01*
X60327Y170712D01*
Y176181D01*
Y181651D01*
D02*
G37*
G36*
X78831D02*
X78443Y181573D01*
X77689Y181070D01*
X77186Y180317D01*
X77010Y179429D01*
Y176681D01*
X78831D01*
Y181651D01*
D02*
G37*
G36*
X61327D02*
Y176681D01*
X63148D01*
Y179429D01*
X62971Y180317D01*
X62468Y181070D01*
X61715Y181573D01*
X61327Y181651D01*
D02*
G37*
G36*
X47335D02*
X46946Y181573D01*
X46194Y181070D01*
X45690Y180317D01*
X45514Y179429D01*
Y176681D01*
X47335D01*
Y181651D01*
D02*
G37*
G36*
X78831Y175681D02*
X77010D01*
Y172933D01*
X77186Y172045D01*
X77689Y171292D01*
X78443Y170789D01*
X78831Y170712D01*
Y175681D01*
D02*
G37*
G36*
X63148D02*
X61327D01*
Y170712D01*
X61715Y170789D01*
X62468Y171292D01*
X62971Y172045D01*
X63148Y172933D01*
Y175681D01*
D02*
G37*
G36*
X47335D02*
X45514D01*
Y172933D01*
X45690Y172045D01*
X46194Y171292D01*
X46946Y170789D01*
X47335Y170712D01*
Y175681D01*
D02*
G37*
G36*
X138764Y143505D02*
X138527Y143473D01*
X137375Y142996D01*
X136385Y142237D01*
X135626Y141247D01*
X135149Y140095D01*
X135117Y139858D01*
X138764D01*
Y143505D01*
D02*
G37*
G36*
Y137858D02*
X135117D01*
X135149Y137622D01*
X135626Y136469D01*
X136385Y135480D01*
X137375Y134721D01*
X138527Y134243D01*
X138764Y134212D01*
Y137858D01*
D02*
G37*
G36*
X92700Y135220D02*
X91736Y135028D01*
X90918Y134482D01*
X90372Y133664D01*
X90180Y132700D01*
X90372Y131736D01*
X90918Y130918D01*
X91736Y130372D01*
X92700Y130180D01*
X93359Y130311D01*
X93735Y129935D01*
X94132Y129670D01*
X94600Y129577D01*
X114345D01*
X114718Y129018D01*
X115536Y128472D01*
X116500Y128280D01*
X117464Y128472D01*
X118282Y129018D01*
X118828Y129836D01*
X119020Y130800D01*
X118828Y131764D01*
X118282Y132582D01*
X117464Y133128D01*
X116500Y133320D01*
X115536Y133128D01*
X114718Y132582D01*
X114345Y132024D01*
X95595D01*
X95185Y132524D01*
X95220Y132700D01*
X95028Y133664D01*
X94482Y134482D01*
X93664Y135028D01*
X92700Y135220D01*
D02*
G37*
G36*
X6905Y123504D02*
Y119858D01*
X10552D01*
X10521Y120095D01*
X10043Y121247D01*
X9284Y122237D01*
X8294Y122996D01*
X7142Y123473D01*
X6905Y123504D01*
D02*
G37*
G36*
X10552Y117858D02*
X6905D01*
Y114212D01*
X7142Y114243D01*
X8294Y114720D01*
X9284Y115480D01*
X10043Y116469D01*
X10521Y117622D01*
X10552Y117858D01*
D02*
G37*
G36*
X104331Y125355D02*
X103366Y125163D01*
X102549Y124617D01*
X102003Y123799D01*
X101811Y122835D01*
X102003Y121870D01*
X102549Y121053D01*
X102748Y120919D01*
Y120419D01*
X102549Y120286D01*
X102003Y119468D01*
X101811Y118504D01*
X102003Y117540D01*
X102549Y116722D01*
X102748Y116589D01*
Y116089D01*
X102549Y115955D01*
X102003Y115138D01*
X101811Y114173D01*
X102003Y113209D01*
X102549Y112391D01*
X102748Y112258D01*
Y111758D01*
X102549Y111625D01*
X102003Y110807D01*
X101811Y109843D01*
X102003Y108878D01*
X102549Y108061D01*
X102748Y107927D01*
Y107427D01*
X102549Y107294D01*
X102003Y106476D01*
X101811Y105512D01*
X102003Y104547D01*
X102549Y103730D01*
X102748Y103596D01*
Y103096D01*
X102549Y102963D01*
X102003Y102146D01*
X101811Y101181D01*
X102003Y100217D01*
X102549Y99399D01*
X103366Y98853D01*
X104331Y98661D01*
X105295Y98853D01*
X106113Y99399D01*
X106150Y99455D01*
X106777Y99494D01*
X107320Y99131D01*
X108169Y98962D01*
X114665D01*
X115515Y99131D01*
X116234Y99612D01*
X116716Y100332D01*
X116884Y101181D01*
X116716Y102030D01*
X116234Y102750D01*
X115792Y103046D01*
Y103647D01*
X116234Y103943D01*
X116716Y104663D01*
X116884Y105512D01*
X116716Y106361D01*
X116234Y107081D01*
X115792Y107377D01*
Y107978D01*
X116234Y108273D01*
X116716Y108993D01*
X116884Y109843D01*
X116716Y110692D01*
X116234Y111412D01*
X115792Y111707D01*
Y112309D01*
X116234Y112604D01*
X116716Y113324D01*
X116884Y114173D01*
X116716Y115022D01*
X116234Y115742D01*
X115792Y116038D01*
Y116639D01*
X116234Y116935D01*
X116716Y117655D01*
X116884Y118504D01*
X116716Y119353D01*
X116234Y120073D01*
X115792Y120369D01*
Y120970D01*
X116234Y121266D01*
X116716Y121985D01*
X116884Y122835D01*
X116716Y123684D01*
X116234Y124404D01*
X115515Y124885D01*
X114665Y125054D01*
X108169D01*
X107320Y124885D01*
X106777Y124522D01*
X106150Y124561D01*
X106113Y124617D01*
X105295Y125163D01*
X104331Y125355D01*
D02*
G37*
G36*
X58700Y115620D02*
X57736Y115428D01*
X56918Y114882D01*
X56372Y114064D01*
X56180Y113100D01*
X56372Y112136D01*
X56918Y111318D01*
X57477Y110945D01*
Y94036D01*
X57570Y93568D01*
X57835Y93171D01*
X60071Y90935D01*
X60468Y90670D01*
X60936Y90576D01*
X73693D01*
X74400Y89870D01*
X74081Y89482D01*
X73684Y89747D01*
X72835Y89916D01*
X71986Y89747D01*
X71266Y89266D01*
X70785Y88546D01*
X70616Y87697D01*
Y81201D01*
X70785Y80352D01*
X71266Y79632D01*
X71986Y79151D01*
X72835Y78982D01*
X73684Y79151D01*
X74404Y79632D01*
X74458Y79713D01*
X74958Y79561D01*
Y77078D01*
X73710D01*
Y73315D01*
X78653D01*
Y77078D01*
X77405D01*
Y79334D01*
X77905Y79536D01*
X78482Y79151D01*
X79331Y78982D01*
X80180Y79151D01*
X80900Y79632D01*
X81195Y80074D01*
X81797D01*
X82092Y79632D01*
X82812Y79151D01*
X83662Y78982D01*
X84511Y79151D01*
X85230Y79632D01*
X85526Y80074D01*
X86127D01*
X86423Y79632D01*
X87143Y79151D01*
X87992Y78982D01*
X88841Y79151D01*
X89561Y79632D01*
X89857Y80074D01*
X90458D01*
X90754Y79632D01*
X91198Y79335D01*
Y78456D01*
X90639D01*
Y73513D01*
X94401D01*
Y78456D01*
X93645D01*
Y79467D01*
X93892Y79632D01*
X94188Y80074D01*
X94789D01*
X95085Y79632D01*
X95804Y79151D01*
X96391Y79034D01*
X96444Y78556D01*
X96444Y78514D01*
Y76484D01*
X97925D01*
Y78556D01*
X97075D01*
X97026Y79056D01*
X97503Y79151D01*
X98223Y79632D01*
X98704Y80352D01*
X98873Y81201D01*
Y87697D01*
X98704Y88546D01*
X98250Y89225D01*
X98191Y89384D01*
X98191Y89787D01*
X98435Y89950D01*
X98982Y90768D01*
X99174Y91732D01*
X98982Y92697D01*
X98435Y93514D01*
X97901Y93872D01*
X98052Y94372D01*
X99092D01*
X99909Y93555D01*
X100389Y93234D01*
X100955Y93122D01*
X116615D01*
X116818Y92818D01*
X117636Y92272D01*
X118600Y92080D01*
X119564Y92272D01*
X120382Y92818D01*
X120928Y93636D01*
X121120Y94600D01*
X120928Y95564D01*
X120382Y96382D01*
X119564Y96928D01*
X118600Y97120D01*
X117636Y96928D01*
X116818Y96382D01*
X116615Y96078D01*
X101567D01*
X100750Y96895D01*
X100270Y97216D01*
X99705Y97328D01*
X93596D01*
X93030Y97216D01*
X92550Y96895D01*
X91277Y95622D01*
X90957Y95143D01*
X90845Y94577D01*
Y93717D01*
X90541Y93514D01*
X89995Y92697D01*
X89803Y91732D01*
X89995Y90768D01*
X90541Y89950D01*
X90710Y89838D01*
X90752Y89293D01*
X90726Y89225D01*
X90458Y88823D01*
X89857D01*
X89561Y89266D01*
X88841Y89747D01*
X87992Y89916D01*
X87143Y89747D01*
X86423Y89266D01*
X86127Y88823D01*
X85526D01*
X85230Y89266D01*
X84511Y89747D01*
X83662Y89916D01*
X82812Y89747D01*
X82092Y89266D01*
X81797Y88823D01*
X81195D01*
X80900Y89266D01*
X80180Y89747D01*
X79331Y89916D01*
X78482Y89747D01*
X77905Y89362D01*
X77405Y89564D01*
Y89819D01*
X77312Y90287D01*
X77047Y90684D01*
X75065Y92665D01*
X74668Y92930D01*
X74200Y93024D01*
X61443D01*
X59923Y94543D01*
Y110945D01*
X60482Y111318D01*
X61028Y112136D01*
X61220Y113100D01*
X61028Y114064D01*
X60482Y114882D01*
X59664Y115428D01*
X58700Y115620D01*
D02*
G37*
G36*
X138764Y93505D02*
X138527Y93473D01*
X137375Y92996D01*
X136385Y92237D01*
X135626Y91247D01*
X135149Y90095D01*
X135117Y89858D01*
X138764D01*
Y93505D01*
D02*
G37*
G36*
Y87858D02*
X135117D01*
X135149Y87622D01*
X135626Y86469D01*
X136385Y85480D01*
X137375Y84720D01*
X138527Y84243D01*
X138764Y84212D01*
Y87858D01*
D02*
G37*
G36*
X67717Y89916D02*
X66867Y89747D01*
X66148Y89266D01*
X65667Y88546D01*
X65498Y87697D01*
Y81201D01*
X65667Y80352D01*
X66148Y79632D01*
X66867Y79151D01*
X67717Y78982D01*
X68566Y79151D01*
X69286Y79632D01*
X69767Y80352D01*
X69936Y81201D01*
Y87697D01*
X69767Y88546D01*
X69286Y89266D01*
X68566Y89747D01*
X67717Y89916D01*
D02*
G37*
G36*
X100406Y78556D02*
X98925D01*
Y76484D01*
X100406D01*
Y78556D01*
D02*
G37*
G36*
Y75484D02*
X98925D01*
Y73413D01*
X100406D01*
Y75484D01*
D02*
G37*
G36*
X97925D02*
X96444D01*
Y73413D01*
X97925D01*
Y75484D01*
D02*
G37*
G36*
X72747Y71566D02*
X67804D01*
Y67804D01*
X72747D01*
Y68615D01*
X73710D01*
Y67804D01*
X78653D01*
Y71566D01*
X73710D01*
Y70756D01*
X72747D01*
Y71566D01*
D02*
G37*
G36*
X22600Y61378D02*
X21636Y61186D01*
X20818Y60640D01*
X20272Y59823D01*
X20080Y58858D01*
X20091Y58801D01*
X16097Y54807D01*
X15721Y54244D01*
X15589Y53581D01*
Y43613D01*
X14851D01*
Y39851D01*
X19794D01*
Y43613D01*
X19056D01*
Y52863D01*
X22543Y56350D01*
X22600Y56338D01*
X23564Y56530D01*
X24382Y57076D01*
X24928Y57894D01*
X25120Y58858D01*
X24928Y59823D01*
X24382Y60640D01*
X23564Y61186D01*
X22600Y61378D01*
D02*
G37*
G36*
X75820Y54383D02*
X74634D01*
Y51524D01*
X75820D01*
Y54383D01*
D02*
G37*
G36*
X73634D02*
X72448D01*
Y51524D01*
X73634D01*
Y54383D01*
D02*
G37*
G36*
X6905Y53505D02*
Y49858D01*
X10552D01*
X10521Y50095D01*
X10043Y51247D01*
X9284Y52237D01*
X8294Y52996D01*
X7142Y53473D01*
X6905Y53505D01*
D02*
G37*
G36*
X75820Y50524D02*
X74634D01*
Y47665D01*
X75820D01*
Y50524D01*
D02*
G37*
G36*
X73634D02*
X72448D01*
Y47665D01*
X73634D01*
Y50524D01*
D02*
G37*
G36*
X75820Y46509D02*
X74634D01*
Y43650D01*
X75820D01*
Y46509D01*
D02*
G37*
G36*
X73634D02*
X72448D01*
Y43650D01*
X73634D01*
Y46509D01*
D02*
G37*
G36*
X38583Y53304D02*
X37218Y53124D01*
X35946Y52598D01*
X34854Y51760D01*
X34016Y50668D01*
X33490Y49396D01*
X33310Y48031D01*
X33490Y46667D01*
X34016Y45395D01*
X34854Y44303D01*
X35946Y43465D01*
X37218Y42939D01*
X38583Y42759D01*
X39947Y42939D01*
X41219Y43465D01*
X42311Y44303D01*
X43149Y45395D01*
X43676Y46667D01*
X43855Y48031D01*
X43676Y49396D01*
X43149Y50668D01*
X42311Y51760D01*
X41219Y52598D01*
X39947Y53124D01*
X38583Y53304D01*
D02*
G37*
G36*
X49606Y50548D02*
X48242Y50369D01*
X46970Y49842D01*
X45878Y49004D01*
X45040Y47912D01*
X44513Y46640D01*
X44334Y45276D01*
X44513Y43911D01*
X45040Y42639D01*
X45878Y41547D01*
X46970Y40709D01*
X48242Y40183D01*
X49606Y40003D01*
X50971Y40183D01*
X52243Y40709D01*
X53335Y41547D01*
X54173Y42639D01*
X54699Y43911D01*
X54879Y45276D01*
X54699Y46640D01*
X54173Y47912D01*
X53335Y49004D01*
X52243Y49842D01*
X50971Y50369D01*
X49606Y50548D01*
D02*
G37*
G36*
X27559D02*
X26194Y50369D01*
X24923Y49842D01*
X23831Y49004D01*
X22993Y47912D01*
X22466Y46640D01*
X22286Y45276D01*
X22466Y43911D01*
X22993Y42639D01*
X23831Y41547D01*
X24923Y40709D01*
X26194Y40183D01*
X27559Y40003D01*
X28924Y40183D01*
X30195Y40709D01*
X31287Y41547D01*
X32125Y42639D01*
X32652Y43911D01*
X32832Y45276D01*
X32652Y46640D01*
X32125Y47912D01*
X31287Y49004D01*
X30195Y49842D01*
X28924Y50369D01*
X27559Y50548D01*
D02*
G37*
G36*
X75820Y42650D02*
X74634D01*
Y39791D01*
X75820D01*
Y42650D01*
D02*
G37*
G36*
X73634D02*
X72448D01*
Y39791D01*
X73634D01*
Y42650D01*
D02*
G37*
G36*
X38583Y38629D02*
X37756Y38520D01*
X36985Y38201D01*
X36323Y37693D01*
X35815Y37031D01*
X35496Y36260D01*
X35387Y35433D01*
X35496Y34606D01*
X35815Y33835D01*
X36323Y33173D01*
X36985Y32665D01*
X37756Y32346D01*
X38583Y32237D01*
X39410Y32346D01*
X40181Y32665D01*
X40843Y33173D01*
X41350Y33835D01*
X41670Y34606D01*
X41778Y35433D01*
X41670Y36260D01*
X41350Y37031D01*
X40843Y37693D01*
X40181Y38201D01*
X39410Y38520D01*
X38583Y38629D01*
D02*
G37*
G36*
X138764Y33595D02*
X135027D01*
Y29858D01*
X138764D01*
Y33595D01*
D02*
G37*
G36*
X19794Y37708D02*
X14851D01*
Y33946D01*
X15589D01*
Y32787D01*
X14064D01*
Y28631D01*
X20582D01*
Y32787D01*
X19056D01*
Y33946D01*
X19794D01*
Y37708D01*
D02*
G37*
G36*
X22785Y25779D02*
X21821Y25587D01*
X21082Y25094D01*
X21010Y25115D01*
X20582Y25306D01*
X20582Y25306D01*
X20582Y25306D01*
X14064D01*
Y21150D01*
X20582D01*
Y21207D01*
X20782Y21335D01*
X21082Y21425D01*
X21821Y20931D01*
X22785Y20739D01*
X23749Y20931D01*
X24567Y21477D01*
X25113Y22295D01*
X25305Y23259D01*
X25113Y24224D01*
X24567Y25041D01*
X23749Y25587D01*
X22785Y25779D01*
D02*
G37*
G36*
X138764Y27858D02*
X135027D01*
Y24121D01*
X138764D01*
Y27858D01*
D02*
G37*
G36*
X10643Y27858D02*
X6905D01*
Y24121D01*
X10643D01*
Y27858D01*
D02*
G37*
G36*
X50394Y18977D02*
X48926Y18784D01*
X47559Y18217D01*
X46385Y17316D01*
X45483Y16142D01*
X44917Y14774D01*
X44724Y13307D01*
X44917Y11840D01*
X45483Y10472D01*
X46385Y9298D01*
X47559Y8397D01*
X48926Y7830D01*
X50394Y7637D01*
X51861Y7830D01*
X53229Y8397D01*
X54403Y9298D01*
X55304Y10472D01*
X55870Y11840D01*
X56063Y13307D01*
X55870Y14774D01*
X55304Y16142D01*
X54403Y17316D01*
X53229Y18217D01*
X51861Y18784D01*
X50394Y18977D01*
D02*
G37*
G36*
X26772D02*
X25304Y18784D01*
X23937Y18217D01*
X22762Y17316D01*
X21861Y16142D01*
X21295Y14774D01*
X21102Y13307D01*
X21295Y11840D01*
X21861Y10472D01*
X22762Y9298D01*
X23937Y8397D01*
X25304Y7830D01*
X26772Y7637D01*
X28239Y7830D01*
X29607Y8397D01*
X30781Y9298D01*
X31682Y10472D01*
X32248Y11840D01*
X32441Y13307D01*
X32248Y14774D01*
X31682Y16142D01*
X30781Y17316D01*
X29607Y18217D01*
X28239Y18784D01*
X26772Y18977D01*
D02*
G37*
G36*
X126410Y9658D02*
X123354D01*
Y6012D01*
X126410D01*
Y9658D01*
D02*
G37*
G36*
X78339D02*
X75283D01*
Y6012D01*
X78339D01*
Y9658D01*
D02*
G37*
G36*
X122354D02*
X119298D01*
Y6012D01*
X122354D01*
Y9658D01*
D02*
G37*
G36*
X74283D02*
X71228D01*
Y6012D01*
X74283D01*
Y9658D01*
D02*
G37*
G36*
X110602Y10070D02*
X107076D01*
Y5520D01*
X110602D01*
Y10070D01*
D02*
G37*
G36*
X90582D02*
X87056D01*
Y5520D01*
X90582D01*
Y10070D01*
D02*
G37*
G36*
X38583Y11070D02*
X37756Y10961D01*
X36985Y10642D01*
X36323Y10134D01*
X35815Y9472D01*
X35496Y8701D01*
X35387Y7874D01*
X35496Y7047D01*
X35815Y6276D01*
X36323Y5614D01*
X36985Y5106D01*
X37756Y4787D01*
X38583Y4678D01*
X39410Y4787D01*
X40181Y5106D01*
X40843Y5614D01*
X41350Y6276D01*
X41670Y7047D01*
X41778Y7874D01*
X41670Y8701D01*
X41350Y9472D01*
X40843Y10134D01*
X40181Y10642D01*
X39410Y10961D01*
X38583Y11070D01*
D02*
G37*
G36*
X142126Y12205D02*
X133465D01*
Y3543D01*
X142126D01*
Y12205D01*
D02*
G37*
%LPD*%
G36*
X107283Y193898D02*
X105512Y192126D01*
X96260D01*
X93701Y189567D01*
Y179528D01*
X93799Y179429D01*
Y178055D01*
X86516D01*
X86516Y195374D01*
X90748Y199606D01*
X93799Y204134D01*
X99606D01*
X103740Y210039D01*
X107283D01*
Y193898D01*
D02*
G37*
%LPC*%
G36*
X56980Y72453D02*
X55499D01*
Y70973D01*
X56980D01*
Y72453D01*
D02*
G37*
G36*
X54737Y71666D02*
X52665D01*
Y70185D01*
X54737D01*
Y71666D01*
D02*
G37*
G36*
X51665D02*
X49594D01*
Y70185D01*
X51665D01*
Y71666D01*
D02*
G37*
G36*
X56980Y69972D02*
X55499D01*
Y68491D01*
X56980D01*
Y69972D01*
D02*
G37*
G36*
X123004Y54383D02*
X121818D01*
Y51524D01*
X123004D01*
Y54383D01*
D02*
G37*
G36*
X125190Y50524D02*
X124004D01*
Y47665D01*
X125190D01*
Y50524D01*
D02*
G37*
G36*
X123004D02*
X121818D01*
Y47665D01*
X123004D01*
Y50524D01*
D02*
G37*
G36*
X125190Y46509D02*
X124004D01*
Y43650D01*
X125190D01*
Y46509D01*
D02*
G37*
G36*
X123004D02*
X121818D01*
Y43650D01*
X123004D01*
Y46509D01*
D02*
G37*
G36*
X125190Y42650D02*
X124004D01*
Y39791D01*
X125190D01*
Y42650D01*
D02*
G37*
G36*
X123004D02*
X121818D01*
Y39791D01*
X123004D01*
Y42650D01*
D02*
G37*
%LPD*%
D32*
X90551Y199606D02*
D03*
Y215354D02*
D03*
D33*
X76182Y69685D02*
D03*
Y75196D02*
D03*
X70276Y75591D02*
D03*
Y69685D02*
D03*
X52165Y69685D02*
D03*
Y75591D02*
D03*
X52165Y198819D02*
D03*
Y204724D02*
D03*
X17323Y41732D02*
D03*
Y35827D02*
D03*
D34*
X115748Y66142D02*
D03*
X109843D02*
D03*
X98425Y75984D02*
D03*
X92520D02*
D03*
X98425Y187795D02*
D03*
X92520D02*
D03*
X81890Y190945D02*
D03*
X87795D02*
D03*
X81890Y185039D02*
D03*
X87795D02*
D03*
X52105Y210236D02*
D03*
X46200D02*
D03*
X52105Y193307D02*
D03*
X46200D02*
D03*
D35*
X79331Y176181D02*
D03*
X83661D02*
D03*
X87992D02*
D03*
X92323D02*
D03*
X96653D02*
D03*
X47835D02*
D03*
X52165D02*
D03*
X56496D02*
D03*
X60827D02*
D03*
X96654Y84449D02*
D03*
X92323D02*
D03*
X87992D02*
D03*
X83662D02*
D03*
X79331D02*
D03*
X72835D02*
D03*
X67717D02*
D03*
X60827D02*
D03*
X56496D02*
D03*
X52165D02*
D03*
X47835D02*
D03*
D36*
X111417Y159843D02*
D03*
Y155512D02*
D03*
Y151181D02*
D03*
Y146850D02*
D03*
Y142520D02*
D03*
X34252Y155512D02*
D03*
Y151181D02*
D03*
Y146850D02*
D03*
Y142520D02*
D03*
Y122835D02*
D03*
Y118504D02*
D03*
Y114173D02*
D03*
Y109842D02*
D03*
Y105512D02*
D03*
Y101181D02*
D03*
X111417Y122835D02*
D03*
Y118504D02*
D03*
Y114173D02*
D03*
Y109843D02*
D03*
Y105512D02*
D03*
Y101181D02*
D03*
D37*
X34252Y159843D02*
D03*
D38*
X88819Y7795D02*
D03*
X108839D02*
D03*
D39*
X94665Y59567D02*
D03*
X104665D02*
D03*
X114665D02*
D03*
X89665D02*
D03*
X99665D02*
D03*
X109665D02*
D03*
D40*
X74783Y5512D02*
D03*
X122854D02*
D03*
D41*
X123504Y43150D02*
D03*
Y51024D02*
D03*
X74134Y43150D02*
D03*
Y51024D02*
D03*
D42*
X17323Y30709D02*
D03*
Y23228D02*
D03*
D43*
X105512Y212598D02*
D03*
X112598D02*
D03*
D44*
X105512Y194488D02*
D03*
X124409D02*
D03*
X105512Y230709D02*
D03*
X124409D02*
D03*
D45*
X57480Y75591D02*
D03*
Y70473D02*
D03*
X64961Y73032D02*
D03*
D46*
X114214Y54400D02*
X117376D01*
X98565D02*
X114214D01*
X11402Y78858D02*
X16908Y73352D01*
X40553D02*
X42792Y75591D01*
X16908Y73352D02*
X40553D01*
X42235Y77066D02*
X46668D01*
X17575Y74787D02*
X39956D01*
X42235Y77066D01*
X11907Y80454D02*
X17575Y74787D01*
X42792Y75591D02*
X52165D01*
X36400Y81900D02*
X37800Y80500D01*
X33500D02*
X35000Y82000D01*
X45981Y128678D02*
X50740Y123920D01*
Y101560D02*
Y123920D01*
X45981Y128678D02*
Y152508D01*
X36400Y81900D02*
Y87220D01*
X35000Y82000D02*
Y87800D01*
X36400Y87220D02*
X50740Y101560D01*
X49340Y102140D02*
Y123340D01*
X35000Y87800D02*
X49340Y102140D01*
X41339Y151181D02*
X41705D01*
X43170Y152647D02*
X43864D01*
X44581Y151929D01*
X41705Y155512D02*
X43170Y154046D01*
X44581Y128098D02*
Y151929D01*
Y128098D02*
X49340Y123340D01*
X41339Y155512D02*
X41705D01*
X41705Y151181D02*
X43170Y152647D01*
Y154046D02*
X44444D01*
X45981Y152508D01*
X34252Y105512D02*
X41732D01*
X34252Y101181D02*
X41732D01*
X41732Y101181D01*
X12087Y59759D02*
Y64216D01*
X13239Y65368D02*
X59239D01*
X12087Y64216D02*
X13239Y65368D01*
X11186Y58858D02*
X12087Y59759D01*
X59388Y65400D02*
X62200Y68212D01*
X59271Y65400D02*
X59388D01*
X59239Y65368D02*
X59271Y65400D01*
X5906Y58858D02*
X11186D01*
X5906Y68858D02*
X11178D01*
X13268Y66768D02*
X58659D01*
X11178Y68858D02*
X13268Y66768D01*
X10915Y88800D02*
X11907Y87807D01*
Y80454D02*
Y87807D01*
X46668Y77066D02*
X47835Y78233D01*
X5964Y88800D02*
X10915D01*
X5906Y78858D02*
X11402D01*
X47835Y78233D02*
Y84449D01*
X58659Y66768D02*
X60800Y68909D01*
X62200Y68212D02*
Y77477D01*
X60800Y68909D02*
Y76897D01*
X61001Y78676D02*
Y84275D01*
Y78676D02*
X62200Y77477D01*
X56496Y81201D02*
Y84449D01*
Y81201D02*
X60800Y76897D01*
X60827Y84449D02*
X61001Y84275D01*
X34252Y151181D02*
X41339D01*
X34252Y155512D02*
X41339D01*
X7278Y177486D02*
X11201Y173563D01*
Y171642D02*
Y173563D01*
Y171642D02*
X12579Y170264D01*
X17216D01*
X20300Y167180D01*
Y151300D02*
Y167180D01*
X5906Y178858D02*
X7278Y177486D01*
X5906Y168858D02*
X16642D01*
X18900Y150720D02*
Y166600D01*
X16642Y168858D02*
X18900Y166600D01*
X31004Y142520D02*
X34252D01*
X28073Y145450D02*
X31004Y142520D01*
X24170Y145450D02*
X28073D01*
X18900Y150720D02*
X24170Y145450D01*
X20300Y151300D02*
X24750Y146850D01*
X34252D01*
X5906Y198858D02*
X10238Y194526D01*
X5906Y188858D02*
X10173Y193126D01*
X10238Y194526D02*
X22374D01*
X26310Y190590D01*
Y155282D02*
Y190590D01*
X10173Y193126D02*
X21794D01*
X24910Y190010D01*
Y154702D02*
Y190010D01*
Y154702D02*
X26965Y152647D01*
X29476D01*
X30942Y151181D01*
X26310Y155282D02*
X26490Y155102D01*
X27545Y154046D01*
X29476D02*
X30942Y155512D01*
X27545Y154046D02*
X29476D01*
X30942Y155512D02*
X34252D01*
X30942Y151181D02*
X34252D01*
X111400Y228696D02*
Y234800D01*
X115458Y238858D02*
X139764D01*
X111400Y234800D02*
X115458Y238858D01*
X111400Y225400D02*
Y228696D01*
X112598Y205800D02*
X115100Y203298D01*
X111000Y182900D02*
X115100Y187000D01*
Y203298D01*
X97744Y182900D02*
X111000D01*
X96653Y181809D02*
X97744Y182900D01*
X96653Y176181D02*
Y181809D01*
X127609Y53654D02*
Y56290D01*
X96535Y51430D02*
X110025D01*
X114214Y41986D02*
Y54400D01*
X119900Y36300D02*
X126800D01*
X114214Y41986D02*
X119900Y36300D01*
X126800D02*
X129358Y38858D01*
X139764D01*
X127538Y53583D02*
X127609Y53654D01*
X116700Y55800D02*
X125200Y64300D01*
X129439Y58119D02*
Y147373D01*
X111417Y155512D02*
X121300D01*
X129439Y147373D01*
X127609Y56290D02*
X129439Y58119D01*
X126338Y59237D02*
X128000Y60899D01*
X120000Y152500D02*
X128000Y144500D01*
Y60899D02*
Y144500D01*
X89665Y58300D02*
X96535Y51430D01*
X94665Y58300D02*
X98565Y54400D01*
X117376D02*
X126600Y63624D01*
X99600Y58300D02*
X102100Y55800D01*
X116700D01*
X111417Y151181D02*
X117176D01*
X126600Y141757D01*
Y63624D02*
Y141757D01*
X111417Y146850D02*
X117199D01*
X125200Y64300D02*
Y138850D01*
X117199Y146850D02*
X125200Y138850D01*
X104720Y174400D02*
X128837D01*
X131600Y177163D01*
Y184654D01*
X133000Y186054D01*
Y202095D01*
X129417Y173000D02*
X133000Y176583D01*
Y184074D02*
X134500Y185574D01*
X133000Y176583D02*
Y184074D01*
X105300Y173000D02*
X129417D01*
X79200Y146900D02*
X105300Y173000D01*
X105880Y171600D02*
X129997D01*
X134432Y176035D02*
Y183526D01*
X129997Y171600D02*
X134432Y176035D01*
Y183526D02*
X139764Y188858D01*
X130642Y166000D02*
X134410Y162232D01*
Y154212D02*
X139764Y148858D01*
X134410Y154212D02*
Y162232D01*
X108200Y166000D02*
X130642D01*
X133000Y202095D02*
X139764Y208858D01*
X134500Y193595D02*
X139764Y198858D01*
X134500Y185574D02*
Y193595D01*
X106460Y170200D02*
X130577D01*
X139235Y178858D02*
X139764D01*
X130577Y170200D02*
X139235Y178858D01*
X75612Y122828D02*
X77756Y124972D01*
Y147556D02*
X104500Y174300D01*
X77756Y124972D02*
Y147556D01*
X84818Y144599D02*
X107620Y167400D01*
X75612Y101314D02*
X84818Y110521D01*
Y144599D01*
X75612Y97012D02*
X86218Y107618D01*
Y144019D02*
X108200Y166000D01*
X86218Y107618D02*
Y144019D01*
X75612Y105617D02*
X83400Y113405D01*
Y145160D02*
X107040Y168800D01*
X83400Y113405D02*
Y145160D01*
X75612Y109920D02*
X82000Y116308D01*
Y145740D02*
X106460Y170200D01*
X82000Y116308D02*
Y145740D01*
X80600Y119211D02*
Y146320D01*
X75612Y114223D02*
X80600Y119211D01*
Y146320D02*
X105880Y171600D01*
X131222Y167400D02*
X139764Y158858D01*
X107620Y167400D02*
X131222D01*
X104500Y174300D02*
X104620D01*
X104720Y174400D01*
X139706Y168800D02*
X139764Y168858D01*
X107040Y168800D02*
X139706D01*
X79200Y122114D02*
Y146900D01*
X75612Y118525D02*
X79200Y122114D01*
X5906Y88858D02*
X5964Y88800D01*
X70276Y69685D02*
X76181D01*
X76182Y69685D01*
X64961Y73032D02*
X67192D01*
X68854Y74694D01*
Y74760D01*
X69685Y75591D01*
X70276D01*
X52165Y75591D02*
Y84449D01*
X52165Y75591D02*
X57480D01*
X52165Y75591D02*
X52165Y75591D01*
X96654Y84449D02*
Y91732D01*
X104331Y101181D02*
X111417D01*
X104331Y105512D02*
X111417D01*
X104331Y109843D02*
X111417D01*
X104331Y114173D02*
X111417D01*
X111417Y118504D02*
X111417Y118504D01*
X104331Y118504D02*
X111417D01*
Y122835D02*
X111417Y122835D01*
X104331Y122835D02*
X111417D01*
D47*
X60936Y91800D02*
X74200D01*
X58700Y94036D02*
Y113100D01*
Y94036D02*
X60936Y91800D01*
X64961Y150700D02*
X72300D01*
X87992Y166392D02*
Y176181D01*
X72300Y150700D02*
X87992Y166392D01*
X94600Y130800D02*
X116500D01*
X92700Y132700D02*
X94600Y130800D01*
X74200Y91800D02*
X76182Y89819D01*
Y75196D02*
Y89819D01*
X92421Y76083D02*
X92520Y75984D01*
X92421Y76083D02*
Y84350D01*
X92323Y84449D02*
X92421Y84350D01*
X92323Y84449D02*
Y91732D01*
D48*
X17323Y41732D02*
Y53581D01*
X22600Y58858D01*
X17323Y30709D02*
Y35827D01*
Y23259D02*
X22785D01*
X17323Y23228D02*
Y23259D01*
X39320Y84832D02*
Y87143D01*
X52796Y100620D01*
X48031Y129527D02*
X52796Y124763D01*
Y100620D02*
Y124763D01*
X42406Y159843D02*
X48031Y154217D01*
Y129527D02*
Y154217D01*
X34252Y159843D02*
X42406D01*
X22835Y105019D02*
X27658Y109842D01*
X22835Y84252D02*
Y105019D01*
X5906Y208858D02*
X17142D01*
X34252Y191748D01*
Y159843D02*
Y191748D01*
X12024Y146440D02*
X18459Y140005D01*
Y132658D02*
Y140005D01*
Y132658D02*
X28282Y122835D01*
X15753Y131412D02*
Y138747D01*
Y131412D02*
X28661Y118504D01*
X5906Y148594D02*
X15753Y138747D01*
X7442Y138858D02*
X11896Y134404D01*
Y129504D02*
X27227Y114173D01*
X11896Y129504D02*
Y134404D01*
X9766Y127734D02*
X27658Y109842D01*
X5906Y128858D02*
X7029Y127734D01*
X9766D01*
X6810Y158858D02*
X12024Y153645D01*
Y146440D02*
Y153645D01*
X5906Y158858D02*
X6810D01*
X5906Y148594D02*
Y148858D01*
Y138858D02*
X7442D01*
X27658Y109842D02*
X34252D01*
X27227Y114173D02*
X34252D01*
X28661Y118504D02*
X34252D01*
X28282Y122835D02*
X34252D01*
D49*
X130315Y218858D02*
X139764D01*
X113500Y212598D02*
X124055D01*
X130315Y218858D01*
X52165Y180900D02*
Y197365D01*
Y205900D02*
Y230315D01*
D50*
X115748Y65716D02*
X116179Y66148D01*
X115748Y65716D02*
Y66142D01*
Y65551D02*
Y65716D01*
X116179Y66148D02*
X120206D01*
X120211Y66153D01*
X131281Y70616D02*
Y148139D01*
X133038Y68858D02*
X139764D01*
X131281Y70616D02*
X133038Y68858D01*
X119578Y159843D02*
X131281Y148139D01*
X111417Y159843D02*
X119578D01*
X114665Y59567D02*
Y64468D01*
X115748Y65551D01*
X109665Y59567D02*
X109754Y59655D01*
Y66053D01*
X109843Y66142D01*
X113301Y69600D01*
X120200D01*
X111417Y142520D02*
X117242D01*
X123400Y72800D02*
Y136362D01*
X117242Y142520D02*
X123400Y136362D01*
X120200Y69600D02*
X123400Y72800D01*
X92323Y91732D02*
Y94577D01*
X93596Y95850D02*
X99705D01*
X92323Y94577D02*
X93596Y95850D01*
X100955Y94600D02*
X118600D01*
X99705Y95850D02*
X100955Y94600D01*
D51*
X139370Y9449D02*
D03*
X136221Y6299D02*
D03*
X19291Y241732D02*
D03*
X16142Y238583D02*
D03*
D52*
X50394Y13307D02*
D03*
X26772D02*
D03*
D53*
X49606Y45276D02*
D03*
X38583Y48031D02*
D03*
X27559Y45276D02*
D03*
D54*
X62165Y220315D02*
D03*
X42165D02*
D03*
Y240315D02*
D03*
X62165D02*
D03*
D55*
X52165Y230315D02*
D03*
D56*
X139764Y238858D02*
D03*
Y228858D02*
D03*
Y218858D02*
D03*
Y168858D02*
D03*
Y138858D02*
D03*
Y128858D02*
D03*
Y118858D02*
D03*
Y98858D02*
D03*
Y88858D02*
D03*
Y68858D02*
D03*
Y48858D02*
D03*
Y38858D02*
D03*
Y58858D02*
D03*
Y78858D02*
D03*
Y108858D02*
D03*
Y148858D02*
D03*
Y158858D02*
D03*
Y178858D02*
D03*
Y188858D02*
D03*
Y198858D02*
D03*
Y208858D02*
D03*
X5906Y238858D02*
D03*
Y228858D02*
D03*
Y218858D02*
D03*
Y168858D02*
D03*
Y138858D02*
D03*
Y128858D02*
D03*
Y118858D02*
D03*
Y98858D02*
D03*
Y88858D02*
D03*
Y68858D02*
D03*
Y48858D02*
D03*
Y38858D02*
D03*
Y58858D02*
D03*
Y78858D02*
D03*
Y108858D02*
D03*
Y148858D02*
D03*
Y158858D02*
D03*
Y178858D02*
D03*
Y188858D02*
D03*
Y198858D02*
D03*
Y208858D02*
D03*
D57*
X139764Y28858D02*
D03*
X5906D02*
D03*
D58*
X127953Y204724D02*
D03*
Y47244D02*
D03*
Y15748D02*
D03*
X120079Y220472D02*
D03*
X112205Y78740D02*
D03*
X120079Y31496D02*
D03*
X112205Y15748D02*
D03*
X96457Y236220D02*
D03*
X104331Y220472D02*
D03*
X96457Y141732D02*
D03*
Y47244D02*
D03*
X104331Y31496D02*
D03*
X96457Y15748D02*
D03*
X80709Y236220D02*
D03*
Y204724D02*
D03*
Y47244D02*
D03*
X88583Y31496D02*
D03*
X80709Y15748D02*
D03*
X72835Y220472D02*
D03*
X64961Y204724D02*
D03*
X72835Y188976D02*
D03*
Y157480D02*
D03*
Y62992D02*
D03*
X64961Y47244D02*
D03*
X72835Y31496D02*
D03*
X64961Y15748D02*
D03*
X57087Y31496D02*
D03*
X33465Y236220D02*
D03*
Y204724D02*
D03*
X41339Y188976D02*
D03*
Y125984D02*
D03*
X25591Y220472D02*
D03*
X17717Y78740D02*
D03*
Y15748D02*
D03*
X58700Y156299D02*
D03*
X37981Y166745D02*
D03*
X58700Y127341D02*
D03*
X17717Y69847D02*
D03*
X27117D02*
D03*
X90180Y122941D02*
D03*
X118600Y112309D02*
D03*
X81797Y91800D02*
D03*
X65748Y180317D02*
D03*
Y172045D02*
D03*
X43121D02*
D03*
X43179Y180317D02*
D03*
X60827Y185063D02*
D03*
X43179Y176181D02*
D03*
X65748D02*
D03*
X47835Y168511D02*
D03*
X60827D02*
D03*
X56496D02*
D03*
X52165D02*
D03*
X42631Y230315D02*
D03*
X47598Y204179D02*
D03*
X56915Y205199D02*
D03*
X57000Y209742D02*
D03*
Y214285D02*
D03*
X61795Y230315D02*
D03*
X52165Y239887D02*
D03*
X47381Y197868D02*
D03*
X47331Y188782D02*
D03*
Y184239D02*
D03*
X57000Y185063D02*
D03*
Y189606D02*
D03*
Y194149D02*
D03*
X56792Y198688D02*
D03*
X74632Y148322D02*
D03*
X118430Y73413D02*
D03*
X102800Y155000D02*
D03*
X25908Y149874D02*
D03*
X23413Y134808D02*
D03*
X40374Y135433D02*
D03*
X45981Y111899D02*
D03*
X27117Y62149D02*
D03*
X26476Y77903D02*
D03*
X42912Y81201D02*
D03*
X58700Y113100D02*
D03*
X22835Y84252D02*
D03*
X22600Y58858D02*
D03*
X39320Y84832D02*
D03*
X37800Y80500D02*
D03*
X33500D02*
D03*
X22785Y23259D02*
D03*
X41732Y105512D02*
D03*
X18504Y88800D02*
D03*
X41732Y101181D02*
D03*
X47619Y69650D02*
D03*
X52488Y135433D02*
D03*
X41339Y155512D02*
D03*
Y151181D02*
D03*
X29744Y164800D02*
D03*
X15300Y200700D02*
D03*
X14500Y163535D02*
D03*
X20300Y174921D02*
D03*
X119100Y184060D02*
D03*
X124055D02*
D03*
Y199800D02*
D03*
X119100D02*
D03*
X124055Y188858D02*
D03*
X119100D02*
D03*
X102500Y178742D02*
D03*
X91729Y168009D02*
D03*
X75146Y180905D02*
D03*
Y176921D02*
D03*
Y172936D02*
D03*
X79331Y169000D02*
D03*
X83661D02*
D03*
X81890Y195374D02*
D03*
X78018Y190945D02*
D03*
Y185039D02*
D03*
X107040Y187800D02*
D03*
X102500D02*
D03*
X111400Y225400D02*
D03*
X112598Y205800D02*
D03*
X110025Y51430D02*
D03*
X127538Y53583D02*
D03*
X120211Y61646D02*
D03*
X120211Y66153D02*
D03*
X121729Y78870D02*
D03*
X126338Y59237D02*
D03*
X120000Y152500D02*
D03*
X64961Y150700D02*
D03*
X92700Y132700D02*
D03*
X116500Y130800D02*
D03*
X118600Y94600D02*
D03*
X75612Y122828D02*
D03*
Y118525D02*
D03*
Y114223D02*
D03*
Y109920D02*
D03*
Y105617D02*
D03*
Y101314D02*
D03*
Y97012D02*
D03*
X102300Y75984D02*
D03*
X92323Y91732D02*
D03*
X96654D02*
D03*
X104331Y101181D02*
D03*
Y105512D02*
D03*
Y109843D02*
D03*
Y114173D02*
D03*
Y118504D02*
D03*
Y122835D02*
D03*
X42165Y193307D02*
D03*
Y210236D02*
D03*
M02*
