G04*
G04 #@! TF.GenerationSoftware,Altium Limited,Altium Designer,24.1.2 (44)*
G04*
G04 Layer_Physical_Order=2*
G04 Layer_Color=16711680*
%FSLAX44Y44*%
%MOMM*%
G71*
G04*
G04 #@! TF.SameCoordinates,6530E746-830A-44C6-BB1E-2799B620A325*
G04*
G04*
G04 #@! TF.FilePolarity,Positive*
G04*
G01*
G75*
%ADD10C,0.3000*%
%ADD11C,0.4000*%
%ADD12C,0.5000*%
%ADD16C,0.2500*%
%ADD42C,0.7000*%
%ADD44R,0.8000X0.9000*%
%ADD45C,1.0000*%
%ADD49R,0.9000X0.8000*%
%ADD60C,2.0000*%
G04:AMPARAMS|DCode=61|XSize=2mm|YSize=2mm|CornerRadius=0.5mm|HoleSize=0mm|Usage=FLASHONLY|Rotation=270.000|XOffset=0mm|YOffset=0mm|HoleType=Round|Shape=RoundedRectangle|*
%AMROUNDEDRECTD61*
21,1,2.0000,1.0000,0,0,270.0*
21,1,1.0000,2.0000,0,0,270.0*
1,1,1.0000,-0.5000,-0.5000*
1,1,1.0000,-0.5000,0.5000*
1,1,1.0000,0.5000,0.5000*
1,1,1.0000,0.5000,-0.5000*
%
%ADD61ROUNDEDRECTD61*%
%ADD62O,1.3000X1.0000*%
G04:AMPARAMS|DCode=63|XSize=1mm|YSize=1.3mm|CornerRadius=0.25mm|HoleSize=0mm|Usage=FLASHONLY|Rotation=90.000|XOffset=0mm|YOffset=0mm|HoleType=Round|Shape=RoundedRectangle|*
%AMROUNDEDRECTD63*
21,1,1.0000,0.8000,0,0,90.0*
21,1,0.5000,1.3000,0,0,90.0*
1,1,0.5000,0.4000,0.2500*
1,1,0.5000,0.4000,-0.2500*
1,1,0.5000,-0.4000,-0.2500*
1,1,0.5000,-0.4000,0.2500*
%
%ADD63ROUNDEDRECTD63*%
%ADD64O,1.0500X2.1500*%
%ADD65C,0.9000*%
%ADD66C,1.1000*%
%ADD67R,1.4000X1.5000*%
G36*
X-4015Y257957D02*
X-1437Y257871D01*
X-1419Y257855D01*
X-1368Y257804D01*
X264Y256098D01*
X-6032Y256325D01*
X-5637Y256683D01*
X-4023Y257989D01*
X-4015Y257957D01*
D02*
G37*
G36*
X12789Y249413D02*
X12466Y249038D01*
X12181Y248661D01*
X11934Y248283D01*
X11725Y247903D01*
X11554Y247521D01*
X11421Y247138D01*
X11326Y246752D01*
X11269Y246366D01*
X11250Y245977D01*
X8750D01*
X8731Y246366D01*
X8674Y246752D01*
X8579Y247138D01*
X8446Y247521D01*
X8275Y247903D01*
X8066Y248283D01*
X7819Y248661D01*
X7534Y249038D01*
X7211Y249413D01*
X6850Y249786D01*
X13150D01*
X12789Y249413D01*
D02*
G37*
G36*
X79997Y278555D02*
X80001Y278161D01*
X78551Y277049D01*
X77349Y275482D01*
X76593Y273658D01*
X76335Y271700D01*
Y261700D01*
X76593Y259742D01*
X77349Y257918D01*
X78551Y256351D01*
X80118Y255149D01*
X81942Y254393D01*
X83670Y254165D01*
X83886Y253512D01*
X83872Y252877D01*
X81200Y251334D01*
X78865Y249000D01*
X77215Y246140D01*
X76588Y243800D01*
X88900D01*
Y238800D01*
X76588D01*
X77215Y236460D01*
X78865Y233600D01*
X81200Y231266D01*
X84060Y229615D01*
X85470Y229237D01*
Y227922D01*
X84075Y227548D01*
X81225Y225903D01*
X78898Y223575D01*
X77252Y220725D01*
X76400Y217546D01*
Y214254D01*
X77252Y211075D01*
X78898Y208225D01*
X81225Y205898D01*
X84075Y204252D01*
X85547Y203857D01*
Y202543D01*
X84075Y202148D01*
X81225Y200502D01*
X78898Y198175D01*
X77252Y195325D01*
X76400Y192146D01*
Y188854D01*
X77252Y185675D01*
X77832Y184670D01*
X77270Y183531D01*
X76928Y183486D01*
X75709Y183364D01*
X74439Y183364D01*
X68122D01*
Y183369D01*
X66374Y183599D01*
X64746Y184274D01*
X63347Y185347D01*
X63347Y185347D01*
X63347Y185347D01*
X62578Y186346D01*
X62245Y186780D01*
X61554Y188450D01*
X61318Y190243D01*
X61314D01*
Y233500D01*
X61364D01*
X60909Y236959D01*
X59574Y240182D01*
X57450Y242950D01*
X54682Y245074D01*
X51459Y246409D01*
X48000Y246864D01*
Y246814D01*
X38310D01*
X30138Y251063D01*
X30416Y252350D01*
X31906Y252967D01*
X33421Y254129D01*
X34583Y255644D01*
X35313Y257407D01*
X35563Y259300D01*
Y263530D01*
X28250D01*
X20937D01*
Y263165D01*
X19735Y262757D01*
X19310Y263310D01*
X17169Y264953D01*
X14676Y265986D01*
X12000Y266338D01*
Y266314D01*
X4000D01*
Y266338D01*
X1324Y265986D01*
X-1169Y264953D01*
X-3310Y263310D01*
X-4953Y261169D01*
X-5770Y259199D01*
X-6920Y258269D01*
X-6957Y258224D01*
X-7007Y258194D01*
X-7402Y257836D01*
X-7410Y257825D01*
X-7421Y257818D01*
X-7543Y257649D01*
X-8201Y256991D01*
X-9057Y255509D01*
X-9500Y253856D01*
Y252144D01*
X-9057Y250491D01*
X-8201Y249009D01*
X-6991Y247799D01*
X-5509Y246943D01*
X-3856Y246500D01*
X-2144D01*
X-491Y246943D01*
X991Y247799D01*
X2201Y249009D01*
X2802Y250050D01*
X2858Y250072D01*
X4142D01*
X4198Y250050D01*
X4799Y249009D01*
X5285Y248523D01*
X5384Y248369D01*
X5704Y248038D01*
X5947Y247756D01*
X6150Y247488D01*
X6316Y247233D01*
X6448Y246993D01*
X6549Y246769D01*
X6622Y246558D01*
X6671Y246359D01*
X6686Y246253D01*
Y243000D01*
X6653D01*
X7040Y240063D01*
X8173Y237327D01*
X9976Y234976D01*
X12327Y233173D01*
X15063Y232040D01*
X18000Y231653D01*
Y231686D01*
X28000D01*
X28042Y231695D01*
X28085Y231687D01*
X28675Y231821D01*
X29268Y231939D01*
X29304Y231963D01*
X29346Y231972D01*
X37703Y235686D01*
X48000D01*
Y235665D01*
X48828Y235500D01*
X49531Y235031D01*
X50000Y234328D01*
X50165Y233500D01*
X50186D01*
Y190227D01*
X50163D01*
X50510Y186707D01*
X51536Y183323D01*
X53204Y180204D01*
X54654Y178436D01*
X54679Y178406D01*
X54688Y178395D01*
X55447Y177470D01*
D01*
X55459Y177459D01*
X55459Y177459D01*
X58173Y175232D01*
X61269Y173577D01*
X64628Y172558D01*
X68122Y172214D01*
Y172236D01*
X75709D01*
X75824Y172259D01*
X77041Y172099D01*
X77716Y170729D01*
X77252Y169925D01*
X76400Y166746D01*
Y163454D01*
X77252Y160275D01*
X78898Y157425D01*
X81225Y155098D01*
X84075Y153452D01*
X85547Y153057D01*
Y151743D01*
X84075Y151348D01*
X81225Y149703D01*
X78898Y147375D01*
X77252Y144525D01*
X76400Y141346D01*
Y138054D01*
X77252Y134875D01*
X78898Y132025D01*
X81225Y129698D01*
X84075Y128052D01*
X85547Y127657D01*
Y126343D01*
X84075Y125948D01*
X81225Y124303D01*
X78898Y121975D01*
X77252Y119125D01*
X76400Y115946D01*
Y112654D01*
X77252Y109475D01*
X78898Y106625D01*
X81225Y104298D01*
X84075Y102652D01*
X85547Y102257D01*
Y100943D01*
X84075Y100548D01*
X81225Y98903D01*
X78898Y96575D01*
X77252Y93725D01*
X76400Y90546D01*
Y87254D01*
X77252Y84075D01*
X78898Y81225D01*
X81225Y78898D01*
X84075Y77252D01*
X85547Y76857D01*
Y75543D01*
X84075Y75148D01*
X81225Y73502D01*
X78898Y71175D01*
X77252Y68325D01*
X76400Y65146D01*
Y61854D01*
X77252Y58675D01*
X78898Y55825D01*
X81225Y53498D01*
X84075Y51852D01*
X85547Y51457D01*
Y50143D01*
X84075Y49748D01*
X81225Y48102D01*
X78898Y45775D01*
X77252Y42925D01*
X76400Y39746D01*
Y36454D01*
X77252Y33275D01*
X78898Y30425D01*
X81225Y28098D01*
X84075Y26452D01*
X85547Y26057D01*
Y24743D01*
X84075Y24348D01*
X81225Y22703D01*
X78898Y20375D01*
X77252Y17525D01*
X76400Y14346D01*
Y11054D01*
X77252Y7875D01*
X78898Y5025D01*
X81225Y2697D01*
X84075Y1052D01*
X85547Y657D01*
Y-657D01*
X84075Y-1052D01*
X81225Y-2697D01*
X78898Y-5025D01*
X77252Y-7875D01*
X76400Y-11054D01*
Y-14346D01*
X77252Y-17525D01*
X78898Y-20375D01*
X81225Y-22703D01*
X84075Y-24348D01*
X85470Y-24722D01*
Y-26037D01*
X84060Y-26415D01*
X81200Y-28066D01*
X78865Y-30400D01*
X77215Y-33260D01*
X76588Y-35600D01*
X88900D01*
Y-40600D01*
X76588D01*
X77215Y-42940D01*
X78865Y-45800D01*
X81200Y-48134D01*
X84060Y-49785D01*
X85470Y-50163D01*
Y-51478D01*
X84075Y-51852D01*
X81225Y-53498D01*
X78898Y-55825D01*
X77252Y-58675D01*
X76400Y-61854D01*
Y-65146D01*
X77252Y-68325D01*
X78898Y-71175D01*
X81225Y-73502D01*
X84075Y-75148D01*
X85547Y-75543D01*
Y-76857D01*
X84075Y-77252D01*
X81225Y-78898D01*
X78898Y-81225D01*
X77252Y-84075D01*
X76400Y-87254D01*
Y-90546D01*
X77252Y-93725D01*
X78898Y-96575D01*
X81225Y-98903D01*
X84075Y-100548D01*
X85547Y-100943D01*
Y-102257D01*
X84075Y-102652D01*
X81225Y-104298D01*
X78898Y-106625D01*
X77252Y-109475D01*
X76400Y-112654D01*
Y-115946D01*
X77252Y-119125D01*
X78898Y-121975D01*
X81225Y-124303D01*
X84075Y-125948D01*
X85547Y-126343D01*
Y-127657D01*
X84075Y-128052D01*
X81225Y-129698D01*
X78898Y-132025D01*
X77252Y-134875D01*
X76400Y-138054D01*
Y-141346D01*
X77252Y-144525D01*
X78898Y-147375D01*
X81225Y-149703D01*
X84075Y-151348D01*
X85547Y-151743D01*
Y-153057D01*
X84075Y-153452D01*
X81225Y-155098D01*
X78898Y-157425D01*
X77252Y-160275D01*
X76400Y-163454D01*
Y-166746D01*
X77252Y-169925D01*
X78898Y-172775D01*
X81225Y-175103D01*
X84075Y-176748D01*
X85547Y-177143D01*
Y-178457D01*
X84075Y-178852D01*
X81225Y-180497D01*
X78898Y-182825D01*
X77252Y-185675D01*
X76400Y-188854D01*
Y-192146D01*
X77252Y-195325D01*
X78898Y-198175D01*
X81225Y-200502D01*
X84075Y-202148D01*
X85547Y-202543D01*
Y-203857D01*
X84075Y-204252D01*
X81225Y-205898D01*
X78898Y-208225D01*
X77252Y-211075D01*
X76400Y-214254D01*
Y-217546D01*
X77252Y-220725D01*
X78898Y-223575D01*
X81225Y-225903D01*
X84075Y-227548D01*
X85547Y-227943D01*
Y-229257D01*
X84075Y-229652D01*
X81225Y-231297D01*
X78898Y-233625D01*
X77252Y-236475D01*
X76400Y-239654D01*
Y-242946D01*
X77252Y-246125D01*
X78898Y-248975D01*
X81225Y-251303D01*
X84075Y-252948D01*
X85547Y-253343D01*
Y-254657D01*
X84075Y-255052D01*
X81225Y-256698D01*
X78898Y-259025D01*
X77252Y-261875D01*
X76400Y-265054D01*
Y-268346D01*
X77252Y-271525D01*
X78898Y-274375D01*
X81225Y-276702D01*
X83752Y-278161D01*
X83411Y-279431D01*
X-83331D01*
X-83672Y-278161D01*
X-81200Y-276735D01*
X-78865Y-274400D01*
X-77215Y-271540D01*
X-76588Y-269200D01*
X-88900D01*
Y-264200D01*
X-76588D01*
X-77215Y-261860D01*
X-78865Y-259000D01*
X-81200Y-256665D01*
X-84060Y-255015D01*
X-85470Y-254637D01*
Y-253322D01*
X-84075Y-252948D01*
X-81225Y-251303D01*
X-78898Y-248975D01*
X-77252Y-246125D01*
X-76400Y-242946D01*
Y-239654D01*
X-77252Y-236475D01*
X-78898Y-233625D01*
X-81225Y-231297D01*
X-84075Y-229652D01*
X-85547Y-229257D01*
Y-227943D01*
X-84075Y-227548D01*
X-81225Y-225903D01*
X-78898Y-223575D01*
X-77252Y-220725D01*
X-76400Y-217546D01*
Y-214254D01*
X-77252Y-211075D01*
X-78898Y-208225D01*
X-81225Y-205898D01*
X-84075Y-204252D01*
X-85547Y-203857D01*
Y-202543D01*
X-84075Y-202148D01*
X-81225Y-200502D01*
X-78898Y-198175D01*
X-77252Y-195325D01*
X-76400Y-192146D01*
Y-188854D01*
X-77252Y-185675D01*
X-78898Y-182825D01*
X-81225Y-180497D01*
X-84075Y-178852D01*
X-85547Y-178457D01*
Y-177143D01*
X-84075Y-176748D01*
X-81225Y-175103D01*
X-78898Y-172775D01*
X-77252Y-169925D01*
X-76400Y-166746D01*
Y-163454D01*
X-77252Y-160275D01*
X-78898Y-157425D01*
X-81225Y-155098D01*
X-84075Y-153452D01*
X-85547Y-153057D01*
Y-151743D01*
X-84075Y-151348D01*
X-81225Y-149703D01*
X-78898Y-147375D01*
X-77252Y-144525D01*
X-76400Y-141346D01*
Y-138054D01*
X-77252Y-134875D01*
X-78898Y-132025D01*
X-81225Y-129698D01*
X-84075Y-128052D01*
X-85547Y-127657D01*
Y-126343D01*
X-84075Y-125948D01*
X-81225Y-124303D01*
X-78898Y-121975D01*
X-77252Y-119125D01*
X-76400Y-115946D01*
Y-112654D01*
X-77252Y-109475D01*
X-78898Y-106625D01*
X-81225Y-104298D01*
X-84075Y-102652D01*
X-85547Y-102257D01*
Y-100943D01*
X-84075Y-100548D01*
X-81225Y-98903D01*
X-78898Y-96575D01*
X-77252Y-93725D01*
X-76400Y-90546D01*
Y-87254D01*
X-77252Y-84075D01*
X-78898Y-81225D01*
X-81225Y-78898D01*
X-84075Y-77252D01*
X-85278Y-76929D01*
X-85077Y-75669D01*
X-84672Y-75691D01*
X-83591Y-75821D01*
X-82626Y-75992D01*
X-81802Y-76193D01*
X-81124Y-76418D01*
X-80597Y-76655D01*
X-80219Y-76883D01*
X-80118Y-76968D01*
X-40743Y-116343D01*
X-39668Y-117061D01*
X-38400Y-117314D01*
X4253D01*
X4359Y-117329D01*
X4558Y-117378D01*
X4769Y-117451D01*
X4993Y-117552D01*
X5233Y-117684D01*
X5487Y-117850D01*
X5756Y-118053D01*
X6038Y-118296D01*
X6369Y-118616D01*
X6523Y-118715D01*
X7009Y-119201D01*
X8491Y-120057D01*
X10144Y-120500D01*
X11856D01*
X13509Y-120057D01*
X14991Y-119201D01*
X16201Y-117991D01*
X17057Y-116509D01*
X17500Y-114856D01*
Y-113144D01*
X17057Y-111491D01*
X16201Y-110009D01*
X14991Y-108799D01*
X13509Y-107943D01*
X11856Y-107500D01*
X10144D01*
X8491Y-107943D01*
X7009Y-108799D01*
X6523Y-109285D01*
X6369Y-109384D01*
X6038Y-109704D01*
X5756Y-109947D01*
X5487Y-110150D01*
X5233Y-110316D01*
X4993Y-110448D01*
X4769Y-110548D01*
X4558Y-110622D01*
X4359Y-110671D01*
X4253Y-110686D01*
X-37027D01*
X-75432Y-72282D01*
X-75517Y-72181D01*
X-75746Y-71803D01*
X-75981Y-71276D01*
X-76207Y-70598D01*
X-76409Y-69774D01*
X-76571Y-68855D01*
X-76751Y-66455D01*
X-76400Y-65146D01*
Y-61854D01*
X-77252Y-58675D01*
X-78898Y-55825D01*
X-81225Y-53498D01*
X-84075Y-51852D01*
X-85470Y-51478D01*
Y-50163D01*
X-84060Y-49785D01*
X-81200Y-48134D01*
X-78865Y-45800D01*
X-77215Y-42940D01*
X-76588Y-40600D01*
X-88900D01*
Y-35600D01*
X-76588D01*
X-77215Y-33260D01*
X-78865Y-30400D01*
X-81200Y-28066D01*
X-84060Y-26415D01*
X-85470Y-26037D01*
Y-24722D01*
X-84075Y-24348D01*
X-81225Y-22703D01*
X-78898Y-20375D01*
X-77252Y-17525D01*
X-76400Y-14346D01*
Y-11054D01*
X-77252Y-7875D01*
X-78898Y-5025D01*
X-81225Y-2697D01*
X-84075Y-1052D01*
X-85547Y-657D01*
Y657D01*
X-84075Y1052D01*
X-81225Y2697D01*
X-78898Y5025D01*
X-78174Y6278D01*
X-77290Y7069D01*
X-76433Y7742D01*
X-75631Y8304D01*
X-74905Y8744D01*
X-74267Y9064D01*
X-73727Y9270D01*
X-72661Y8605D01*
X-72500Y8411D01*
Y7500D01*
X-59770D01*
X-59500Y7500D01*
X-58500D01*
X-58205Y7185D01*
X-57962Y6230D01*
X-58201Y5991D01*
X-59057Y4509D01*
X-59500Y2856D01*
Y1144D01*
X-59057Y-509D01*
X-58201Y-1991D01*
X-56991Y-3201D01*
X-55509Y-4057D01*
X-55509Y-4057D01*
X-55357Y-4117D01*
X-54500Y-4500D01*
Y-12110D01*
X-55770Y-12277D01*
X-55943Y-11631D01*
X-56799Y-10149D01*
X-58009Y-8939D01*
X-59491Y-8083D01*
X-61144Y-7640D01*
X-62856D01*
X-64509Y-8083D01*
X-65991Y-8939D01*
X-67201Y-10149D01*
X-68057Y-11631D01*
X-68500Y-13284D01*
Y-14996D01*
X-68057Y-16649D01*
X-67201Y-18131D01*
X-67102Y-18230D01*
X-67628Y-19500D01*
X-68500D01*
Y-31500D01*
X-55500D01*
X-54500Y-32152D01*
Y-33500D01*
X-43078D01*
Y-38500D01*
X-46500D01*
Y-51500D01*
X-34500D01*
Y-38500D01*
X-34922D01*
Y-19000D01*
X-34922Y-19000D01*
X-35232Y-17439D01*
X-36116Y-16116D01*
X-41500Y-10732D01*
Y-4500D01*
X-44922D01*
Y-2000D01*
X-45232Y-439D01*
X-46116Y884D01*
X-46116Y884D01*
X-46500Y1268D01*
Y2856D01*
X-46943Y4509D01*
X-47799Y5991D01*
X-48038Y6230D01*
X-47804Y7146D01*
X-47457Y7500D01*
X-45500D01*
Y7500D01*
X-44500D01*
Y7500D01*
X-31500D01*
Y19500D01*
X-44500D01*
Y19500D01*
X-45500D01*
Y19500D01*
X-58230D01*
X-58500Y19500D01*
X-59500D01*
X-59770Y19500D01*
X-72500D01*
Y16989D01*
X-72661Y16795D01*
X-73727Y16130D01*
X-74267Y16336D01*
X-74905Y16656D01*
X-75631Y17096D01*
X-76395Y17632D01*
X-78220Y19202D01*
X-78898Y20375D01*
X-81225Y22703D01*
X-84075Y24348D01*
X-85547Y24743D01*
Y26057D01*
X-84075Y26452D01*
X-81225Y28098D01*
X-78898Y30425D01*
X-77252Y33275D01*
X-76400Y36454D01*
Y39746D01*
X-77252Y42925D01*
X-78898Y45775D01*
X-81225Y48102D01*
X-84075Y49748D01*
X-85547Y50143D01*
Y51457D01*
X-84075Y51852D01*
X-81225Y53498D01*
X-78898Y55825D01*
X-77252Y58675D01*
X-76400Y61854D01*
Y65146D01*
X-77252Y68325D01*
X-78898Y71175D01*
X-81225Y73502D01*
X-84075Y75148D01*
X-85547Y75543D01*
Y76857D01*
X-84075Y77252D01*
X-81225Y78898D01*
X-78898Y81225D01*
X-77252Y84075D01*
X-76400Y87254D01*
Y90546D01*
X-77252Y93725D01*
X-78898Y96575D01*
X-81225Y98903D01*
X-84075Y100548D01*
X-85547Y100943D01*
Y102257D01*
X-84075Y102652D01*
X-81225Y104298D01*
X-78898Y106625D01*
X-77252Y109475D01*
X-76400Y112654D01*
Y115946D01*
X-77252Y119125D01*
X-78898Y121975D01*
X-81225Y124303D01*
X-84075Y125948D01*
X-85547Y126343D01*
Y127657D01*
X-84075Y128052D01*
X-81225Y129698D01*
X-78898Y132025D01*
X-77252Y134875D01*
X-76400Y138054D01*
Y141346D01*
X-76774Y142743D01*
X-76709Y143928D01*
X-76578Y145009D01*
X-76409Y145975D01*
X-76207Y146798D01*
X-75981Y147476D01*
X-75746Y148003D01*
X-75517Y148381D01*
X-75432Y148482D01*
X-69227Y154686D01*
X-55095D01*
X-54901Y154218D01*
X-53699Y152651D01*
X-53222Y152285D01*
Y151015D01*
X-53699Y150649D01*
X-54901Y149082D01*
X-55657Y147258D01*
X-55915Y145300D01*
X-55657Y143342D01*
X-54901Y141518D01*
X-53699Y139951D01*
X-53222Y139585D01*
Y138315D01*
X-53699Y137949D01*
X-54901Y136382D01*
X-55657Y134558D01*
X-55915Y132600D01*
X-55657Y130642D01*
X-54901Y128818D01*
X-53699Y127251D01*
X-52132Y126049D01*
X-50308Y125293D01*
X-48350Y125035D01*
X-45350D01*
X-43392Y125293D01*
X-41568Y126049D01*
X-40521Y126852D01*
X-38930Y126758D01*
X-38755Y126495D01*
X-37101Y125390D01*
X-35150Y125002D01*
X-27150D01*
X-25199Y125390D01*
X-23545Y126495D01*
X-23454Y126631D01*
X-22843Y126744D01*
X-19696Y126992D01*
X-15044D01*
X-14641Y126953D01*
X-14286Y126599D01*
X-12576Y125611D01*
X-10669Y125100D01*
X-8694D01*
X-6786Y125611D01*
X-5076Y126599D01*
X-3680Y127995D01*
X-2692Y129705D01*
X-2181Y131613D01*
Y133587D01*
X-2692Y135495D01*
X-3680Y137205D01*
X-5076Y138602D01*
X-6786Y139589D01*
X-8694Y140100D01*
X-10669D01*
X-12576Y139589D01*
X-14286Y138602D01*
X-14608Y138280D01*
X-15691Y138208D01*
X-20168D01*
X-21101Y138253D01*
X-22807Y138449D01*
X-23454Y138569D01*
X-23545Y138705D01*
X-24141Y139103D01*
X-24268Y139399D01*
X-24319Y140749D01*
X-23535Y141770D01*
X-22830Y143473D01*
X-22757Y144030D01*
X-31150D01*
Y146570D01*
X-22757D01*
X-22830Y147127D01*
X-23535Y148830D01*
X-24658Y150292D01*
X-25401Y150863D01*
Y152437D01*
X-24658Y153007D01*
X-23535Y154470D01*
X-22830Y156173D01*
X-22757Y156730D01*
X-31150D01*
Y159270D01*
X-22757D01*
X-22830Y159827D01*
X-23535Y161530D01*
X-24658Y162992D01*
X-24973Y163234D01*
Y164835D01*
X-24301Y165351D01*
X-23099Y166918D01*
X-22343Y168742D01*
X-22085Y170700D01*
X-22343Y172658D01*
X-23099Y174482D01*
X-24301Y176049D01*
X-24973Y176565D01*
Y178165D01*
X-24658Y178407D01*
X-23535Y179870D01*
X-22830Y181573D01*
X-22757Y182130D01*
X-31150D01*
Y183400D01*
X-32420D01*
Y190460D01*
X-32650D01*
X-34477Y190220D01*
X-36180Y189515D01*
X-37642Y188392D01*
X-37885Y188077D01*
X-39485D01*
X-40001Y188749D01*
X-41568Y189951D01*
X-43392Y190707D01*
X-45350Y190965D01*
X-48350D01*
X-50308Y190707D01*
X-52132Y189951D01*
X-53699Y188749D01*
X-54901Y187182D01*
X-55657Y185358D01*
X-55915Y183400D01*
X-55657Y181442D01*
X-54901Y179618D01*
X-53699Y178051D01*
X-53222Y177685D01*
Y176415D01*
X-53699Y176049D01*
X-54901Y174482D01*
X-55657Y172658D01*
X-55915Y170700D01*
X-55657Y168742D01*
X-54901Y166918D01*
X-53699Y165351D01*
X-53222Y164985D01*
Y163715D01*
X-53699Y163349D01*
X-54901Y161782D01*
X-55095Y161315D01*
X-55107Y161314D01*
X-70600D01*
X-71868Y161061D01*
X-72943Y160343D01*
X-80118Y153168D01*
X-80219Y153083D01*
X-80597Y152854D01*
X-81124Y152619D01*
X-81802Y152393D01*
X-82626Y152191D01*
X-83545Y152029D01*
X-84839Y151932D01*
X-85053Y153190D01*
X-84075Y153452D01*
X-81225Y155098D01*
X-78898Y157425D01*
X-77252Y160275D01*
X-76400Y163454D01*
Y166746D01*
X-77252Y169925D01*
X-78898Y172775D01*
X-81225Y175103D01*
X-84075Y176748D01*
X-85547Y177143D01*
Y178457D01*
X-84075Y178852D01*
X-81225Y180497D01*
X-78898Y182825D01*
X-77252Y185675D01*
X-76400Y188854D01*
Y192146D01*
X-77252Y195325D01*
X-78898Y198175D01*
X-81225Y200502D01*
X-84075Y202148D01*
X-85547Y202543D01*
Y203857D01*
X-84075Y204252D01*
X-81225Y205898D01*
X-78898Y208225D01*
X-77252Y211075D01*
X-76400Y214254D01*
Y217546D01*
X-77252Y220725D01*
X-78898Y223575D01*
X-81225Y225903D01*
X-84075Y227548D01*
X-85470Y227922D01*
Y229237D01*
X-84060Y229615D01*
X-81200Y231266D01*
X-78865Y233600D01*
X-77215Y236460D01*
X-76588Y238800D01*
X-88900D01*
Y243800D01*
X-76588D01*
X-77215Y246140D01*
X-78865Y249000D01*
X-81200Y251334D01*
X-83872Y252877D01*
X-83886Y253512D01*
X-83670Y254165D01*
X-81942Y254393D01*
X-80118Y255149D01*
X-78551Y256351D01*
X-77349Y257918D01*
X-76593Y259742D01*
X-76335Y261700D01*
Y271700D01*
X-76593Y273658D01*
X-77349Y275482D01*
X-78551Y277049D01*
X-80001Y278161D01*
X-79997Y278555D01*
X-79648Y279431D01*
X79648D01*
X79997Y278555D01*
D02*
G37*
G36*
X84941Y181317D02*
X84885Y181328D01*
X84806Y181323D01*
X84704Y181301D01*
X84580Y181264D01*
X84432Y181209D01*
X84069Y181052D01*
X83353Y180693D01*
X80963Y182333D01*
X82024Y183239D01*
X84941Y181317D01*
D02*
G37*
G36*
X83925Y176026D02*
X85159Y175887D01*
X90816Y174915D01*
X79126Y167212D01*
X79387Y168398D01*
X80734Y173088D01*
X80858Y173242D01*
X80964Y173267D01*
X83353Y174907D01*
X82635Y175325D01*
X82242Y175651D01*
X82174Y175884D01*
X82432Y176024D01*
X83016Y176071D01*
X83925Y176026D01*
D02*
G37*
G36*
X-52665Y155512D02*
X-52696Y155747D01*
X-52787Y155957D01*
X-52938Y156143D01*
X-53151Y156304D01*
X-53423Y156440D01*
X-53757Y156552D01*
X-54151Y156638D01*
X-54606Y156700D01*
X-55122Y156738D01*
X-55698Y156750D01*
Y159250D01*
X-55122Y159262D01*
X-54151Y159361D01*
X-53757Y159448D01*
X-53423Y159560D01*
X-53151Y159696D01*
X-52938Y159857D01*
X-52787Y160042D01*
X-52696Y160253D01*
X-52665Y160488D01*
Y155512D01*
D02*
G37*
G36*
X-76758Y150074D02*
X-77179Y149572D01*
X-77555Y148952D01*
X-77884Y148216D01*
X-78168Y147363D01*
X-78405Y146394D01*
X-78596Y145309D01*
X-78741Y144106D01*
X-78894Y141352D01*
X-78900Y139800D01*
X-88800Y149699D01*
X-87248Y149706D01*
X-83292Y150004D01*
X-82206Y150195D01*
X-81237Y150432D01*
X-80384Y150716D01*
X-79648Y151045D01*
X-79029Y151421D01*
X-78526Y151842D01*
X-76758Y150074D01*
D02*
G37*
G36*
X-13609Y128750D02*
X-13707Y128816D01*
X-13863Y128876D01*
X-14078Y128928D01*
X-14352Y128974D01*
X-15075Y129044D01*
X-16032Y129086D01*
X-17224Y129100D01*
Y136100D01*
X-16599Y136103D01*
X-14078Y136271D01*
X-13863Y136324D01*
X-13707Y136383D01*
X-13609Y136450D01*
Y128750D01*
D02*
G37*
G36*
X-25746Y137174D02*
X-25218Y136949D01*
X-24602Y136750D01*
X-23900Y136577D01*
X-23110Y136432D01*
X-21267Y136219D01*
X-19075Y136113D01*
X-17848Y136100D01*
Y129100D01*
X-19075Y129087D01*
X-23110Y128768D01*
X-23900Y128623D01*
X-24602Y128450D01*
X-25218Y128251D01*
X-25746Y128026D01*
X-26186Y127774D01*
Y137426D01*
X-25746Y137174D01*
D02*
G37*
G36*
X-80656Y18607D02*
X-77648Y16020D01*
X-76746Y15388D01*
X-75892Y14870D01*
X-75089Y14468D01*
X-74336Y14180D01*
X-73632Y14008D01*
X-72978Y13950D01*
Y11450D01*
X-73632Y11393D01*
X-74336Y11220D01*
X-75089Y10933D01*
X-75892Y10530D01*
X-76746Y10013D01*
X-77648Y9380D01*
X-78601Y8633D01*
X-80656Y6793D01*
X-81759Y5700D01*
Y19700D01*
X-80656Y18607D01*
D02*
G37*
G36*
X-50988Y8266D02*
X-50954Y7826D01*
X-50897Y7411D01*
X-50816Y7021D01*
X-50712Y6657D01*
X-50586Y6317D01*
X-50437Y6004D01*
X-50264Y5715D01*
X-50068Y5452D01*
X-49850Y5214D01*
X-56150D01*
X-55932Y5452D01*
X-55736Y5715D01*
X-55564Y6004D01*
X-55414Y6317D01*
X-55287Y6657D01*
X-55184Y7021D01*
X-55104Y7411D01*
X-55046Y7826D01*
X-55012Y8266D01*
X-55000Y8731D01*
X-51000D01*
X-50988Y8266D01*
D02*
G37*
G36*
X-59163Y-17682D02*
X-59444Y-18020D01*
X-59692Y-18369D01*
X-59906Y-18727D01*
X-60087Y-19095D01*
X-60236Y-19472D01*
X-60352Y-19860D01*
X-60434Y-20258D01*
X-60483Y-20665D01*
X-60500Y-21083D01*
X-63500D01*
X-63517Y-20665D01*
X-63566Y-20258D01*
X-63649Y-19860D01*
X-63764Y-19472D01*
X-63913Y-19095D01*
X-64094Y-18727D01*
X-64309Y-18369D01*
X-64556Y-18020D01*
X-64837Y-17682D01*
X-65150Y-17354D01*
X-58850D01*
X-59163Y-17682D01*
D02*
G37*
G36*
X-78894Y-65152D02*
X-78596Y-69109D01*
X-78405Y-70194D01*
X-78168Y-71163D01*
X-77884Y-72016D01*
X-77555Y-72752D01*
X-77179Y-73372D01*
X-76758Y-73874D01*
X-78526Y-75642D01*
X-79029Y-75221D01*
X-79648Y-74845D01*
X-80384Y-74516D01*
X-81237Y-74232D01*
X-82206Y-73995D01*
X-83292Y-73804D01*
X-84494Y-73658D01*
X-87248Y-73506D01*
X-88800Y-73499D01*
X-78900Y-63600D01*
X-78894Y-65152D01*
D02*
G37*
G36*
X7786Y-117150D02*
X7413Y-116789D01*
X7038Y-116466D01*
X6661Y-116181D01*
X6283Y-115934D01*
X5903Y-115725D01*
X5521Y-115554D01*
X5138Y-115421D01*
X4753Y-115326D01*
X4366Y-115269D01*
X3977Y-115250D01*
Y-112750D01*
X4366Y-112731D01*
X4753Y-112674D01*
X5138Y-112579D01*
X5521Y-112446D01*
X5903Y-112275D01*
X6283Y-112066D01*
X6661Y-111819D01*
X7038Y-111534D01*
X7413Y-111211D01*
X7786Y-110850D01*
Y-117150D01*
D02*
G37*
%LPC*%
G36*
X-26980Y277445D02*
Y266070D01*
X-20937D01*
Y270300D01*
X-21187Y272193D01*
X-21917Y273956D01*
X-23079Y275471D01*
X-24594Y276633D01*
X-26357Y277363D01*
X-26980Y277445D01*
D02*
G37*
G36*
X29520Y277445D02*
Y266070D01*
X35563D01*
Y270300D01*
X35313Y272193D01*
X34583Y273956D01*
X33421Y275471D01*
X31906Y276633D01*
X30143Y277363D01*
X29520Y277445D01*
D02*
G37*
G36*
X26980Y277445D02*
X26357Y277363D01*
X24594Y276633D01*
X23079Y275471D01*
X21917Y273956D01*
X21187Y272193D01*
X20937Y270300D01*
Y266070D01*
X26980D01*
Y277445D01*
D02*
G37*
G36*
X-29520Y277445D02*
X-30143Y277363D01*
X-31906Y276633D01*
X-33421Y275471D01*
X-34583Y273956D01*
X-35313Y272193D01*
X-35563Y270300D01*
Y266070D01*
X-29520D01*
Y277445D01*
D02*
G37*
G36*
X-20937Y263530D02*
X-26980D01*
Y252155D01*
X-26357Y252237D01*
X-24594Y252967D01*
X-23079Y254129D01*
X-21917Y255644D01*
X-21187Y257407D01*
X-20937Y259300D01*
Y263530D01*
D02*
G37*
G36*
X-29520D02*
X-35563D01*
Y259300D01*
X-35313Y257407D01*
X-34583Y255644D01*
X-33421Y254129D01*
X-31906Y252967D01*
X-30143Y252237D01*
X-29520Y252155D01*
Y263530D01*
D02*
G37*
G36*
X-18906Y248800D02*
X-21094D01*
X-23115Y247963D01*
X-24663Y246416D01*
X-25500Y244394D01*
Y242206D01*
X-24663Y240184D01*
X-23115Y238637D01*
X-21094Y237800D01*
X-18906D01*
X-16884Y238637D01*
X-15337Y240184D01*
X-14500Y242206D01*
Y244394D01*
X-15337Y246416D01*
X-16884Y247963D01*
X-18906Y248800D01*
D02*
G37*
G36*
X-29650Y190460D02*
X-29880D01*
Y184670D01*
X-22757D01*
X-22830Y185227D01*
X-23535Y186930D01*
X-24658Y188392D01*
X-26120Y189515D01*
X-27823Y190220D01*
X-29650Y190460D01*
D02*
G37*
G36*
X-28144Y119500D02*
X-29856D01*
X-31509Y119057D01*
X-32991Y118201D01*
X-34201Y116991D01*
X-35057Y115509D01*
X-35500Y113856D01*
Y112144D01*
X-35057Y110491D01*
X-34201Y109009D01*
X-32991Y107799D01*
X-31509Y106943D01*
X-29856Y106500D01*
X-29168D01*
X-28989Y106461D01*
X-28529Y106454D01*
X-28158Y106426D01*
X-27825Y106380D01*
X-27527Y106317D01*
X-27264Y106241D01*
X-27034Y106153D01*
X-26834Y106056D01*
X-26658Y105950D01*
X-26572Y105886D01*
X-17343Y96657D01*
X-16268Y95939D01*
X-15000Y95686D01*
X12253D01*
X12359Y95671D01*
X12558Y95622D01*
X12769Y95548D01*
X12993Y95448D01*
X13233Y95316D01*
X13487Y95150D01*
X13756Y94947D01*
X14038Y94704D01*
X14369Y94384D01*
X14523Y94285D01*
X15009Y93799D01*
X16491Y92943D01*
X18144Y92500D01*
X19856D01*
X21509Y92943D01*
X22991Y93799D01*
X24201Y95009D01*
X25057Y96491D01*
X25500Y98144D01*
Y99856D01*
X25057Y101509D01*
X24201Y102991D01*
X23640Y103552D01*
X23606Y104965D01*
X23748Y105142D01*
X25001Y106395D01*
X25989Y108105D01*
X26500Y110013D01*
Y111987D01*
X25989Y113895D01*
X25001Y115605D01*
X23605Y117001D01*
X21895Y117989D01*
X19987Y118500D01*
X18013D01*
X16105Y117989D01*
X14395Y117001D01*
X14073Y116680D01*
X12990Y116608D01*
X-4318D01*
X-4721Y116647D01*
X-5076Y117001D01*
X-6786Y117989D01*
X-8694Y118500D01*
X-10669D01*
X-12576Y117989D01*
X-14286Y117001D01*
X-15683Y115605D01*
X-16670Y113895D01*
X-17181Y111987D01*
Y110013D01*
X-16670Y108105D01*
X-15683Y106395D01*
X-14286Y104999D01*
X-12576Y104011D01*
X-10981Y103584D01*
X-11148Y102314D01*
X-13627D01*
X-21886Y110573D01*
X-21950Y110658D01*
X-22056Y110834D01*
X-22153Y111034D01*
X-22241Y111264D01*
X-22317Y111527D01*
X-22380Y111824D01*
X-22426Y112158D01*
X-22454Y112529D01*
X-22461Y112989D01*
X-22500Y113168D01*
Y113856D01*
X-22943Y115509D01*
X-23799Y116991D01*
X-25009Y118201D01*
X-26491Y119057D01*
X-28144Y119500D01*
D02*
G37*
G36*
X35856Y105500D02*
X34144D01*
X32491Y105057D01*
X31009Y104201D01*
X29799Y102991D01*
X28943Y101509D01*
X28500Y99856D01*
Y98144D01*
X28943Y96491D01*
X29799Y95009D01*
X30285Y94523D01*
X30384Y94369D01*
X30704Y94038D01*
X30947Y93756D01*
X31150Y93488D01*
X31316Y93233D01*
X31448Y92993D01*
X31549Y92769D01*
X31622Y92558D01*
X31671Y92359D01*
X31686Y92253D01*
Y71373D01*
X31428Y71114D01*
X31342Y71050D01*
X31166Y70944D01*
X30966Y70847D01*
X30736Y70759D01*
X30473Y70683D01*
X30176Y70620D01*
X29842Y70574D01*
X29471Y70546D01*
X29011Y70539D01*
X28832Y70500D01*
X28144D01*
X26491Y70057D01*
X25009Y69201D01*
X23799Y67991D01*
X22943Y66509D01*
X22500Y64856D01*
Y63144D01*
X22943Y61491D01*
X23799Y60009D01*
X25009Y58799D01*
X26491Y57943D01*
X28144Y57500D01*
X29856D01*
X31509Y57943D01*
X32991Y58799D01*
X34201Y60009D01*
X35057Y61491D01*
X35500Y63144D01*
Y63832D01*
X35539Y64011D01*
X35546Y64471D01*
X35574Y64842D01*
X35620Y65175D01*
X35683Y65473D01*
X35759Y65736D01*
X35847Y65966D01*
X35944Y66166D01*
X36050Y66342D01*
X36114Y66428D01*
X37343Y67657D01*
X38061Y68732D01*
X38314Y70000D01*
Y92253D01*
X38329Y92359D01*
X38378Y92558D01*
X38451Y92769D01*
X38552Y92993D01*
X38684Y93233D01*
X38850Y93487D01*
X39053Y93756D01*
X39296Y94038D01*
X39616Y94369D01*
X39715Y94523D01*
X40201Y95009D01*
X41057Y96491D01*
X41500Y98144D01*
Y99856D01*
X41057Y101509D01*
X40201Y102991D01*
X38991Y104201D01*
X37509Y105057D01*
X35856Y105500D01*
D02*
G37*
G36*
X-12500Y49000D02*
X-17730D01*
Y44270D01*
X-12500D01*
Y49000D01*
D02*
G37*
G36*
X-20270D02*
X-25500D01*
Y44270D01*
X-20270D01*
Y49000D01*
D02*
G37*
G36*
X-12500Y41730D02*
X-17730D01*
Y37000D01*
X-12500D01*
Y41730D01*
D02*
G37*
G36*
X-20270D02*
X-25500D01*
Y37000D01*
X-20270D01*
Y41730D01*
D02*
G37*
G36*
X-44500Y36500D02*
X-45500D01*
X-45770Y36500D01*
X-50730D01*
Y30500D01*
Y24500D01*
X-45770D01*
X-45500Y24500D01*
X-44500D01*
X-44230Y24500D01*
X-39270D01*
Y30500D01*
Y36500D01*
X-44230D01*
X-44500Y36500D01*
D02*
G37*
G36*
X-36730Y36500D02*
Y31770D01*
X-31500D01*
Y36500D01*
X-36730D01*
D02*
G37*
G36*
X-67270D02*
X-72500D01*
Y31770D01*
X-67270D01*
Y36500D01*
D02*
G37*
G36*
X-31500Y29230D02*
X-36730D01*
Y24500D01*
X-31500D01*
Y29230D01*
D02*
G37*
G36*
X-58500Y36500D02*
X-59500D01*
X-59770Y36500D01*
X-64730D01*
Y30500D01*
Y24500D01*
X-59770D01*
X-59500Y24500D01*
X-58500D01*
X-58230Y24500D01*
X-53270D01*
Y30500D01*
Y36500D01*
X-58230D01*
X-58500Y36500D01*
D02*
G37*
G36*
X-67270Y29230D02*
X-72500D01*
Y24500D01*
X-67270D01*
Y29230D01*
D02*
G37*
G36*
X-9144Y69500D02*
X-10856D01*
X-12509Y69057D01*
X-13991Y68201D01*
X-15201Y66991D01*
X-16057Y65509D01*
X-16500Y63856D01*
Y62144D01*
X-16057Y60491D01*
X-15201Y59009D01*
X-13991Y57799D01*
X-12509Y56943D01*
X-10856Y56500D01*
X-10168D01*
X-9989Y56461D01*
X-9529Y56454D01*
X-9158Y56426D01*
X-8825Y56380D01*
X-8526Y56317D01*
X-8264Y56241D01*
X-8034Y56153D01*
X-7834Y56056D01*
X-7658Y55950D01*
X-7573Y55886D01*
X-4314Y52627D01*
Y26747D01*
X-4329Y26641D01*
X-4378Y26442D01*
X-4451Y26231D01*
X-4552Y26007D01*
X-4684Y25767D01*
X-4850Y25513D01*
X-5053Y25244D01*
X-5296Y24962D01*
X-5616Y24631D01*
X-5715Y24477D01*
X-6201Y23991D01*
X-7057Y22509D01*
X-7500Y20856D01*
Y19144D01*
X-7057Y17491D01*
X-6201Y16009D01*
X-4991Y14799D01*
X-3509Y13943D01*
X-1856Y13500D01*
X-144D01*
X1509Y13943D01*
X2991Y14799D01*
X4201Y16009D01*
X5057Y17491D01*
X5500Y19144D01*
Y20856D01*
X5057Y22509D01*
X4201Y23991D01*
X3715Y24477D01*
X3616Y24631D01*
X3296Y24962D01*
X3053Y25244D01*
X2850Y25512D01*
X2684Y25767D01*
X2552Y26007D01*
X2451Y26231D01*
X2378Y26442D01*
X2329Y26641D01*
X2314Y26747D01*
Y54000D01*
X2061Y55268D01*
X1343Y56343D01*
X-2886Y60573D01*
X-2950Y60658D01*
X-3056Y60834D01*
X-3153Y61034D01*
X-3241Y61264D01*
X-3317Y61527D01*
X-3380Y61824D01*
X-3426Y62158D01*
X-3454Y62529D01*
X-3461Y62989D01*
X-3500Y63168D01*
Y63856D01*
X-3943Y65509D01*
X-4799Y66991D01*
X-6009Y68201D01*
X-7491Y69057D01*
X-9144Y69500D01*
D02*
G37*
G36*
X19500Y7500D02*
X14270D01*
Y2770D01*
X19500D01*
Y7500D01*
D02*
G37*
G36*
X11730D02*
X6500D01*
Y2770D01*
X11730D01*
Y7500D01*
D02*
G37*
G36*
X19500Y230D02*
X14270D01*
Y-4500D01*
X19500D01*
Y230D01*
D02*
G37*
G36*
X11730D02*
X6500D01*
Y-4500D01*
X11730D01*
Y230D01*
D02*
G37*
G36*
X24856Y-8500D02*
X23144D01*
X21491Y-8943D01*
X20723Y-9387D01*
X19500Y-9500D01*
X19500Y-9500D01*
X19500Y-9500D01*
X6500D01*
Y-21500D01*
X19500D01*
Y-21374D01*
X20770Y-20641D01*
X21491Y-21057D01*
X23144Y-21500D01*
X24856D01*
X26509Y-21057D01*
X27991Y-20201D01*
X29201Y-18991D01*
X30057Y-17509D01*
X30500Y-15856D01*
Y-14144D01*
X30057Y-12491D01*
X29201Y-11009D01*
X27991Y-9799D01*
X26509Y-8943D01*
X24856Y-8500D01*
D02*
G37*
G36*
X-12500Y32000D02*
X-25500D01*
Y20000D01*
X-24988D01*
X-24661Y19581D01*
X-24352Y18730D01*
X-25057Y17509D01*
X-25500Y15856D01*
Y14144D01*
X-25057Y12491D01*
X-24201Y11009D01*
X-22991Y9799D01*
X-21509Y8943D01*
X-19856Y8500D01*
X-19671D01*
X-19654Y8494D01*
X-19274Y8447D01*
X-18987Y8391D01*
X-18725Y8320D01*
X-18486Y8233D01*
X-18266Y8133D01*
X-18062Y8019D01*
X-17871Y7889D01*
X-17689Y7742D01*
X-17620Y7676D01*
X-10365Y-1195D01*
X-10314Y-1275D01*
X-10205Y-1483D01*
X-10116Y-1696D01*
X-10045Y-1919D01*
X-9990Y-2154D01*
X-9953Y-2406D01*
X-9935Y-2677D01*
X-9937Y-2969D01*
X-9946Y-3093D01*
X-9960Y-3144D01*
Y-3271D01*
X-9966Y-3350D01*
X-9960Y-3401D01*
Y-4856D01*
X-9517Y-6509D01*
X-8661Y-7991D01*
X-7451Y-9201D01*
X-5969Y-10057D01*
X-4316Y-10500D01*
X-2604D01*
X-951Y-10057D01*
X531Y-9201D01*
X1741Y-7991D01*
X2597Y-6509D01*
X3040Y-4856D01*
Y-3144D01*
X2597Y-1491D01*
X1741Y-9D01*
X531Y1201D01*
X-951Y2057D01*
X-2604Y2500D01*
X-2789D01*
X-2806Y2506D01*
X-3186Y2553D01*
X-3473Y2609D01*
X-3735Y2680D01*
X-3974Y2767D01*
X-4194Y2867D01*
X-4398Y2981D01*
X-4590Y3111D01*
X-4771Y3258D01*
X-4840Y3324D01*
X-12096Y12195D01*
X-12146Y12275D01*
X-12255Y12483D01*
X-12344Y12696D01*
X-12415Y12918D01*
X-12470Y13154D01*
X-12507Y13406D01*
X-12525Y13677D01*
X-12523Y13969D01*
X-12514Y14093D01*
X-12500Y14144D01*
Y14271D01*
X-12494Y14351D01*
X-12500Y14401D01*
Y15856D01*
X-12943Y17509D01*
X-13648Y18730D01*
X-13339Y19581D01*
X-13012Y20000D01*
X-12500D01*
Y32000D01*
D02*
G37*
G36*
X-18500Y-9500D02*
X-23730D01*
Y-14230D01*
X-18500D01*
Y-9500D01*
D02*
G37*
G36*
X-26270D02*
X-31500D01*
Y-14230D01*
X-26270D01*
Y-9500D01*
D02*
G37*
G36*
X-18500Y-16770D02*
X-23730D01*
Y-21500D01*
X-18500D01*
Y-16770D01*
D02*
G37*
G36*
X-26270D02*
X-31500D01*
Y-21500D01*
X-26270D01*
Y-16770D01*
D02*
G37*
G36*
X-4144Y-25500D02*
X-5856D01*
X-7509Y-25943D01*
X-8991Y-26799D01*
X-9727Y-27535D01*
X-9868Y-27635D01*
X-10122Y-27905D01*
X-10324Y-28089D01*
X-10523Y-28244D01*
X-10720Y-28371D01*
X-10917Y-28475D01*
X-11116Y-28558D01*
X-11322Y-28622D01*
X-11539Y-28670D01*
X-11634Y-28681D01*
X-18500D01*
Y-26500D01*
X-31500D01*
Y-38500D01*
X-30770D01*
X-29500Y-38500D01*
Y-51500D01*
X-17500D01*
Y-38500D01*
X-18500Y-38500D01*
Y-35819D01*
X-11432D01*
X-11340Y-35829D01*
X-11326Y-35832D01*
X-10956Y-36230D01*
X-11046Y-36704D01*
X-11639Y-37500D01*
X-14000D01*
Y-56500D01*
X4000D01*
Y-37500D01*
X542D01*
X367Y-37332D01*
X201Y-35991D01*
X1057Y-34509D01*
X1500Y-32856D01*
Y-31144D01*
X1057Y-29491D01*
X201Y-28009D01*
X-1009Y-26799D01*
X-2491Y-25943D01*
X-4144Y-25500D01*
D02*
G37*
G36*
X-55500Y-36500D02*
X-60730D01*
Y-41230D01*
X-55500D01*
Y-36500D01*
D02*
G37*
G36*
X-63270D02*
X-68500D01*
Y-41230D01*
X-63270D01*
Y-36500D01*
D02*
G37*
G36*
X-55500Y-43770D02*
X-60730D01*
Y-48500D01*
X-55500D01*
Y-43770D01*
D02*
G37*
G36*
X-63270D02*
X-68500D01*
Y-48500D01*
X-63270D01*
Y-43770D01*
D02*
G37*
G36*
X4000Y-63500D02*
X-3730D01*
Y-71730D01*
X4000D01*
Y-63500D01*
D02*
G37*
G36*
X-6270D02*
X-14000D01*
Y-71730D01*
X-6270D01*
Y-63500D01*
D02*
G37*
G36*
X4000Y-74270D02*
X-3730D01*
Y-82500D01*
X4000D01*
Y-74270D01*
D02*
G37*
G36*
X-6270D02*
X-14000D01*
Y-82500D01*
X-6270D01*
Y-74270D01*
D02*
G37*
G36*
X-18000Y-242003D02*
X-63706D01*
Y-266000D01*
X-18000D01*
Y-242003D01*
D02*
G37*
G36*
X54000Y-242392D02*
X50737Y-242822D01*
X47696Y-244081D01*
X45085Y-246085D01*
X43081Y-248696D01*
X41822Y-251737D01*
X41392Y-255000D01*
X41822Y-258263D01*
X43081Y-261304D01*
X45085Y-263915D01*
X47696Y-265919D01*
X50737Y-267178D01*
X54000Y-267608D01*
X57263Y-267178D01*
X60304Y-265919D01*
X62915Y-263915D01*
X64919Y-261304D01*
X66178Y-258263D01*
X66608Y-255000D01*
X66178Y-251737D01*
X64919Y-248696D01*
X62915Y-246085D01*
X60304Y-244081D01*
X57263Y-242822D01*
X54000Y-242392D01*
D02*
G37*
%LPD*%
G36*
X-24492Y112436D02*
X-24455Y111942D01*
X-24390Y111474D01*
X-24297Y111032D01*
X-24176Y110616D01*
X-24027Y110225D01*
X-23850Y109860D01*
X-23645Y109520D01*
X-23412Y109206D01*
X-23150Y108918D01*
X-24918Y107150D01*
X-25206Y107411D01*
X-25520Y107645D01*
X-25859Y107850D01*
X-26225Y108027D01*
X-26616Y108176D01*
X-27032Y108297D01*
X-27474Y108390D01*
X-27942Y108455D01*
X-28436Y108491D01*
X-28955Y108500D01*
X-24500Y112955D01*
X-24492Y112436D01*
D02*
G37*
G36*
X15072Y107150D02*
X14974Y107217D01*
X14818Y107276D01*
X14603Y107329D01*
X14329Y107374D01*
X13606Y107444D01*
X12649Y107486D01*
X11457Y107500D01*
Y114500D01*
X12082Y114503D01*
X14603Y114671D01*
X14818Y114724D01*
X14974Y114783D01*
X15072Y114850D01*
Y107150D01*
D02*
G37*
G36*
X-5656Y114783D02*
X-5499Y114724D01*
X-5284Y114671D01*
X-5010Y114626D01*
X-4287Y114556D01*
X-3330Y114514D01*
X-2139Y114500D01*
Y107500D01*
X-2764Y107497D01*
X-5284Y107329D01*
X-5499Y107276D01*
X-5656Y107217D01*
X-5753Y107150D01*
Y114850D01*
X-5656Y114783D01*
D02*
G37*
G36*
X15786Y95850D02*
X15413Y96211D01*
X15038Y96534D01*
X14661Y96819D01*
X14283Y97066D01*
X13903Y97275D01*
X13521Y97446D01*
X13138Y97579D01*
X12752Y97674D01*
X12366Y97731D01*
X11977Y97750D01*
Y100250D01*
X12366Y100269D01*
X12752Y100326D01*
X13138Y100421D01*
X13521Y100554D01*
X13903Y100725D01*
X14283Y100934D01*
X14661Y101181D01*
X15038Y101466D01*
X15413Y101789D01*
X15786Y102150D01*
Y95850D01*
D02*
G37*
G36*
X37789Y95413D02*
X37466Y95038D01*
X37181Y94661D01*
X36934Y94283D01*
X36725Y93903D01*
X36554Y93521D01*
X36421Y93138D01*
X36326Y92753D01*
X36269Y92366D01*
X36250Y91977D01*
X33750D01*
X33731Y92366D01*
X33674Y92753D01*
X33579Y93138D01*
X33446Y93521D01*
X33275Y93903D01*
X33066Y94283D01*
X32819Y94661D01*
X32534Y95038D01*
X32211Y95413D01*
X31850Y95786D01*
X38150D01*
X37789Y95413D01*
D02*
G37*
G36*
X34850Y68082D02*
X34588Y67794D01*
X34355Y67480D01*
X34150Y67140D01*
X33973Y66775D01*
X33824Y66385D01*
X33703Y65968D01*
X33610Y65526D01*
X33545Y65058D01*
X33509Y64564D01*
X33500Y64045D01*
X29045Y68500D01*
X29564Y68509D01*
X30058Y68545D01*
X30526Y68610D01*
X30968Y68703D01*
X31384Y68824D01*
X31775Y68973D01*
X32141Y69150D01*
X32480Y69355D01*
X32794Y69588D01*
X33082Y69850D01*
X34850Y68082D01*
D02*
G37*
G36*
X-5491Y62436D02*
X-5455Y61942D01*
X-5390Y61474D01*
X-5297Y61032D01*
X-5176Y60616D01*
X-5027Y60225D01*
X-4850Y59859D01*
X-4645Y59520D01*
X-4412Y59206D01*
X-4150Y58918D01*
X-5918Y57150D01*
X-6206Y57411D01*
X-6520Y57645D01*
X-6859Y57850D01*
X-7225Y58027D01*
X-7616Y58176D01*
X-8032Y58297D01*
X-8474Y58390D01*
X-8942Y58455D01*
X-9436Y58492D01*
X-9955Y58500D01*
X-5500Y62955D01*
X-5491Y62436D01*
D02*
G37*
G36*
X269Y26634D02*
X326Y26247D01*
X421Y25862D01*
X554Y25479D01*
X725Y25097D01*
X934Y24717D01*
X1181Y24339D01*
X1466Y23962D01*
X1789Y23587D01*
X2150Y23214D01*
X-4150D01*
X-3789Y23587D01*
X-3466Y23962D01*
X-3181Y24339D01*
X-2934Y24717D01*
X-2725Y25097D01*
X-2554Y25479D01*
X-2421Y25862D01*
X-2326Y26247D01*
X-2269Y26634D01*
X-2250Y27023D01*
X250D01*
X269Y26634D01*
D02*
G37*
G36*
X20786Y-18150D02*
X20458Y-17837D01*
X20120Y-17556D01*
X19771Y-17308D01*
X19413Y-17094D01*
X19045Y-16912D01*
X18668Y-16764D01*
X18280Y-16648D01*
X17882Y-16566D01*
X17475Y-16516D01*
X17057Y-16500D01*
Y-13500D01*
X17475Y-13484D01*
X17882Y-13434D01*
X18280Y-13352D01*
X18668Y-13236D01*
X19045Y-13088D01*
X19413Y-12906D01*
X19771Y-12692D01*
X20120Y-12444D01*
X20458Y-12163D01*
X20786Y-11850D01*
Y-18150D01*
D02*
G37*
G36*
X-17484Y21525D02*
X-17434Y21118D01*
X-17351Y20720D01*
X-17236Y20332D01*
X-17088Y19955D01*
X-16906Y19587D01*
X-16691Y19229D01*
X-16444Y18880D01*
X-16164Y18542D01*
X-15850Y18214D01*
X-22150D01*
X-21837Y18542D01*
X-21556Y18880D01*
X-21309Y19229D01*
X-21094Y19587D01*
X-20912Y19955D01*
X-20764Y20332D01*
X-20649Y20720D01*
X-20566Y21118D01*
X-20517Y21525D01*
X-20500Y21943D01*
X-17500D01*
X-17484Y21525D01*
D02*
G37*
G36*
X-14562Y14054D02*
X-14565Y13615D01*
X-14536Y13188D01*
X-14475Y12775D01*
X-14383Y12376D01*
X-14259Y11989D01*
X-14102Y11616D01*
X-13915Y11256D01*
X-13695Y10909D01*
X-13443Y10576D01*
X-15766Y8676D01*
X-16043Y8989D01*
X-16339Y9273D01*
X-16655Y9529D01*
X-16990Y9756D01*
X-17344Y9954D01*
X-17717Y10124D01*
X-18110Y10265D01*
X-18522Y10378D01*
X-18953Y10462D01*
X-19404Y10518D01*
X-14527Y14507D01*
X-14562Y14054D01*
D02*
G37*
G36*
X-6417Y2011D02*
X-6121Y1727D01*
X-5806Y1471D01*
X-5471Y1244D01*
X-5116Y1046D01*
X-4743Y876D01*
X-4350Y735D01*
X-3938Y622D01*
X-3507Y538D01*
X-3056Y482D01*
X-7933Y-3507D01*
X-7898Y-3054D01*
X-7895Y-2614D01*
X-7924Y-2188D01*
X-7985Y-1775D01*
X-8077Y-1376D01*
X-8202Y-989D01*
X-8358Y-616D01*
X-8545Y-256D01*
X-8765Y91D01*
X-9017Y424D01*
X-6694Y2324D01*
X-6417Y2011D01*
D02*
G37*
G36*
X-8040Y-35214D02*
X-1850D01*
X-2164Y-35542D01*
X-2444Y-35880D01*
X-2691Y-36229D01*
X-2906Y-36587D01*
X-3088Y-36955D01*
X-3236Y-37332D01*
X-3352Y-37720D01*
X-3434Y-38118D01*
X-3483Y-38525D01*
X-3500Y-38943D01*
X-6500D01*
X-6517Y-38525D01*
X-6566Y-38118D01*
X-6648Y-37720D01*
X-6764Y-37332D01*
X-6913Y-36955D01*
X-7094Y-36587D01*
X-7308Y-36229D01*
X-7556Y-35880D01*
X-7836Y-35542D01*
X-8096Y-35270D01*
X-8382Y-35025D01*
X-8738Y-34757D01*
X-9101Y-34521D01*
X-9471Y-34316D01*
X-9849Y-34143D01*
X-10234Y-34002D01*
X-10626Y-33892D01*
X-11025Y-33813D01*
X-11432Y-33766D01*
X-11846Y-33750D01*
X-12023Y-30750D01*
X-11602Y-30733D01*
X-11194Y-30681D01*
X-10799Y-30596D01*
X-10416Y-30475D01*
X-10046Y-30321D01*
X-9688Y-30132D01*
X-9343Y-29909D01*
X-9011Y-29651D01*
X-8691Y-29360D01*
X-8384Y-29033D01*
X-8040Y-35214D01*
D02*
G37*
D10*
X-25000Y-32500D02*
X-24750Y-32250D01*
X-5250D01*
X-5000Y-32000D01*
Y-47000D02*
Y-32000D01*
X-23500Y-45000D02*
Y-34000D01*
X-25000Y-32500D02*
X-23500Y-34000D01*
X-19000Y15000D02*
X-3460Y-4000D01*
X13000Y-15000D02*
X24000D01*
X-19000Y15000D02*
Y26000D01*
X-49000Y-26500D02*
X-48000Y-27500D01*
X-61000Y-26500D02*
X-49000D01*
X-62000Y-25500D02*
X-61000Y-26500D01*
X-62000Y-25500D02*
Y-14140D01*
D11*
X-40500Y-45000D02*
X-39000Y-43500D01*
X-47500Y-10500D02*
X-39000Y-19000D01*
Y-43500D02*
Y-19000D01*
X-48000Y-10500D02*
X-47500D01*
X-49000Y-9500D02*
X-48000Y-10500D01*
X-49000Y-9500D02*
Y-2000D01*
X-53000Y2000D02*
X-49000Y-2000D01*
X-53000Y12500D02*
X-52000Y13500D01*
X-53000Y2000D02*
Y12500D01*
D12*
X-52000Y13500D02*
X-38000D01*
D16*
X58000Y233500D02*
G03*
X48000Y243500I-10000J0D01*
G01*
X58000Y190243D02*
G03*
X61000Y183000I10243J0D01*
G01*
X19000Y256000D02*
G03*
X25000Y250000I6000J0D01*
G01*
X19000Y256000D02*
G03*
X12000Y263000I-7000J0D01*
G01*
X75709Y180050D02*
G03*
X86407Y184481I-0J15130D01*
G01*
X61000Y183000D02*
G03*
X68122Y180050I7122J7122D01*
G01*
X4000Y263000D02*
G03*
X-3000Y256000I0J-7000D01*
G01*
X57818Y179818D02*
G03*
X68122Y175550I10304J10304D01*
G01*
X53500Y190227D02*
G03*
X57807Y179829I14704J0D01*
G01*
X53500Y233500D02*
G03*
X48000Y239000I-5500J0D01*
G01*
X10000Y243000D02*
G03*
X18000Y235000I8000J0D01*
G01*
X86407Y184481D02*
G03*
X88900Y190500I-6019J6019D01*
G01*
X86407Y171119D02*
G03*
X75709Y175550I-10698J-10698D01*
G01*
X88900Y165100D02*
G03*
X86407Y171119I-8512J0D01*
G01*
X-88900Y12700D02*
X-66800D01*
X-66000Y13500D01*
X-29000Y113000D02*
X-15000Y99000D01*
X29000Y64000D02*
X35000Y70000D01*
Y99000D01*
X-15000D02*
X19000D01*
X58000Y190243D02*
Y233500D01*
X25000Y250000D02*
X25000D01*
X37500Y243500D02*
X48000D01*
X25000Y250000D02*
X37500Y243500D01*
X68122Y180050D02*
X75709D01*
X4000Y263000D02*
X12000D01*
X-3000Y253000D02*
Y256000D01*
X57807Y179829D02*
X57818Y179818D01*
X68122Y175550D02*
X75709D01*
X37000Y239000D02*
X48000D01*
X53500Y190227D02*
Y233500D01*
X18000Y235000D02*
X28000D01*
X10000Y243000D02*
Y253000D01*
X-1000Y20000D02*
Y54000D01*
X-10000Y63000D02*
X-1000Y54000D01*
X-70600Y158000D02*
X-45350D01*
X-88900Y139700D02*
X-70600Y158000D01*
X-88900Y-63500D02*
X-38400Y-114000D01*
X11000D01*
X28000Y235000D02*
X37000Y239000D01*
X-22500Y-251502D02*
X-26785Y-261500D01*
X-31070Y-251502D02*
X-26785Y-261500D01*
X-33498Y-249360D02*
X-34926Y-248646D01*
X-37068Y-246503D01*
Y-261500D01*
X-45209Y-260072D02*
X-44495Y-260786D01*
X-45209Y-261500D01*
X-45924Y-260786D01*
X-45209Y-260072D01*
X-53493Y-246503D02*
X-51351Y-247217D01*
X-49923Y-249360D01*
X-49208Y-252931D01*
Y-255073D01*
X-49923Y-258643D01*
X-51351Y-260786D01*
X-53493Y-261500D01*
X-54922D01*
X-57064Y-260786D01*
X-58492Y-258643D01*
X-59206Y-255073D01*
Y-252931D01*
X-58492Y-249360D01*
X-57064Y-247217D01*
X-54922Y-246503D01*
X-53493D01*
D42*
X-9681Y111000D02*
X19000D01*
X-9681Y132600D02*
X-9000D01*
X-32650D02*
X-9681D01*
D44*
X-40500Y-45000D02*
D03*
X-23500D02*
D03*
D45*
X54000Y-255000D02*
D03*
D49*
X-25000Y-32500D02*
D03*
Y-15500D02*
D03*
X-19000Y43000D02*
D03*
Y26000D02*
D03*
X-48000Y-27500D02*
D03*
Y-10500D02*
D03*
X-62000Y-25500D02*
D03*
Y-42500D02*
D03*
X-38000Y13500D02*
D03*
Y30500D02*
D03*
X-52000Y13500D02*
D03*
Y30500D02*
D03*
X-66000D02*
D03*
Y13500D02*
D03*
X13000Y-15500D02*
D03*
Y1500D02*
D03*
D60*
X88900Y-190500D02*
D03*
Y-165100D02*
D03*
Y-139700D02*
D03*
Y-114300D02*
D03*
Y-63500D02*
D03*
Y-38100D02*
D03*
Y63500D02*
D03*
Y139700D02*
D03*
Y190500D02*
D03*
Y241300D02*
D03*
Y215900D02*
D03*
Y165100D02*
D03*
Y114300D02*
D03*
Y88900D02*
D03*
Y38100D02*
D03*
Y12700D02*
D03*
Y-12700D02*
D03*
Y-88900D02*
D03*
Y-215900D02*
D03*
Y-241300D02*
D03*
Y-266700D02*
D03*
X-88900Y-190500D02*
D03*
Y-165100D02*
D03*
Y-139700D02*
D03*
Y-114300D02*
D03*
Y-63500D02*
D03*
Y-38100D02*
D03*
Y63500D02*
D03*
Y139700D02*
D03*
Y190500D02*
D03*
Y241300D02*
D03*
Y215900D02*
D03*
Y165100D02*
D03*
Y114300D02*
D03*
Y88900D02*
D03*
Y38100D02*
D03*
Y12700D02*
D03*
Y-12700D02*
D03*
Y-88900D02*
D03*
Y-215900D02*
D03*
Y-241300D02*
D03*
Y-266700D02*
D03*
D61*
X88900Y266700D02*
D03*
X-88900D02*
D03*
D62*
X-46850Y132600D02*
D03*
Y145300D02*
D03*
Y158000D02*
D03*
Y170700D02*
D03*
Y183400D02*
D03*
X-31150Y145300D02*
D03*
Y158000D02*
D03*
Y170700D02*
D03*
Y183400D02*
D03*
D63*
Y132600D02*
D03*
D64*
X28250Y264800D02*
D03*
X-28250D02*
D03*
D65*
X-36000Y-58003D02*
D03*
X-74000Y-25000D02*
D03*
X49000Y127000D02*
D03*
X-3460Y-4000D02*
D03*
X-19000Y15000D02*
D03*
X-30104Y2631D02*
D03*
X-62000Y-14140D02*
D03*
X-13000Y-23000D02*
D03*
X-5000Y-32000D02*
D03*
X11000Y-98000D02*
D03*
X-68000Y-178000D02*
D03*
X-29000Y113000D02*
D03*
X38000Y228000D02*
D03*
X27545Y134750D02*
D03*
X35000Y99000D02*
D03*
X29000Y64000D02*
D03*
X19000Y99000D02*
D03*
X18250Y61000D02*
D03*
X27500Y154000D02*
D03*
X23000Y191000D02*
D03*
X-10000Y63000D02*
D03*
X-1000Y20000D02*
D03*
X30367Y-2815D02*
D03*
X24000Y-15000D02*
D03*
X11000Y-181000D02*
D03*
Y-114000D02*
D03*
X-11000Y-242000D02*
D03*
X25000Y-261000D02*
D03*
X-72000Y-150000D02*
D03*
X-45023Y-81891D02*
D03*
X-53000Y2000D02*
D03*
X-3000Y253000D02*
D03*
X10000D02*
D03*
D66*
X-28000Y231000D02*
D03*
X-20000Y216000D02*
D03*
X-9681Y111000D02*
D03*
Y132600D02*
D03*
X19000Y111000D02*
D03*
D67*
X-5000Y-47000D02*
D03*
Y-73000D02*
D03*
M02*
