G04*
G04 #@! TF.GenerationSoftware,Altium Limited,Altium Designer,24.1.2 (44)*
G04*
G04 Layer_Physical_Order=1*
G04 Layer_Color=255*
%FSLAX44Y44*%
%MOMM*%
G71*
G04*
G04 #@! TF.SameCoordinates,6530E746-830A-44C6-BB1E-2799B620A325*
G04*
G04*
G04 #@! TF.FilePolarity,Positive*
G04*
G01*
G75*
%ADD10C,0.3000*%
%ADD11C,0.4000*%
%ADD12C,0.5000*%
%ADD16C,0.2500*%
%ADD42C,0.7000*%
%ADD43R,1.1500X1.4000*%
%ADD44R,0.8000X0.9000*%
%ADD45C,1.0000*%
G04:AMPARAMS|DCode=46|XSize=0.3mm|YSize=1.4mm|CornerRadius=0.075mm|HoleSize=0mm|Usage=FLASHONLY|Rotation=135.000|XOffset=0mm|YOffset=0mm|HoleType=Round|Shape=RoundedRectangle|*
%AMROUNDEDRECTD46*
21,1,0.3000,1.2500,0,0,135.0*
21,1,0.1500,1.4000,0,0,135.0*
1,1,0.1500,0.3889,0.4950*
1,1,0.1500,0.4950,0.3889*
1,1,0.1500,-0.3889,-0.4950*
1,1,0.1500,-0.4950,-0.3889*
%
%ADD46ROUNDEDRECTD46*%
G04:AMPARAMS|DCode=47|XSize=0.3mm|YSize=1.4mm|CornerRadius=0mm|HoleSize=0mm|Usage=FLASHONLY|Rotation=135.000|XOffset=0mm|YOffset=0mm|HoleType=Round|Shape=Round|*
%AMOVALD47*
21,1,1.1000,0.3000,0.0000,0.0000,225.0*
1,1,0.3000,0.3889,0.3889*
1,1,0.3000,-0.3889,-0.3889*
%
%ADD47OVALD47*%

G04:AMPARAMS|DCode=48|XSize=0.3mm|YSize=1.4mm|CornerRadius=0mm|HoleSize=0mm|Usage=FLASHONLY|Rotation=45.000|XOffset=0mm|YOffset=0mm|HoleType=Round|Shape=Round|*
%AMOVALD48*
21,1,1.1000,0.3000,0.0000,0.0000,135.0*
1,1,0.3000,0.3889,-0.3889*
1,1,0.3000,-0.3889,0.3889*
%
%ADD48OVALD48*%

%ADD49R,0.9000X0.8000*%
%ADD50R,2.3000X1.7000*%
G04:AMPARAMS|DCode=51|XSize=0.4mm|YSize=1.35mm|CornerRadius=0.1mm|HoleSize=0mm|Usage=FLASHONLY|Rotation=180.000|XOffset=0mm|YOffset=0mm|HoleType=Round|Shape=RoundedRectangle|*
%AMROUNDEDRECTD51*
21,1,0.4000,1.1500,0,0,180.0*
21,1,0.2000,1.3500,0,0,180.0*
1,1,0.2000,-0.1000,0.5750*
1,1,0.2000,0.1000,0.5750*
1,1,0.2000,0.1000,-0.5750*
1,1,0.2000,-0.1000,-0.5750*
%
%ADD51ROUNDEDRECTD51*%
%ADD52R,0.4000X1.3500*%
G04:AMPARAMS|DCode=53|XSize=2.3mm|YSize=1.5mm|CornerRadius=0.375mm|HoleSize=0mm|Usage=FLASHONLY|Rotation=180.000|XOffset=0mm|YOffset=0mm|HoleType=Round|Shape=RoundedRectangle|*
%AMROUNDEDRECTD53*
21,1,2.3000,0.7500,0,0,180.0*
21,1,1.5500,1.5000,0,0,180.0*
1,1,0.7500,-0.7750,0.3750*
1,1,0.7500,0.7750,0.3750*
1,1,0.7500,0.7750,-0.3750*
1,1,0.7500,-0.7750,-0.3750*
%
%ADD53ROUNDEDRECTD53*%
%ADD54R,0.6000X1.0000*%
%ADD55R,0.5500X0.8000*%
G04:AMPARAMS|DCode=56|XSize=0.55mm|YSize=0.8mm|CornerRadius=0.1375mm|HoleSize=0mm|Usage=FLASHONLY|Rotation=0.000|XOffset=0mm|YOffset=0mm|HoleType=Round|Shape=RoundedRectangle|*
%AMROUNDEDRECTD56*
21,1,0.5500,0.5250,0,0,0.0*
21,1,0.2750,0.8000,0,0,0.0*
1,1,0.2750,0.1375,-0.2625*
1,1,0.2750,-0.1375,-0.2625*
1,1,0.2750,-0.1375,0.2625*
1,1,0.2750,0.1375,0.2625*
%
%ADD56ROUNDEDRECTD56*%
G04:AMPARAMS|DCode=57|XSize=0.8mm|YSize=0.9mm|CornerRadius=0mm|HoleSize=0mm|Usage=FLASHONLY|Rotation=225.000|XOffset=0mm|YOffset=0mm|HoleType=Round|Shape=Rectangle|*
%AMROTATEDRECTD57*
4,1,4,-0.0354,0.6010,0.6010,-0.0354,0.0354,-0.6010,-0.6010,0.0354,-0.0354,0.6010,0.0*
%
%ADD57ROTATEDRECTD57*%

G04:AMPARAMS|DCode=58|XSize=1mm|YSize=0.8mm|CornerRadius=0.2mm|HoleSize=0mm|Usage=FLASHONLY|Rotation=90.000|XOffset=0mm|YOffset=0mm|HoleType=Round|Shape=RoundedRectangle|*
%AMROUNDEDRECTD58*
21,1,1.0000,0.4000,0,0,90.0*
21,1,0.6000,0.8000,0,0,90.0*
1,1,0.4000,0.2000,0.3000*
1,1,0.4000,0.2000,-0.3000*
1,1,0.4000,-0.2000,-0.3000*
1,1,0.4000,-0.2000,0.3000*
%
%ADD58ROUNDEDRECTD58*%
G04:AMPARAMS|DCode=59|XSize=0.6mm|YSize=0.8mm|CornerRadius=0.15mm|HoleSize=0mm|Usage=FLASHONLY|Rotation=90.000|XOffset=0mm|YOffset=0mm|HoleType=Round|Shape=RoundedRectangle|*
%AMROUNDEDRECTD59*
21,1,0.6000,0.5000,0,0,90.0*
21,1,0.3000,0.8000,0,0,90.0*
1,1,0.3000,0.2500,0.1500*
1,1,0.3000,0.2500,-0.1500*
1,1,0.3000,-0.2500,-0.1500*
1,1,0.3000,-0.2500,0.1500*
%
%ADD59ROUNDEDRECTD59*%
%ADD60C,2.0000*%
G04:AMPARAMS|DCode=61|XSize=2mm|YSize=2mm|CornerRadius=0.5mm|HoleSize=0mm|Usage=FLASHONLY|Rotation=270.000|XOffset=0mm|YOffset=0mm|HoleType=Round|Shape=RoundedRectangle|*
%AMROUNDEDRECTD61*
21,1,2.0000,1.0000,0,0,270.0*
21,1,1.0000,2.0000,0,0,270.0*
1,1,1.0000,-0.5000,-0.5000*
1,1,1.0000,-0.5000,0.5000*
1,1,1.0000,0.5000,0.5000*
1,1,1.0000,0.5000,-0.5000*
%
%ADD61ROUNDEDRECTD61*%
%ADD62O,1.3000X1.0000*%
G04:AMPARAMS|DCode=63|XSize=1mm|YSize=1.3mm|CornerRadius=0.25mm|HoleSize=0mm|Usage=FLASHONLY|Rotation=90.000|XOffset=0mm|YOffset=0mm|HoleType=Round|Shape=RoundedRectangle|*
%AMROUNDEDRECTD63*
21,1,1.0000,0.8000,0,0,90.0*
21,1,0.5000,1.3000,0,0,90.0*
1,1,0.5000,0.4000,0.2500*
1,1,0.5000,0.4000,-0.2500*
1,1,0.5000,-0.4000,-0.2500*
1,1,0.5000,-0.4000,0.2500*
%
%ADD63ROUNDEDRECTD63*%
%ADD64O,1.0500X2.1500*%
%ADD65C,0.9000*%
%ADD66C,1.1000*%
G36*
X-47608Y260677D02*
Y218085D01*
X-47181Y215939D01*
X-45965Y214120D01*
X-29332Y197487D01*
X-29818Y196314D01*
X-42000D01*
X-43268Y196061D01*
X-44343Y195343D01*
X-46258Y193428D01*
X-46976Y192353D01*
X-47229Y191085D01*
Y190965D01*
X-48350D01*
X-50308Y190707D01*
X-52132Y189951D01*
X-53699Y188749D01*
X-54551Y187639D01*
X-55890Y187577D01*
X-75432Y207118D01*
X-75517Y207219D01*
X-75746Y207597D01*
X-75981Y208124D01*
X-76207Y208802D01*
X-76409Y209625D01*
X-76571Y210545D01*
X-76751Y212945D01*
X-76400Y214254D01*
Y217546D01*
X-77252Y220725D01*
X-78898Y223575D01*
X-81225Y225903D01*
X-84075Y227548D01*
X-85470Y227922D01*
Y229237D01*
X-84060Y229615D01*
X-81200Y231266D01*
X-78865Y233600D01*
X-77215Y236460D01*
X-76588Y238800D01*
X-88900D01*
Y243800D01*
X-76588D01*
X-77215Y246140D01*
X-78865Y249000D01*
X-81200Y251334D01*
X-83872Y252877D01*
X-83886Y253512D01*
X-83670Y254165D01*
X-81942Y254393D01*
X-80118Y255149D01*
X-78551Y256351D01*
X-77349Y257918D01*
X-76593Y259742D01*
X-76385Y261323D01*
X-75943Y261498D01*
X-75213Y261687D01*
X-74288Y261835D01*
X-73600Y261892D01*
X-64500D01*
Y261500D01*
X-51500D01*
Y261892D01*
X-48823D01*
X-47608Y260677D01*
D02*
G37*
G36*
X-79697Y273820D02*
X-79433Y273228D01*
X-79019Y272706D01*
X-78454Y272253D01*
X-77737Y271870D01*
X-76870Y271557D01*
X-75851Y271313D01*
X-74681Y271139D01*
X-73360Y271035D01*
X-71888Y271000D01*
Y264000D01*
X-73286Y263965D01*
X-74534Y263860D01*
X-75631Y263685D01*
X-76576Y263441D01*
X-77370Y263126D01*
X-78014Y262741D01*
X-78506Y262287D01*
X-78847Y261763D01*
X-79037Y261168D01*
X-79076Y260504D01*
X-79809Y274481D01*
X-79697Y273820D01*
D02*
G37*
G36*
X88787Y256718D02*
X88245Y257111D01*
X87604Y257306D01*
X86864Y257304D01*
X86024Y257103D01*
X85084Y256705D01*
X84045Y256108D01*
X82907Y255314D01*
X81669Y254322D01*
X78895Y251745D01*
X73945Y256695D01*
X75333Y258132D01*
X77514Y260707D01*
X78309Y261845D01*
X78905Y262884D01*
X79303Y263824D01*
X79503Y264664D01*
X79506Y265404D01*
X79311Y266045D01*
X78918Y266587D01*
X88787Y256718D01*
D02*
G37*
G36*
X10803Y248572D02*
X10298Y248462D01*
X9840Y248321D01*
X9429Y248151D01*
X9065Y247952D01*
X8748Y247723D01*
X8478Y247464D01*
X8255Y247175D01*
X8079Y246857D01*
X7950Y246509D01*
X7868Y246132D01*
X5613Y247623D01*
X5699Y248028D01*
X5812Y248867D01*
X5839Y249301D01*
X5834Y250198D01*
X5802Y250661D01*
X5680Y251616D01*
X5589Y252109D01*
X10803Y248572D01*
D02*
G37*
G36*
X1275Y251487D02*
X1065Y250085D01*
X1030Y249632D01*
X1014Y248746D01*
X1032Y248313D01*
X1122Y247467D01*
X-1254Y246035D01*
X-1292Y246420D01*
X-1382Y246778D01*
X-1522Y247106D01*
X-1714Y247406D01*
X-1958Y247677D01*
X-2252Y247919D01*
X-2598Y248132D01*
X-2996Y248317D01*
X-3444Y248473D01*
X-3945Y248600D01*
X1380Y251968D01*
X1275Y251487D01*
D02*
G37*
G36*
X44500Y278500D02*
X44500Y278161D01*
Y269270D01*
X58000D01*
Y268000D01*
X59270D01*
Y257500D01*
X69973D01*
X70500Y256230D01*
X62769Y248500D01*
X44500D01*
Y227500D01*
X52392D01*
Y223500D01*
X47770D01*
Y217000D01*
X46500D01*
Y215730D01*
X40500D01*
Y210500D01*
X40500D01*
Y209500D01*
X40500D01*
Y196500D01*
X52392D01*
Y187950D01*
X52445Y187687D01*
X52031Y185608D01*
X46000D01*
Y186500D01*
X34000D01*
Y178005D01*
X33367Y176475D01*
X32877Y172757D01*
X32877D01*
X32645Y171583D01*
X32250Y171000D01*
X28770D01*
Y165000D01*
X26230D01*
Y171000D01*
X24020D01*
X22750Y171000D01*
Y171000D01*
X22750D01*
Y171000D01*
X13250D01*
Y159000D01*
X14686D01*
Y151000D01*
X14939Y149732D01*
X15657Y148657D01*
X18140Y146173D01*
X17654Y145000D01*
X13250D01*
Y133000D01*
X22750D01*
Y142481D01*
X23000Y142686D01*
X31729D01*
X32250Y142259D01*
Y133000D01*
X32412D01*
Y130500D01*
X30000D01*
Y121232D01*
X29504Y120034D01*
X28402Y118598D01*
X26966Y117496D01*
X26124Y117148D01*
X25000Y118057D01*
Y122730D01*
X19000D01*
X13000D01*
Y117500D01*
X13097D01*
X13623Y116230D01*
X12998Y115605D01*
X12011Y113895D01*
X11500Y111987D01*
Y110013D01*
X12011Y108105D01*
X12998Y106395D01*
X14252Y105142D01*
X14394Y104965D01*
X14360Y103552D01*
X13799Y102991D01*
X12943Y101509D01*
X12500Y99856D01*
Y98144D01*
X12943Y96491D01*
X11861Y95825D01*
X10775Y96911D01*
X10034Y97874D01*
X9574Y98474D01*
X8820Y100296D01*
X8563Y102246D01*
X8564Y102250D01*
Y190750D01*
X8543Y190855D01*
X8939Y192847D01*
X10126Y194624D01*
X10220Y194686D01*
X11500Y194431D01*
X16500D01*
X17866Y194703D01*
X19023Y195477D01*
X19797Y196634D01*
X20069Y198000D01*
Y201000D01*
X19797Y202366D01*
X19023Y203523D01*
X17866Y204297D01*
X16500Y204569D01*
X11500D01*
X10292Y204328D01*
X9174Y206001D01*
X8795Y207907D01*
X8814Y208000D01*
Y213058D01*
X10084Y213737D01*
X10134Y213703D01*
X11500Y213431D01*
X16500D01*
X17866Y213703D01*
X18941Y214422D01*
X23500D01*
Y210500D01*
X23500D01*
Y209500D01*
X23500D01*
Y196500D01*
X35500D01*
Y209500D01*
X35500D01*
Y210500D01*
X35500D01*
Y223500D01*
X23500D01*
Y222578D01*
X18941D01*
X17866Y223297D01*
X17078Y223454D01*
Y237182D01*
X18333Y238037D01*
X18906Y237800D01*
X21094D01*
X23115Y238637D01*
X24663Y240184D01*
X25500Y242206D01*
Y244394D01*
X24663Y246416D01*
X23115Y247963D01*
X21094Y248800D01*
X18906D01*
X16884Y247963D01*
X15770Y246848D01*
X14780Y247005D01*
X14542Y247724D01*
X14503Y248311D01*
X15201Y249009D01*
X16057Y250491D01*
X16500Y252144D01*
Y253856D01*
X16057Y255509D01*
X15201Y256991D01*
X13991Y258201D01*
X12509Y259057D01*
X10856Y259500D01*
X9144D01*
X7491Y259057D01*
X6009Y258201D01*
X4799Y256991D01*
X4198Y255950D01*
X4142Y255928D01*
X2858D01*
X2802Y255950D01*
X2201Y256991D01*
X991Y258201D01*
X-491Y259057D01*
X-2144Y259500D01*
X-3856D01*
X-5509Y259057D01*
X-6991Y258201D01*
X-8201Y256991D01*
X-9057Y255509D01*
X-9500Y253856D01*
Y252144D01*
X-9057Y250491D01*
X-8201Y249009D01*
X-7212Y248020D01*
X-7438Y247103D01*
X-7665Y246750D01*
X-11730D01*
Y238000D01*
Y229250D01*
X-2670D01*
X-2314Y226720D01*
Y223295D01*
X-3584Y222696D01*
X-4439Y223268D01*
X-6000Y223578D01*
X-6730D01*
Y216500D01*
Y209422D01*
X-6000D01*
X-4439Y209732D01*
X-3584Y210304D01*
X-2314Y209705D01*
Y208500D01*
X-2290Y208382D01*
X-2703Y206306D01*
X-3946Y204446D01*
X-4161Y204302D01*
X-5500Y204569D01*
X-10500D01*
X-11866Y204297D01*
X-13023Y203523D01*
X-13797Y202366D01*
X-14069Y201000D01*
Y199744D01*
X-15242Y199258D01*
X-36392Y220408D01*
Y256693D01*
X-35122Y256946D01*
X-34583Y255644D01*
X-33421Y254129D01*
X-31906Y252967D01*
X-30143Y252237D01*
X-29520Y252155D01*
Y264800D01*
X-28250D01*
D01*
X-29520D01*
Y277445D01*
X-30143Y277363D01*
X-31906Y276633D01*
X-33421Y275471D01*
X-34583Y273956D01*
X-35313Y272193D01*
X-35563Y270300D01*
Y265339D01*
X-36819Y265146D01*
X-38035Y266965D01*
X-42535Y271465D01*
X-44354Y272681D01*
X-46500Y273108D01*
X-51500D01*
Y273500D01*
X-64500D01*
Y273108D01*
X-73706D01*
X-74450Y273167D01*
X-75463Y273317D01*
X-76284Y273514D01*
X-76589Y273624D01*
X-76593Y273658D01*
X-77349Y275482D01*
X-78551Y277049D01*
X-80001Y278161D01*
X-79997Y278555D01*
X-79648Y279431D01*
X43683D01*
X44500Y278500D01*
D02*
G37*
G36*
X88800Y205900D02*
X87248Y205894D01*
X83292Y205596D01*
X82206Y205405D01*
X81237Y205168D01*
X80384Y204884D01*
X79648Y204555D01*
X79029Y204179D01*
X78526Y203758D01*
X76758Y205526D01*
X77179Y206028D01*
X77555Y206648D01*
X77884Y207384D01*
X78168Y208237D01*
X78405Y209206D01*
X78596Y210292D01*
X78741Y211494D01*
X78894Y214248D01*
X78900Y215800D01*
X88800Y205900D01*
D02*
G37*
G36*
X-78894Y214248D02*
X-78596Y210292D01*
X-78405Y209206D01*
X-78168Y208237D01*
X-77884Y207384D01*
X-77555Y206648D01*
X-77179Y206028D01*
X-76758Y205526D01*
X-78526Y203758D01*
X-79029Y204179D01*
X-79648Y204555D01*
X-80384Y204884D01*
X-81237Y205168D01*
X-82206Y205405D01*
X-83292Y205596D01*
X-84494Y205742D01*
X-87248Y205894D01*
X-88800Y205900D01*
X-78900Y215800D01*
X-78894Y214248D01*
D02*
G37*
G36*
X-42665Y190104D02*
X-42653Y189490D01*
X-42555Y188426D01*
X-42469Y187976D01*
X-42358Y187580D01*
X-42224Y187239D01*
X-42064Y186952D01*
X-41880Y186719D01*
X-41672Y186541D01*
X-41439Y186416D01*
X-46415Y188382D01*
X-46178Y188318D01*
X-45965Y188324D01*
X-45778Y188400D01*
X-45615Y188546D01*
X-45477Y188762D01*
X-45365Y189047D01*
X-45278Y189403D01*
X-45215Y189828D01*
X-45177Y190323D01*
X-45165Y190888D01*
X-42665Y190104D01*
D02*
G37*
G36*
X-52955Y181612D02*
X-52947Y181847D01*
X-53003Y182057D01*
X-53124Y182243D01*
X-53311Y182404D01*
X-53562Y182540D01*
X-53878Y182652D01*
X-54258Y182738D01*
X-54704Y182800D01*
X-55215Y182838D01*
X-55790Y182850D01*
X-55421Y185350D01*
X-54833Y185362D01*
X-53830Y185461D01*
X-53415Y185547D01*
X-53058Y185658D01*
X-52758Y185793D01*
X-52516Y185953D01*
X-52331Y186138D01*
X-52204Y186348D01*
X-52134Y186581D01*
X-52955Y181612D01*
D02*
G37*
G36*
X-78894Y188848D02*
X-78596Y184891D01*
X-78405Y183806D01*
X-78168Y182837D01*
X-77884Y181984D01*
X-77555Y181248D01*
X-77179Y180629D01*
X-76758Y180126D01*
X-78526Y178358D01*
X-79029Y178779D01*
X-79648Y179155D01*
X-80384Y179484D01*
X-81237Y179768D01*
X-82206Y180005D01*
X-83292Y180196D01*
X-84494Y180341D01*
X-87248Y180494D01*
X-88800Y180501D01*
X-78900Y190400D01*
X-78894Y188848D01*
D02*
G37*
G36*
X29016Y160525D02*
X29066Y160118D01*
X29148Y159720D01*
X29264Y159332D01*
X29413Y158954D01*
X29594Y158587D01*
X29808Y158229D01*
X30056Y157880D01*
X30336Y157542D01*
X30650Y157214D01*
X24350D01*
X24664Y157542D01*
X24944Y157880D01*
X25192Y158229D01*
X25406Y158587D01*
X25587Y158954D01*
X25736Y159332D01*
X25852Y159720D01*
X25934Y160118D01*
X25984Y160525D01*
X26000Y160943D01*
X29000D01*
X29016Y160525D01*
D02*
G37*
G36*
X76903Y244976D02*
X76588Y243800D01*
X88900D01*
Y238800D01*
X76588D01*
X77215Y236460D01*
X78865Y233600D01*
X81200Y231266D01*
X84060Y229615D01*
X85470Y229237D01*
Y227922D01*
X84075Y227548D01*
X81225Y225903D01*
X78898Y223575D01*
X77252Y220725D01*
X76400Y217546D01*
Y214254D01*
X76774Y212857D01*
X76709Y211672D01*
X76578Y210591D01*
X76409Y209625D01*
X76207Y208802D01*
X75981Y208124D01*
X75746Y207597D01*
X75517Y207219D01*
X75432Y207118D01*
X68657Y200343D01*
X67939Y199268D01*
X67686Y198000D01*
Y136373D01*
X37428Y106114D01*
X37342Y106050D01*
X37166Y105944D01*
X36966Y105847D01*
X36736Y105759D01*
X36473Y105683D01*
X36176Y105620D01*
X35842Y105574D01*
X35471Y105546D01*
X35011Y105539D01*
X34832Y105500D01*
X34144D01*
X32491Y105057D01*
X31009Y104201D01*
X30523Y103715D01*
X30369Y103616D01*
X30038Y103296D01*
X29756Y103053D01*
X29488Y102850D01*
X29233Y102684D01*
X28993Y102552D01*
X28769Y102451D01*
X28558Y102378D01*
X28359Y102329D01*
X28253Y102314D01*
X25747D01*
X25641Y102329D01*
X25442Y102378D01*
X25231Y102451D01*
X25007Y102552D01*
X24767Y102684D01*
X24513Y102850D01*
X24244Y103053D01*
X23962Y103296D01*
X23676Y103573D01*
X23630Y103623D01*
X23537Y104310D01*
X23601Y104959D01*
X23748Y105142D01*
X23874Y105267D01*
X26123Y105653D01*
X26187Y105678D01*
X27029Y105760D01*
X30422Y106790D01*
X33549Y108461D01*
X36290Y110710D01*
X38539Y113451D01*
X40210Y116578D01*
X40490Y117500D01*
X42000D01*
Y130500D01*
X41588D01*
Y133000D01*
X41750D01*
Y134922D01*
X49500D01*
Y134000D01*
X59500D01*
Y148000D01*
X49500D01*
Y143078D01*
X41750D01*
Y145000D01*
X38144D01*
X37750Y145078D01*
X37356Y145000D01*
X37074D01*
X36588Y146173D01*
X39343Y148928D01*
X40061Y150003D01*
X40314Y151271D01*
Y159611D01*
X40808Y159942D01*
X41554Y161058D01*
X41816Y162375D01*
Y167625D01*
X41554Y168942D01*
X41078Y169654D01*
Y172757D01*
X42077Y173500D01*
X46000D01*
Y174392D01*
X50422D01*
Y170000D01*
X49500D01*
Y156000D01*
X59500D01*
Y170000D01*
X58578D01*
Y175709D01*
X60629Y178208D01*
X62250Y181240D01*
X63247Y184529D01*
X63562Y187718D01*
X63608Y187950D01*
Y201682D01*
X63477Y202339D01*
X63459Y202477D01*
X63608Y203226D01*
Y227500D01*
X71500D01*
Y241369D01*
X75764Y245633D01*
X76903Y244976D01*
D02*
G37*
G36*
X-78894Y163448D02*
X-78596Y159492D01*
X-78405Y158406D01*
X-78168Y157437D01*
X-77884Y156584D01*
X-77555Y155848D01*
X-77179Y155229D01*
X-76758Y154726D01*
X-78526Y152958D01*
X-79029Y153379D01*
X-79648Y153755D01*
X-80384Y154084D01*
X-81237Y154368D01*
X-82206Y154605D01*
X-83292Y154796D01*
X-84494Y154942D01*
X-87248Y155094D01*
X-88800Y155100D01*
X-78900Y165000D01*
X-78894Y163448D01*
D02*
G37*
G36*
X-52665Y142812D02*
X-52696Y143047D01*
X-52787Y143257D01*
X-52938Y143443D01*
X-53151Y143604D01*
X-53423Y143740D01*
X-53757Y143852D01*
X-54151Y143939D01*
X-54606Y144000D01*
X-55122Y144038D01*
X-55698Y144050D01*
Y146550D01*
X-55122Y146562D01*
X-54151Y146661D01*
X-53757Y146748D01*
X-53423Y146860D01*
X-53151Y146996D01*
X-52938Y147157D01*
X-52787Y147343D01*
X-52696Y147553D01*
X-52665Y147788D01*
Y142812D01*
D02*
G37*
G36*
X-6178Y139518D02*
X-6010Y136997D01*
X-5957Y136782D01*
X-5898Y136626D01*
X-5831Y136528D01*
X-13531D01*
X-13465Y136626D01*
X-13405Y136782D01*
X-13353Y136997D01*
X-13307Y137271D01*
X-13237Y137994D01*
X-13195Y138951D01*
X-13181Y140143D01*
X-6181D01*
X-6178Y139518D01*
D02*
G37*
G36*
X88800Y129700D02*
X87248Y129694D01*
X83292Y129396D01*
X82206Y129205D01*
X81237Y128968D01*
X80384Y128684D01*
X79648Y128355D01*
X79029Y127979D01*
X78526Y127558D01*
X76758Y129326D01*
X77179Y129829D01*
X77555Y130448D01*
X77884Y131184D01*
X78168Y132037D01*
X78405Y133006D01*
X78596Y134092D01*
X78741Y135294D01*
X78894Y138048D01*
X78900Y139600D01*
X88800Y129700D01*
D02*
G37*
G36*
X-78894Y138048D02*
X-78596Y134092D01*
X-78405Y133006D01*
X-78168Y132037D01*
X-77884Y131184D01*
X-77555Y130448D01*
X-77179Y129829D01*
X-76758Y129326D01*
X-78526Y127558D01*
X-79029Y127979D01*
X-79648Y128355D01*
X-80384Y128684D01*
X-81237Y128968D01*
X-82206Y129205D01*
X-83292Y129396D01*
X-84494Y129542D01*
X-87248Y129694D01*
X-88800Y129700D01*
X-78900Y139600D01*
X-78894Y138048D01*
D02*
G37*
G36*
X-42538Y128665D02*
X-42732Y128553D01*
X-42849Y128405D01*
X-42891Y128221D01*
X-42855Y127999D01*
X-42743Y127741D01*
X-42555Y127447D01*
X-42290Y127115D01*
X-41949Y126747D01*
X-41532Y126343D01*
X-44715Y125886D01*
X-45141Y126266D01*
X-45955Y126887D01*
X-46342Y127130D01*
X-46715Y127326D01*
X-47076Y127477D01*
X-47423Y127582D01*
X-47757Y127641D01*
X-48078Y127655D01*
X-48385Y127623D01*
X-42268Y128739D01*
X-42538Y128665D01*
D02*
G37*
G36*
X-5898Y128574D02*
X-5957Y128418D01*
X-6010Y128203D01*
X-6055Y127929D01*
X-6125Y127206D01*
X-6167Y126249D01*
X-6181Y125057D01*
X-13181D01*
X-13185Y125682D01*
X-13353Y128203D01*
X-13405Y128418D01*
X-13465Y128574D01*
X-13531Y128672D01*
X-5831D01*
X-5898Y128574D01*
D02*
G37*
G36*
X-6178Y117918D02*
X-6010Y115397D01*
X-5957Y115182D01*
X-5898Y115026D01*
X-5831Y114928D01*
X-13531D01*
X-13465Y115026D01*
X-13405Y115182D01*
X-13353Y115397D01*
X-13307Y115671D01*
X-13237Y116394D01*
X-13195Y117351D01*
X-13181Y118543D01*
X-6181D01*
X-6178Y117918D01*
D02*
G37*
G36*
X-32998Y118444D02*
X-32676Y118223D01*
X-32329Y118030D01*
X-31957Y117867D01*
X-31561Y117732D01*
X-31141Y117627D01*
X-30695Y117550D01*
X-30225Y117503D01*
X-29731Y117485D01*
X-29211Y117495D01*
X-33498Y112878D01*
X-33526Y113397D01*
X-33581Y113889D01*
X-33663Y114354D01*
X-33773Y114792D01*
X-33909Y115204D01*
X-34072Y115589D01*
X-34263Y115948D01*
X-34480Y116279D01*
X-34725Y116585D01*
X-34997Y116863D01*
X-33296Y118695D01*
X-32998Y118444D01*
D02*
G37*
G36*
X23006Y114788D02*
X23130Y114711D01*
X23273Y114648D01*
X23434Y114599D01*
X23613Y114563D01*
X23810Y114541D01*
X24026Y114533D01*
X24259Y114539D01*
X24511Y114558D01*
X24782Y114592D01*
X25779Y107663D01*
X22956Y107179D01*
X22900Y114879D01*
X23006Y114788D01*
D02*
G37*
G36*
X-5898Y106974D02*
X-5957Y106818D01*
X-6010Y106603D01*
X-6055Y106329D01*
X-6125Y105606D01*
X-6167Y104649D01*
X-6181Y103457D01*
X-13181D01*
X-13185Y104082D01*
X-13353Y106603D01*
X-13405Y106818D01*
X-13465Y106974D01*
X-13531Y107072D01*
X-5831D01*
X-5898Y106974D01*
D02*
G37*
G36*
X88800Y104300D02*
X87248Y104294D01*
X83292Y103996D01*
X82206Y103805D01*
X81237Y103568D01*
X80384Y103284D01*
X79648Y102955D01*
X79029Y102579D01*
X78526Y102158D01*
X76758Y103926D01*
X77179Y104429D01*
X77555Y105048D01*
X77884Y105784D01*
X78168Y106637D01*
X78405Y107606D01*
X78596Y108692D01*
X78741Y109894D01*
X78894Y112648D01*
X78900Y114200D01*
X88800Y104300D01*
D02*
G37*
G36*
X-78894Y112648D02*
X-78596Y108692D01*
X-78405Y107606D01*
X-78168Y106637D01*
X-77884Y105784D01*
X-77555Y105048D01*
X-77179Y104429D01*
X-76758Y103926D01*
X-78526Y102158D01*
X-79029Y102579D01*
X-79648Y102955D01*
X-80384Y103284D01*
X-81237Y103568D01*
X-82206Y103805D01*
X-83292Y103996D01*
X-84494Y104142D01*
X-87248Y104294D01*
X-88800Y104300D01*
X-78900Y114200D01*
X-78894Y112648D01*
D02*
G37*
G36*
X40850Y103082D02*
X40588Y102794D01*
X40355Y102480D01*
X40150Y102141D01*
X39973Y101775D01*
X39824Y101384D01*
X39703Y100968D01*
X39610Y100526D01*
X39545Y100058D01*
X39509Y99564D01*
X39500Y99045D01*
X35045Y103500D01*
X35564Y103509D01*
X36058Y103545D01*
X36526Y103610D01*
X36968Y103703D01*
X37385Y103824D01*
X37775Y103973D01*
X38140Y104150D01*
X38480Y104355D01*
X38794Y104588D01*
X39082Y104850D01*
X40850Y103082D01*
D02*
G37*
G36*
X31786Y95850D02*
X31413Y96211D01*
X31038Y96534D01*
X30661Y96819D01*
X30283Y97066D01*
X29903Y97275D01*
X29521Y97446D01*
X29138Y97579D01*
X28753Y97674D01*
X28366Y97731D01*
X27977Y97750D01*
Y100250D01*
X28366Y100269D01*
X28753Y100326D01*
X29138Y100421D01*
X29521Y100554D01*
X29903Y100725D01*
X30283Y100934D01*
X30661Y101181D01*
X31038Y101466D01*
X31413Y101789D01*
X31786Y102150D01*
Y95850D01*
D02*
G37*
G36*
X22587Y101789D02*
X22962Y101466D01*
X23339Y101181D01*
X23717Y100934D01*
X24097Y100725D01*
X24479Y100554D01*
X24862Y100421D01*
X25247Y100326D01*
X25634Y100269D01*
X26023Y100250D01*
Y97750D01*
X25634Y97731D01*
X25247Y97674D01*
X24862Y97579D01*
X24479Y97446D01*
X24097Y97275D01*
X23717Y97066D01*
X23339Y96819D01*
X22962Y96534D01*
X22587Y96211D01*
X22214Y95850D01*
Y102150D01*
X22587Y101789D01*
D02*
G37*
G36*
X88800Y78900D02*
X87248Y78894D01*
X83292Y78596D01*
X82206Y78405D01*
X81237Y78168D01*
X80384Y77884D01*
X79648Y77555D01*
X79029Y77179D01*
X78526Y76758D01*
X76758Y78526D01*
X77179Y79029D01*
X77555Y79648D01*
X77884Y80384D01*
X78168Y81237D01*
X78405Y82206D01*
X78596Y83292D01*
X78741Y84494D01*
X78894Y87248D01*
X78900Y88800D01*
X88800Y78900D01*
D02*
G37*
G36*
X-78894Y87248D02*
X-78596Y83292D01*
X-78405Y82206D01*
X-78168Y81237D01*
X-77884Y80384D01*
X-77555Y79648D01*
X-77179Y79029D01*
X-76758Y78526D01*
X-78526Y76758D01*
X-79029Y77179D01*
X-79648Y77555D01*
X-80384Y77884D01*
X-81237Y78168D01*
X-82206Y78405D01*
X-83292Y78596D01*
X-84494Y78741D01*
X-87248Y78894D01*
X-88800Y78900D01*
X-78900Y88800D01*
X-78894Y87248D01*
D02*
G37*
G36*
X-2783Y104982D02*
X-2564Y104648D01*
Y102238D01*
X-2590D01*
X-2231Y98595D01*
X-1169Y95091D01*
X557Y91863D01*
X2880Y89033D01*
X2879Y89033D01*
X3796Y88154D01*
X5486Y86464D01*
X5476Y86453D01*
X7950Y84423D01*
X10772Y82914D01*
X13835Y81985D01*
X17020Y81671D01*
Y81686D01*
X26000D01*
X26150Y81716D01*
X28450Y81259D01*
X30400Y79956D01*
X30485Y79829D01*
X31657Y78657D01*
X31657Y78657D01*
X31654Y78654D01*
X32754Y77220D01*
X33446Y75550D01*
X33682Y73757D01*
X33686D01*
Y70223D01*
X32416Y69533D01*
X31509Y70057D01*
X29856Y70500D01*
X28144D01*
X26491Y70057D01*
X25770Y69641D01*
X24500Y70374D01*
Y70730D01*
X19770D01*
Y67496D01*
X19816Y67118D01*
X19899Y66720D01*
X20014Y66332D01*
X20162Y65955D01*
X20344Y65587D01*
X20396Y65500D01*
X22006D01*
X22500Y64856D01*
Y63144D01*
X22943Y61491D01*
X23799Y60009D01*
X24285Y59523D01*
X24384Y59369D01*
X24704Y59038D01*
X24947Y58756D01*
X25150Y58488D01*
X25316Y58233D01*
X25448Y57993D01*
X25549Y57769D01*
X25622Y57558D01*
X25671Y57359D01*
X25686Y57253D01*
Y55121D01*
X22048Y51483D01*
X21520Y51543D01*
X14687Y44710D01*
X12891Y46506D01*
X19124Y52740D01*
X19043Y52794D01*
X17705Y53060D01*
X17439Y54399D01*
X16666Y55556D01*
X15508Y56330D01*
X14142Y56602D01*
X12776Y56330D01*
X11619Y55556D01*
X11276Y55213D01*
X6088Y60401D01*
Y65500D01*
X7500D01*
Y78500D01*
X2931D01*
X-4073Y85504D01*
Y105005D01*
X-3834Y105312D01*
X-2783Y104982D01*
D02*
G37*
G36*
X-13794Y68589D02*
X-13480Y68355D01*
X-13140Y68150D01*
X-12775Y67973D01*
X-12385Y67824D01*
X-11968Y67703D01*
X-11526Y67610D01*
X-11058Y67545D01*
X-10564Y67509D01*
X-10045Y67500D01*
X-14500Y63045D01*
X-14509Y63564D01*
X-14545Y64058D01*
X-14610Y64526D01*
X-14703Y64968D01*
X-14824Y65384D01*
X-14973Y65775D01*
X-15150Y66140D01*
X-15355Y66480D01*
X-15589Y66794D01*
X-15850Y67082D01*
X-14082Y68850D01*
X-13794Y68589D01*
D02*
G37*
G36*
X31789Y60413D02*
X31466Y60038D01*
X31181Y59661D01*
X30934Y59283D01*
X30725Y58903D01*
X30554Y58521D01*
X30421Y58138D01*
X30326Y57752D01*
X30269Y57366D01*
X30250Y56977D01*
X27750D01*
X27731Y57366D01*
X27674Y57752D01*
X27579Y58138D01*
X27446Y58521D01*
X27275Y58903D01*
X27066Y59283D01*
X26819Y59661D01*
X26534Y60038D01*
X26211Y60413D01*
X25850Y60786D01*
X32150D01*
X31789Y60413D01*
D02*
G37*
G36*
X88800Y53500D02*
X87248Y53494D01*
X83292Y53196D01*
X82206Y53005D01*
X81237Y52768D01*
X80384Y52484D01*
X79648Y52155D01*
X79029Y51779D01*
X78526Y51358D01*
X76758Y53126D01*
X77179Y53629D01*
X77555Y54248D01*
X77884Y54984D01*
X78168Y55837D01*
X78405Y56806D01*
X78596Y57892D01*
X78741Y59094D01*
X78894Y61848D01*
X78900Y63400D01*
X88800Y53500D01*
D02*
G37*
G36*
X-78894Y61848D02*
X-78596Y57892D01*
X-78405Y56806D01*
X-78168Y55837D01*
X-77884Y54984D01*
X-77555Y54248D01*
X-77179Y53629D01*
X-76758Y53126D01*
X-78526Y51358D01*
X-79029Y51779D01*
X-79648Y52155D01*
X-80384Y52484D01*
X-81237Y52768D01*
X-82206Y53005D01*
X-83292Y53196D01*
X-84494Y53341D01*
X-87248Y53494D01*
X-88800Y53500D01*
X-78900Y63400D01*
X-78894Y61848D01*
D02*
G37*
G36*
X81759Y31100D02*
X80656Y32192D01*
X77648Y34780D01*
X76746Y35412D01*
X75892Y35930D01*
X75089Y36332D01*
X74336Y36620D01*
X73632Y36793D01*
X72978Y36850D01*
Y39350D01*
X73632Y39407D01*
X74336Y39580D01*
X75089Y39867D01*
X75892Y40270D01*
X76746Y40788D01*
X77648Y41420D01*
X78601Y42168D01*
X80656Y44008D01*
X81759Y45100D01*
Y31100D01*
D02*
G37*
G36*
X-80656Y44008D02*
X-77648Y41420D01*
X-76746Y40788D01*
X-75892Y40270D01*
X-75089Y39867D01*
X-74336Y39580D01*
X-73632Y39407D01*
X-72978Y39350D01*
Y36850D01*
X-73632Y36793D01*
X-74336Y36620D01*
X-75089Y36332D01*
X-75892Y35930D01*
X-76746Y35412D01*
X-77648Y34780D01*
X-78601Y34032D01*
X-80656Y32192D01*
X-81759Y31100D01*
Y45100D01*
X-80656Y44008D01*
D02*
G37*
G36*
X1789Y16413D02*
X1466Y16038D01*
X1181Y15661D01*
X934Y15283D01*
X725Y14903D01*
X554Y14521D01*
X421Y14138D01*
X326Y13752D01*
X269Y13366D01*
X250Y12977D01*
X-2250D01*
X-2269Y13366D01*
X-2326Y13752D01*
X-2421Y14138D01*
X-2554Y14521D01*
X-2725Y14903D01*
X-2934Y15283D01*
X-3181Y15661D01*
X-3466Y16038D01*
X-3789Y16413D01*
X-4150Y16786D01*
X2150D01*
X1789Y16413D01*
D02*
G37*
G36*
X-49033Y22916D02*
X-49259Y22579D01*
X-49525Y21241D01*
X-50863Y20975D01*
X-50944Y20920D01*
X-44710Y14687D01*
X-46506Y12891D01*
X-52740Y19124D01*
X-52794Y19043D01*
X-53060Y17705D01*
X-54399Y17439D01*
X-55556Y16666D01*
X-56330Y15508D01*
X-56602Y14142D01*
X-56330Y12776D01*
X-55556Y11619D01*
X-53708Y9770D01*
X-53768Y9254D01*
X-54154Y8420D01*
X-55509Y8057D01*
X-56991Y7201D01*
X-58201Y5991D01*
X-59057Y4509D01*
X-59500Y2856D01*
Y1144D01*
X-59057Y-509D01*
X-58201Y-1991D01*
X-56991Y-3201D01*
X-55509Y-4057D01*
X-53856Y-4500D01*
X-52144D01*
X-50491Y-4057D01*
X-49009Y-3201D01*
X-47799Y-1991D01*
X-46943Y-509D01*
X-46580Y846D01*
X-45746Y1232D01*
X-45230Y1293D01*
X-35503Y-8435D01*
X-34345Y-9208D01*
X-32980Y-9480D01*
X-25194D01*
X-24778Y-10692D01*
Y-20175D01*
X-26048Y-20854D01*
X-26212Y-20745D01*
X-27550Y-20478D01*
X-27816Y-19140D01*
X-28589Y-17983D01*
X-29747Y-17209D01*
X-31085Y-16943D01*
X-31351Y-15605D01*
X-32125Y-14447D01*
X-33283Y-13674D01*
X-34621Y-13407D01*
X-34887Y-12069D01*
X-35660Y-10912D01*
X-36818Y-10138D01*
X-38156Y-9872D01*
X-38422Y-8534D01*
X-39196Y-7376D01*
X-40354Y-6603D01*
X-41396Y-6395D01*
X-41390Y-6364D01*
X-41604Y-5291D01*
X-42211Y-4381D01*
X-43272Y-3321D01*
X-44182Y-2713D01*
X-45255Y-2499D01*
X-46328Y-2713D01*
X-47238Y-3321D01*
X-51605Y-7688D01*
X-51667Y-7730D01*
X-54511Y-10574D01*
X-55457D01*
X-55551Y-10562D01*
X-55780Y-10515D01*
X-56001Y-10448D01*
X-56219Y-10363D01*
X-56435Y-10256D01*
X-56653Y-10125D01*
X-56875Y-9968D01*
X-57099Y-9782D01*
X-57376Y-9517D01*
X-57525Y-9422D01*
X-58009Y-8939D01*
X-59491Y-8083D01*
X-61144Y-7640D01*
X-62856D01*
X-64509Y-8083D01*
X-65991Y-8939D01*
X-67201Y-10149D01*
X-68057Y-11631D01*
X-68500Y-13284D01*
Y-14996D01*
X-68057Y-16649D01*
X-67201Y-18131D01*
X-65991Y-19341D01*
X-64509Y-20197D01*
X-62856Y-20640D01*
X-61144D01*
X-59491Y-20197D01*
X-58009Y-19341D01*
X-57529Y-18862D01*
X-57380Y-18767D01*
X-57162Y-18559D01*
X-56739Y-18638D01*
X-56323Y-19772D01*
X-56327Y-19821D01*
X-75090Y-38584D01*
X-76360Y-38058D01*
Y-36449D01*
X-77215Y-33260D01*
X-78865Y-30400D01*
X-81200Y-28066D01*
X-84060Y-26415D01*
X-85470Y-26037D01*
Y-24722D01*
X-84075Y-24348D01*
X-81225Y-22703D01*
X-78898Y-20375D01*
X-77252Y-17525D01*
X-76400Y-14346D01*
Y-11054D01*
X-76774Y-9657D01*
X-76709Y-8472D01*
X-76578Y-7391D01*
X-76409Y-6425D01*
X-76207Y-5602D01*
X-75981Y-4924D01*
X-75746Y-4397D01*
X-75517Y-4019D01*
X-75432Y-3918D01*
X-68657Y2857D01*
X-67939Y3932D01*
X-67686Y5200D01*
Y19653D01*
X-63153Y24186D01*
X-49712D01*
X-49033Y22916D01*
D02*
G37*
G36*
X79029Y24421D02*
X79648Y24045D01*
X80384Y23716D01*
X81237Y23432D01*
X82206Y23195D01*
X83292Y23004D01*
X84494Y22859D01*
X87248Y22706D01*
X88800Y22699D01*
X78900Y12800D01*
X78894Y14352D01*
X78596Y18309D01*
X78405Y19394D01*
X78168Y20363D01*
X77884Y21216D01*
X77555Y21952D01*
X77179Y22571D01*
X76758Y23074D01*
X78526Y24842D01*
X79029Y24421D01*
D02*
G37*
G36*
X-76758Y23074D02*
X-77179Y22571D01*
X-77555Y21952D01*
X-77884Y21216D01*
X-78168Y20363D01*
X-78405Y19394D01*
X-78596Y18309D01*
X-78741Y17106D01*
X-78894Y14352D01*
X-78900Y12800D01*
X-88800Y22699D01*
X-87248Y22706D01*
X-83292Y23004D01*
X-82206Y23195D01*
X-81237Y23432D01*
X-80384Y23716D01*
X-79648Y24045D01*
X-79029Y24421D01*
X-78526Y24842D01*
X-76758Y23074D01*
D02*
G37*
G36*
X-47030Y5849D02*
X-47314Y5542D01*
X-47567Y5219D01*
X-47790Y4879D01*
X-47982Y4523D01*
X-48144Y4151D01*
X-48276Y3762D01*
X-48378Y3358D01*
X-48449Y2936D01*
X-48490Y2499D01*
X-48500Y2045D01*
X-52955Y6500D01*
X-52501Y6510D01*
X-52063Y6551D01*
X-51642Y6622D01*
X-51238Y6724D01*
X-50849Y6856D01*
X-50477Y7018D01*
X-50121Y7210D01*
X-49781Y7433D01*
X-49458Y7686D01*
X-49152Y7970D01*
X-47030Y5849D01*
D02*
G37*
G36*
X-35775Y6101D02*
X-35453Y5849D01*
X-35140Y5655D01*
X-34836Y5518D01*
X-34542Y5437D01*
X-34257Y5414D01*
X-33981Y5447D01*
X-33715Y5537D01*
X-33458Y5683D01*
X-33210Y5887D01*
X-33787Y47D01*
X-37571Y3630D01*
X-36107Y6408D01*
X-35775Y6101D01*
D02*
G37*
G36*
X1050Y-4499D02*
X1091Y-4936D01*
X1162Y-5358D01*
X1264Y-5763D01*
X1396Y-6151D01*
X1558Y-6523D01*
X1750Y-6879D01*
X1973Y-7219D01*
X2226Y-7542D01*
X2510Y-7849D01*
X388Y-9970D01*
X82Y-9686D01*
X-242Y-9433D01*
X-581Y-9210D01*
X-937Y-9018D01*
X-1309Y-8856D01*
X-1698Y-8724D01*
X-2102Y-8622D01*
X-2524Y-8551D01*
X-2961Y-8510D01*
X-3415Y-8500D01*
X1040Y-4045D01*
X1050Y-4499D01*
D02*
G37*
G36*
X30354Y-12391D02*
X30041Y-12718D01*
X29495Y-13378D01*
X29263Y-13709D01*
X29058Y-14042D01*
X28881Y-14376D01*
X28730Y-14712D01*
X28607Y-15049D01*
X28510Y-15387D01*
X28441Y-15726D01*
X25559Y-10779D01*
X25874Y-10876D01*
X26185Y-10932D01*
X26493Y-10948D01*
X26799Y-10925D01*
X27100Y-10861D01*
X27399Y-10757D01*
X27695Y-10613D01*
X27987Y-10428D01*
X28277Y-10204D01*
X28563Y-9939D01*
X30354Y-12391D01*
D02*
G37*
G36*
X79029Y-979D02*
X79648Y-1355D01*
X80384Y-1684D01*
X81237Y-1968D01*
X82206Y-2205D01*
X83292Y-2396D01*
X84494Y-2542D01*
X87248Y-2694D01*
X88800Y-2700D01*
X78900Y-12600D01*
X78894Y-11048D01*
X78596Y-7092D01*
X78405Y-6006D01*
X78168Y-5037D01*
X77884Y-4184D01*
X77555Y-3448D01*
X77179Y-2828D01*
X76758Y-2326D01*
X78526Y-558D01*
X79029Y-979D01*
D02*
G37*
G36*
X-76758Y-2326D02*
X-77179Y-2828D01*
X-77555Y-3448D01*
X-77884Y-4184D01*
X-78168Y-5037D01*
X-78405Y-6006D01*
X-78596Y-7092D01*
X-78741Y-8294D01*
X-78894Y-11048D01*
X-78900Y-12600D01*
X-88800Y-2700D01*
X-87248Y-2694D01*
X-83292Y-2396D01*
X-82206Y-2205D01*
X-81237Y-1968D01*
X-80384Y-1684D01*
X-79648Y-1355D01*
X-79029Y-979D01*
X-78526Y-558D01*
X-76758Y-2326D01*
D02*
G37*
G36*
X35099Y-1255D02*
X37831Y-3890D01*
X37797Y-3953D01*
X39494Y-5650D01*
X39473Y-5858D01*
X46506Y-12891D01*
X44710Y-14687D01*
X38378Y-8355D01*
X38293Y-8453D01*
X37427Y-7912D01*
X37114Y-7703D01*
X35749Y-7431D01*
X29624D01*
X28258Y-7703D01*
X27410Y-8270D01*
X27360Y-8293D01*
X27335Y-8320D01*
X27100Y-8477D01*
X26837Y-8740D01*
X26816Y-8756D01*
X26702Y-8828D01*
X26614Y-8871D01*
X26552Y-8892D01*
X26507Y-8902D01*
X26468Y-8905D01*
X26423Y-8903D01*
X26357Y-8891D01*
X26159Y-8830D01*
X26117Y-8825D01*
X26080Y-8807D01*
X25978Y-8801D01*
X24856Y-8500D01*
X23144D01*
X21491Y-8943D01*
X20009Y-9799D01*
X19527Y-10280D01*
X19378Y-10375D01*
X19101Y-10639D01*
X18877Y-10826D01*
X18655Y-10983D01*
X18436Y-11114D01*
X18220Y-11221D01*
X18003Y-11306D01*
X17781Y-11372D01*
X17552Y-11420D01*
X17457Y-11431D01*
X9018D01*
X3690Y-6103D01*
X3631Y-6028D01*
X3503Y-5833D01*
X3392Y-5629D01*
X3299Y-5415D01*
X3221Y-5186D01*
X3160Y-4939D01*
X3114Y-4671D01*
X3087Y-4380D01*
X3078Y-3998D01*
X3040Y-3825D01*
Y-3144D01*
X2597Y-1491D01*
X1741Y-9D01*
X531Y1201D01*
X-951Y2057D01*
X-2604Y2500D01*
X-3018D01*
X-3544Y3770D01*
X1343Y8657D01*
X2061Y9732D01*
X2314Y11000D01*
Y13253D01*
X2329Y13359D01*
X2378Y13558D01*
X2451Y13769D01*
X2552Y13993D01*
X2684Y14233D01*
X2850Y14487D01*
X3053Y14756D01*
X3296Y15038D01*
X3616Y15369D01*
X3715Y15523D01*
X4201Y16009D01*
X5057Y17491D01*
X5500Y19144D01*
Y20856D01*
X5057Y22509D01*
X4201Y23991D01*
X2991Y25201D01*
X1509Y26057D01*
X-144Y26500D01*
X-1856D01*
X-3509Y26057D01*
X-4991Y25201D01*
X-5001Y25191D01*
X-6271Y25717D01*
Y27573D01*
X0Y33844D01*
X35099Y-1255D01*
D02*
G37*
G36*
X-58457Y-11305D02*
X-58119Y-11586D01*
X-57770Y-11833D01*
X-57413Y-12048D01*
X-57045Y-12229D01*
X-56667Y-12378D01*
X-56279Y-12494D01*
X-55882Y-12576D01*
X-55474Y-12626D01*
X-55057Y-12642D01*
X-55058Y-15642D01*
X-55476Y-15659D01*
X-55883Y-15708D01*
X-56281Y-15791D01*
X-56668Y-15906D01*
X-57046Y-16055D01*
X-57414Y-16236D01*
X-57772Y-16450D01*
X-58121Y-16698D01*
X-58459Y-16978D01*
X-58788Y-17292D01*
X-58785Y-10991D01*
X-58457Y-11305D01*
D02*
G37*
G36*
X20786Y-18150D02*
X20458Y-17837D01*
X20120Y-17556D01*
X19771Y-17308D01*
X19413Y-17094D01*
X19045Y-16912D01*
X18668Y-16764D01*
X18280Y-16648D01*
X17882Y-16566D01*
X17475Y-16516D01*
X17057Y-16500D01*
Y-13500D01*
X17475Y-13484D01*
X17882Y-13434D01*
X18280Y-13352D01*
X18668Y-13236D01*
X19045Y-13088D01*
X19413Y-12906D01*
X19771Y-12692D01*
X20120Y-12444D01*
X20458Y-12163D01*
X20786Y-11850D01*
Y-18150D01*
D02*
G37*
G36*
X77034Y-16713D02*
X77252Y-17525D01*
X78898Y-20375D01*
X81225Y-22703D01*
X84075Y-24348D01*
X85470Y-24722D01*
Y-26037D01*
X84060Y-26415D01*
X81200Y-28066D01*
X78865Y-30400D01*
X77215Y-33260D01*
X76588Y-35600D01*
X88900D01*
Y-40600D01*
X76588D01*
X77215Y-42940D01*
X78865Y-45800D01*
X81200Y-48134D01*
X84060Y-49785D01*
X85084Y-50060D01*
X84882Y-51321D01*
X84672Y-51309D01*
X83591Y-51178D01*
X82626Y-51009D01*
X81802Y-50807D01*
X81124Y-50581D01*
X80597Y-50346D01*
X80219Y-50117D01*
X80118Y-50032D01*
X68743Y-38657D01*
X67668Y-37939D01*
X66400Y-37686D01*
X60050D01*
X57278Y-34914D01*
X59688Y-32505D01*
X55092Y-27908D01*
X55990Y-27011D01*
X55092Y-26112D01*
X59334Y-21870D01*
X56445Y-18981D01*
X56971Y-17711D01*
X62246D01*
X68364Y-23828D01*
X75808Y-16385D01*
X77034Y-16713D01*
D02*
G37*
G36*
X-12616Y-27484D02*
X-13075Y-27536D01*
X-13517Y-27614D01*
X-13941Y-27718D01*
X-14348Y-27846D01*
X-14737Y-28000D01*
X-15109Y-28179D01*
X-15463Y-28383D01*
X-15799Y-28613D01*
X-16119Y-28868D01*
X-16420Y-29148D01*
X-18757Y-27242D01*
X-18471Y-26931D01*
X-18219Y-26605D01*
X-18003Y-26265D01*
X-17822Y-25910D01*
X-17677Y-25540D01*
X-17566Y-25156D01*
X-17490Y-24757D01*
X-17450Y-24344D01*
X-17445Y-23916D01*
X-17475Y-23474D01*
X-12616Y-27484D01*
D02*
G37*
G36*
X-8214Y-35150D02*
X-8542Y-34836D01*
X-8880Y-34556D01*
X-9229Y-34309D01*
X-9587Y-34094D01*
X-9955Y-33912D01*
X-10332Y-33764D01*
X-10720Y-33649D01*
X-11118Y-33566D01*
X-11525Y-33516D01*
X-11943Y-33500D01*
Y-30500D01*
X-11525Y-30484D01*
X-11118Y-30434D01*
X-10720Y-30352D01*
X-10332Y-30236D01*
X-9955Y-30087D01*
X-9587Y-29906D01*
X-9229Y-29692D01*
X-8880Y-29444D01*
X-8542Y-29163D01*
X-8214Y-28850D01*
Y-35150D01*
D02*
G37*
G36*
X-23497Y-35900D02*
X-29731Y-42134D01*
X-29650Y-42188D01*
X-28312Y-42454D01*
X-28046Y-43792D01*
X-27272Y-44950D01*
X-26919Y-45186D01*
X-26734Y-46796D01*
X-30343Y-50406D01*
X-31061Y-51481D01*
X-31314Y-52749D01*
Y-66518D01*
X-31061Y-67786D01*
X-30343Y-68861D01*
X-26314Y-72890D01*
Y-162627D01*
X-50873Y-187186D01*
X-73167D01*
X-73298Y-187175D01*
X-73727Y-187070D01*
X-74267Y-186864D01*
X-74905Y-186544D01*
X-75631Y-186104D01*
X-76395Y-185568D01*
X-78220Y-183999D01*
X-78898Y-182825D01*
X-81225Y-180497D01*
X-84075Y-178852D01*
X-85547Y-178457D01*
Y-177143D01*
X-84075Y-176748D01*
X-81225Y-175103D01*
X-78898Y-172775D01*
X-78174Y-171522D01*
X-77290Y-170731D01*
X-76433Y-170058D01*
X-75631Y-169496D01*
X-74905Y-169056D01*
X-74267Y-168736D01*
X-73727Y-168530D01*
X-73298Y-168425D01*
X-73167Y-168414D01*
X-56398D01*
X-55130Y-168161D01*
X-54055Y-167443D01*
X-44907Y-158295D01*
X-44189Y-157220D01*
X-44045Y-156500D01*
X-38500D01*
Y-143500D01*
X-41186D01*
Y-142000D01*
X-37250D01*
Y-128686D01*
X-32657Y-124093D01*
X-31939Y-123018D01*
X-31686Y-121750D01*
Y-80000D01*
X-31939Y-78732D01*
X-32657Y-77657D01*
X-40686Y-69627D01*
Y-41837D01*
X-36190Y-37341D01*
X-34579Y-37526D01*
X-34343Y-37879D01*
X-33185Y-38652D01*
X-31847Y-38918D01*
X-31581Y-40257D01*
X-31527Y-40338D01*
X-25293Y-34104D01*
X-23497Y-35900D01*
D02*
G37*
G36*
X-76182Y-53950D02*
X-76570Y-54415D01*
X-76933Y-55009D01*
X-77272Y-55731D01*
X-77585Y-56582D01*
X-77873Y-57562D01*
X-78137Y-58670D01*
X-78588Y-61273D01*
X-78940Y-64390D01*
X-87811Y-53559D01*
X-86334Y-53695D01*
X-83696Y-53772D01*
X-82535Y-53713D01*
X-81478Y-53590D01*
X-80527Y-53402D01*
X-79681Y-53150D01*
X-78940Y-52833D01*
X-78304Y-52451D01*
X-77773Y-52005D01*
X-76182Y-53950D01*
D02*
G37*
G36*
X79029Y-51779D02*
X79648Y-52155D01*
X80384Y-52484D01*
X81237Y-52768D01*
X82206Y-53005D01*
X83292Y-53196D01*
X84494Y-53341D01*
X87248Y-53494D01*
X88800Y-53500D01*
X78900Y-63400D01*
X78894Y-61848D01*
X78596Y-57892D01*
X78405Y-56806D01*
X78168Y-55837D01*
X77884Y-54984D01*
X77555Y-54248D01*
X77179Y-53629D01*
X76758Y-53126D01*
X78526Y-51358D01*
X79029Y-51779D01*
D02*
G37*
G36*
Y-77179D02*
X79648Y-77555D01*
X80384Y-77884D01*
X81237Y-78168D01*
X82206Y-78405D01*
X83292Y-78596D01*
X84494Y-78741D01*
X87248Y-78894D01*
X88800Y-78900D01*
X78900Y-88800D01*
X78894Y-87248D01*
X78596Y-83292D01*
X78405Y-82206D01*
X78168Y-81237D01*
X77884Y-80384D01*
X77555Y-79648D01*
X77179Y-79029D01*
X76758Y-78526D01*
X78526Y-76758D01*
X79029Y-77179D01*
D02*
G37*
G36*
X-76758Y-78526D02*
X-77179Y-79029D01*
X-77555Y-79648D01*
X-77884Y-80384D01*
X-78168Y-81237D01*
X-78405Y-82206D01*
X-78596Y-83292D01*
X-78741Y-84494D01*
X-78894Y-87248D01*
X-78900Y-88800D01*
X-88800Y-78900D01*
X-87248Y-78894D01*
X-83292Y-78596D01*
X-82206Y-78405D01*
X-81237Y-78168D01*
X-80384Y-77884D01*
X-79648Y-77555D01*
X-79029Y-77179D01*
X-78526Y-76758D01*
X-76758Y-78526D01*
D02*
G37*
G36*
X-47314Y-44431D02*
Y-71000D01*
X-47061Y-72268D01*
X-46343Y-73343D01*
X-38314Y-81373D01*
Y-87500D01*
X-42230D01*
Y-94000D01*
Y-100500D01*
X-38314D01*
Y-102000D01*
X-43730D01*
Y-111000D01*
X-46270D01*
Y-102000D01*
X-52750D01*
Y-102000D01*
X-53250D01*
Y-102000D01*
X-57186D01*
Y-100500D01*
X-54500D01*
Y-87500D01*
X-56611D01*
X-56655Y-86230D01*
X-49692Y-79267D01*
X-48973Y-78192D01*
X-48721Y-76924D01*
Y-43844D01*
X-48584Y-43752D01*
X-47314Y-44431D01*
D02*
G37*
G36*
X79029Y-102579D02*
X79648Y-102955D01*
X80384Y-103284D01*
X81237Y-103568D01*
X82206Y-103805D01*
X83292Y-103996D01*
X84494Y-104142D01*
X87248Y-104294D01*
X88800Y-104300D01*
X78900Y-114200D01*
X78894Y-112648D01*
X78596Y-108692D01*
X78405Y-107606D01*
X78168Y-106637D01*
X77884Y-105784D01*
X77555Y-105048D01*
X77179Y-104429D01*
X76758Y-103926D01*
X78526Y-102158D01*
X79029Y-102579D01*
D02*
G37*
G36*
X-76758Y-103926D02*
X-77179Y-104429D01*
X-77555Y-105048D01*
X-77884Y-105784D01*
X-78168Y-106637D01*
X-78405Y-107606D01*
X-78596Y-108692D01*
X-78741Y-109894D01*
X-78894Y-112648D01*
X-78900Y-114200D01*
X-88800Y-104300D01*
X-87248Y-104294D01*
X-83292Y-103996D01*
X-82206Y-103805D01*
X-81237Y-103568D01*
X-80384Y-103284D01*
X-79648Y-102955D01*
X-79029Y-102579D01*
X-78526Y-102158D01*
X-76758Y-103926D01*
D02*
G37*
G36*
X11619Y-55556D02*
X12705Y-56282D01*
X19325Y-62902D01*
Y-200438D01*
X19577Y-201706D01*
X20295Y-202781D01*
X75432Y-257918D01*
X75517Y-258019D01*
X75746Y-258397D01*
X75981Y-258924D01*
X76207Y-259602D01*
X76409Y-260425D01*
X76571Y-261345D01*
X76751Y-263745D01*
X76400Y-265054D01*
Y-268346D01*
X77252Y-271525D01*
X78898Y-274375D01*
X81225Y-276702D01*
X83752Y-278161D01*
X83411Y-279431D01*
X-83331D01*
X-83672Y-278161D01*
X-81200Y-276735D01*
X-78865Y-274400D01*
X-77215Y-271540D01*
X-76588Y-269200D01*
X-88900D01*
Y-264200D01*
X-76588D01*
X-77215Y-261860D01*
X-78865Y-259000D01*
X-81200Y-256665D01*
X-84060Y-255015D01*
X-85470Y-254637D01*
Y-253322D01*
X-84075Y-252948D01*
X-81225Y-251303D01*
X-78898Y-248975D01*
X-78174Y-247722D01*
X-77290Y-246931D01*
X-76433Y-246258D01*
X-75631Y-245696D01*
X-74905Y-245256D01*
X-74267Y-244936D01*
X-73727Y-244730D01*
X-73298Y-244625D01*
X-73167Y-244614D01*
X-71300D01*
X-70032Y-244361D01*
X-68957Y-243643D01*
X-4974Y-179660D01*
X-4584Y-179076D01*
X-3314Y-179461D01*
Y-190627D01*
X-13343Y-200657D01*
X-14061Y-201732D01*
X-14314Y-203000D01*
Y-208500D01*
X-17500D01*
Y-208500D01*
X-18500D01*
Y-208500D01*
X-31500D01*
Y-220500D01*
X-18500D01*
Y-220500D01*
X-17500D01*
Y-220500D01*
X-4500D01*
Y-208500D01*
X-7686D01*
Y-204373D01*
X2343Y-194343D01*
X3061Y-193268D01*
X3314Y-192000D01*
Y-176704D01*
X4499Y-176500D01*
X4584Y-176500D01*
X8854D01*
X8906Y-176413D01*
X9087Y-176045D01*
X9236Y-175668D01*
X9352Y-175280D01*
X9434Y-174882D01*
X9484Y-174475D01*
X9500Y-174057D01*
X9729D01*
Y-170500D01*
Y-164500D01*
X4584D01*
X4499Y-164500D01*
X3314Y-164296D01*
Y-160704D01*
X4499Y-160500D01*
X4584Y-160500D01*
X17499D01*
Y-148500D01*
X14314D01*
Y-147000D01*
X17500D01*
Y-135000D01*
X4584D01*
X4500Y-135000D01*
X3314Y-134798D01*
Y-130202D01*
X4500Y-130000D01*
X4584Y-130000D01*
X17500D01*
Y-118000D01*
X17500D01*
X16929Y-116730D01*
X17057Y-116509D01*
X17500Y-114856D01*
Y-113144D01*
X17057Y-111491D01*
X16201Y-110009D01*
X14991Y-108799D01*
X13509Y-107943D01*
X11856Y-107500D01*
X10144D01*
X8491Y-107943D01*
X7009Y-108799D01*
X5799Y-110009D01*
X4943Y-111491D01*
X4584Y-112832D01*
X3314Y-112665D01*
Y-49047D01*
X4584Y-48521D01*
X11619Y-55556D01*
D02*
G37*
G36*
X13789Y-117587D02*
X13466Y-117962D01*
X13181Y-118339D01*
X12934Y-118717D01*
X12725Y-119097D01*
X12554Y-119479D01*
X12421Y-119862D01*
X12326Y-120247D01*
X12269Y-120634D01*
X12250Y-121023D01*
X9750D01*
X9731Y-120634D01*
X9674Y-120247D01*
X9579Y-119862D01*
X9446Y-119479D01*
X9275Y-119097D01*
X9066Y-118717D01*
X8819Y-118339D01*
X8534Y-117962D01*
X8211Y-117587D01*
X7850Y-117214D01*
X14150D01*
X13789Y-117587D01*
D02*
G37*
G36*
X-76565Y-129583D02*
X-76977Y-130075D01*
X-77349Y-130687D01*
X-77682Y-131420D01*
X-77975Y-132273D01*
X-78229Y-133246D01*
X-78443Y-134340D01*
X-78752Y-136888D01*
X-78847Y-138343D01*
X-78902Y-139918D01*
X-88482Y-129709D01*
X-86953Y-129749D01*
X-84235Y-129672D01*
X-83046Y-129556D01*
X-81968Y-129387D01*
X-81004Y-129166D01*
X-80153Y-128892D01*
X-79414Y-128567D01*
X-78789Y-128188D01*
X-78276Y-127758D01*
X-76565Y-129583D01*
D02*
G37*
G36*
X79029Y-127979D02*
X79648Y-128355D01*
X80384Y-128684D01*
X81237Y-128968D01*
X82206Y-129205D01*
X83292Y-129396D01*
X84494Y-129542D01*
X87248Y-129694D01*
X88800Y-129700D01*
X78900Y-139600D01*
X78894Y-138048D01*
X78596Y-134092D01*
X78405Y-133006D01*
X78168Y-132037D01*
X77884Y-131184D01*
X77555Y-130448D01*
X77179Y-129829D01*
X76758Y-129326D01*
X78526Y-127558D01*
X79029Y-127979D01*
D02*
G37*
G36*
X-68750Y-126346D02*
Y-131730D01*
X-61000D01*
Y-133000D01*
X-59730D01*
Y-142000D01*
X-53250D01*
Y-142000D01*
X-52750D01*
Y-142000D01*
X-47814D01*
Y-143500D01*
X-50500D01*
Y-152430D01*
X-50564Y-152750D01*
Y-154579D01*
X-57771Y-161786D01*
X-73167D01*
X-73298Y-161775D01*
X-73727Y-161670D01*
X-74267Y-161464D01*
X-74905Y-161144D01*
X-75631Y-160704D01*
X-76395Y-160168D01*
X-78220Y-158598D01*
X-78898Y-157425D01*
X-81225Y-155098D01*
X-84075Y-153452D01*
X-85547Y-153057D01*
Y-151743D01*
X-84075Y-151348D01*
X-81225Y-149703D01*
X-78898Y-147375D01*
X-77252Y-144525D01*
X-76400Y-141346D01*
Y-138054D01*
X-76702Y-136926D01*
X-76427Y-134659D01*
X-76240Y-133699D01*
X-76021Y-132862D01*
X-75785Y-132175D01*
X-75543Y-131642D01*
X-75315Y-131266D01*
X-75237Y-131174D01*
X-69923Y-125860D01*
X-68750Y-126346D01*
D02*
G37*
G36*
X79029Y-153379D02*
X79648Y-153755D01*
X80384Y-154084D01*
X81237Y-154368D01*
X82206Y-154605D01*
X83292Y-154796D01*
X84494Y-154942D01*
X87248Y-155094D01*
X88800Y-155100D01*
X78900Y-165000D01*
X78894Y-163448D01*
X78596Y-159492D01*
X78405Y-158406D01*
X78168Y-157437D01*
X77884Y-156584D01*
X77555Y-155848D01*
X77179Y-155229D01*
X76758Y-154726D01*
X78526Y-152958D01*
X79029Y-153379D01*
D02*
G37*
G36*
X-80656Y-159192D02*
X-77648Y-161780D01*
X-76746Y-162412D01*
X-75892Y-162930D01*
X-75089Y-163333D01*
X-74336Y-163620D01*
X-73632Y-163792D01*
X-72978Y-163850D01*
Y-166350D01*
X-73632Y-166408D01*
X-74336Y-166580D01*
X-75089Y-166868D01*
X-75892Y-167270D01*
X-76746Y-167787D01*
X-77648Y-168420D01*
X-78601Y-169167D01*
X-80656Y-171007D01*
X-81759Y-172100D01*
Y-158100D01*
X-80656Y-159192D01*
D02*
G37*
G36*
X78815Y-178965D02*
X79440Y-179343D01*
X80178Y-179669D01*
X81030Y-179944D01*
X81995Y-180166D01*
X83073Y-180338D01*
X84264Y-180458D01*
X86986Y-180542D01*
X88517Y-180507D01*
X78902Y-190683D01*
X78852Y-189110D01*
X78460Y-185112D01*
X78248Y-184019D01*
X77996Y-183046D01*
X77704Y-182193D01*
X77372Y-181460D01*
X76999Y-180847D01*
X76586Y-180354D01*
X78303Y-178536D01*
X78815Y-178965D01*
D02*
G37*
G36*
X-80656Y-184592D02*
X-77648Y-187180D01*
X-76746Y-187812D01*
X-75892Y-188330D01*
X-75089Y-188732D01*
X-74336Y-189020D01*
X-73632Y-189193D01*
X-72978Y-189250D01*
Y-191750D01*
X-73632Y-191807D01*
X-74336Y-191980D01*
X-75089Y-192267D01*
X-75892Y-192670D01*
X-76746Y-193188D01*
X-77648Y-193820D01*
X-78601Y-194568D01*
X-80656Y-196408D01*
X-81759Y-197500D01*
Y-183500D01*
X-80656Y-184592D01*
D02*
G37*
G36*
X79029Y-204179D02*
X79648Y-204555D01*
X80384Y-204884D01*
X81237Y-205168D01*
X82206Y-205405D01*
X83292Y-205596D01*
X84494Y-205742D01*
X87248Y-205894D01*
X88800Y-205900D01*
X78900Y-215800D01*
X78894Y-214248D01*
X78596Y-210292D01*
X78405Y-209206D01*
X78168Y-208237D01*
X77884Y-207384D01*
X77555Y-206648D01*
X77179Y-206028D01*
X76758Y-205526D01*
X78526Y-203758D01*
X79029Y-204179D01*
D02*
G37*
G36*
X-80656Y-209993D02*
X-77648Y-212580D01*
X-76746Y-213213D01*
X-75892Y-213730D01*
X-75089Y-214132D01*
X-74336Y-214420D01*
X-73632Y-214592D01*
X-72978Y-214650D01*
Y-217150D01*
X-73632Y-217208D01*
X-74336Y-217380D01*
X-75089Y-217668D01*
X-75892Y-218070D01*
X-76746Y-218587D01*
X-77648Y-219220D01*
X-78601Y-219967D01*
X-80656Y-221807D01*
X-81759Y-222900D01*
Y-208900D01*
X-80656Y-209993D01*
D02*
G37*
G36*
X79029Y-229579D02*
X79648Y-229955D01*
X80384Y-230284D01*
X81237Y-230568D01*
X82206Y-230805D01*
X83292Y-230996D01*
X84494Y-231141D01*
X87248Y-231294D01*
X88800Y-231301D01*
X78900Y-241200D01*
X78894Y-239648D01*
X78596Y-235692D01*
X78405Y-234606D01*
X78168Y-233637D01*
X77884Y-232784D01*
X77555Y-232048D01*
X77179Y-231429D01*
X76758Y-230926D01*
X78526Y-229158D01*
X79029Y-229579D01*
D02*
G37*
G36*
X-80656Y-235392D02*
X-77648Y-237980D01*
X-76746Y-238612D01*
X-75892Y-239130D01*
X-75089Y-239533D01*
X-74336Y-239820D01*
X-73632Y-239993D01*
X-72978Y-240050D01*
Y-242550D01*
X-73632Y-242607D01*
X-74336Y-242780D01*
X-75089Y-243067D01*
X-75892Y-243470D01*
X-76746Y-243988D01*
X-77648Y-244620D01*
X-78601Y-245368D01*
X-80656Y-247208D01*
X-81759Y-248300D01*
Y-234300D01*
X-80656Y-235392D01*
D02*
G37*
G36*
X79029Y-254979D02*
X79648Y-255355D01*
X80384Y-255684D01*
X81237Y-255968D01*
X82206Y-256205D01*
X83292Y-256396D01*
X84494Y-256542D01*
X87248Y-256694D01*
X88800Y-256700D01*
X78900Y-266600D01*
X78894Y-265048D01*
X78596Y-261091D01*
X78405Y-260006D01*
X78168Y-259037D01*
X77884Y-258184D01*
X77555Y-257448D01*
X77179Y-256828D01*
X76758Y-256326D01*
X78526Y-254558D01*
X79029Y-254979D01*
D02*
G37*
%LPC*%
G36*
X-51500Y256500D02*
X-64500D01*
Y244500D01*
X-61315D01*
Y243000D01*
X-64501D01*
Y231000D01*
X-51501D01*
Y243000D01*
X-54687D01*
Y244500D01*
X-51500D01*
Y256500D01*
D02*
G37*
G36*
X-51501Y227000D02*
X-56731D01*
Y222270D01*
X-51501D01*
Y227000D01*
D02*
G37*
G36*
X-59271D02*
X-64501D01*
Y222270D01*
X-59271D01*
Y227000D01*
D02*
G37*
G36*
X-51501Y219730D02*
X-56731D01*
Y215000D01*
X-51501D01*
Y219730D01*
D02*
G37*
G36*
X-59271D02*
X-64501D01*
Y215000D01*
X-59271D01*
Y219730D01*
D02*
G37*
G36*
X-26980Y277445D02*
Y266070D01*
X-20937D01*
Y270300D01*
X-21187Y272193D01*
X-21917Y273956D01*
X-23079Y275471D01*
X-24594Y276633D01*
X-26357Y277363D01*
X-26980Y277445D01*
D02*
G37*
G36*
X29520Y277445D02*
Y266070D01*
X35563D01*
Y270300D01*
X35313Y272193D01*
X34583Y273956D01*
X33421Y275471D01*
X31906Y276633D01*
X30143Y277363D01*
X29520Y277445D01*
D02*
G37*
G36*
X26980Y277445D02*
X26357Y277363D01*
X24594Y276633D01*
X23079Y275471D01*
X21917Y273956D01*
X21187Y272193D01*
X20937Y270300D01*
Y266070D01*
X26980D01*
Y277445D01*
D02*
G37*
G36*
X56730Y266730D02*
X44500D01*
Y257500D01*
X56730D01*
Y266730D01*
D02*
G37*
G36*
X-20937Y263530D02*
X-26980D01*
Y252155D01*
X-26357Y252237D01*
X-24594Y252967D01*
X-23079Y254129D01*
X-21917Y255644D01*
X-21187Y257407D01*
X-20937Y259300D01*
Y263530D01*
D02*
G37*
G36*
X26980D02*
X20937D01*
Y259300D01*
X21187Y257407D01*
X21917Y255644D01*
X23079Y254129D01*
X24594Y252967D01*
X26357Y252237D01*
X26980Y252155D01*
Y263530D01*
D02*
G37*
G36*
X35563D02*
X29520D01*
Y252155D01*
X30143Y252237D01*
X31906Y252967D01*
X33421Y254129D01*
X34583Y255644D01*
X35313Y257407D01*
X35563Y259300D01*
Y263530D01*
D02*
G37*
G36*
X-18906Y248800D02*
X-21094D01*
X-23115Y247963D01*
X-24663Y246416D01*
X-25500Y244394D01*
Y242206D01*
X-24663Y240184D01*
X-23115Y238637D01*
X-21094Y237800D01*
X-18906D01*
X-18056Y238152D01*
X-17000Y237446D01*
Y229250D01*
X-14270D01*
Y238000D01*
Y246750D01*
X-15672D01*
X-16884Y247963D01*
X-18906Y248800D01*
D02*
G37*
G36*
X45230Y223500D02*
X40500D01*
Y218270D01*
X45230D01*
Y223500D01*
D02*
G37*
G36*
X-9270Y223578D02*
X-10000D01*
X-11561Y223268D01*
X-12884Y222384D01*
X-13768Y221061D01*
X-14078Y219500D01*
Y217770D01*
X-9270D01*
Y223578D01*
D02*
G37*
G36*
Y215230D02*
X-14078D01*
Y213500D01*
X-13768Y211939D01*
X-12884Y210616D01*
X-11561Y209732D01*
X-10000Y209422D01*
X-9270D01*
Y215230D01*
D02*
G37*
G36*
X29000Y186500D02*
X25146D01*
X25094Y186413D01*
X24913Y186045D01*
X24764Y185668D01*
X24648Y185280D01*
X24566Y184882D01*
X24516Y184475D01*
X24500Y184057D01*
X24270D01*
Y181270D01*
X29000D01*
Y186500D01*
D02*
G37*
G36*
X20854D02*
X17000D01*
Y181270D01*
X21730D01*
Y184057D01*
X21500D01*
X21484Y184475D01*
X21434Y184882D01*
X21351Y185280D01*
X21236Y185668D01*
X21088Y186045D01*
X20906Y186413D01*
X20854Y186500D01*
D02*
G37*
G36*
X29000Y178730D02*
X24270D01*
Y173500D01*
X29000D01*
Y178730D01*
D02*
G37*
G36*
X21730D02*
X17000D01*
Y173500D01*
X21730D01*
Y178730D01*
D02*
G37*
G36*
X25000Y130500D02*
X20270D01*
Y125270D01*
X25000D01*
Y130500D01*
D02*
G37*
G36*
X17730D02*
X13000D01*
Y125270D01*
X17730D01*
Y130500D01*
D02*
G37*
G36*
X24500Y78500D02*
X19770D01*
Y73270D01*
X24500D01*
Y78500D01*
D02*
G37*
G36*
X17230D02*
X12500D01*
Y73270D01*
X17230D01*
Y78500D01*
D02*
G37*
G36*
Y70730D02*
X12500D01*
Y65500D01*
X16104D01*
X16156Y65587D01*
X16337Y65955D01*
X16486Y66332D01*
X16602Y66720D01*
X16684Y67118D01*
X16733Y67525D01*
X16750Y67943D01*
X17230D01*
Y70730D01*
D02*
G37*
G36*
X61130Y-23666D02*
X57786Y-27011D01*
X61484Y-30708D01*
X64828Y-27364D01*
X61130Y-23666D01*
D02*
G37*
G36*
X-44770Y-87500D02*
X-49500D01*
Y-92730D01*
X-44770D01*
Y-87500D01*
D02*
G37*
G36*
Y-95270D02*
X-49500D01*
Y-100500D01*
X-44770D01*
Y-95270D01*
D02*
G37*
G36*
X12269Y-164500D02*
Y-169230D01*
X17499D01*
Y-164500D01*
X12269D01*
D02*
G37*
G36*
X17499Y-171770D02*
X12269D01*
Y-174057D01*
X12500D01*
X12516Y-174475D01*
X12566Y-174882D01*
X12649Y-175280D01*
X12764Y-175668D01*
X12912Y-176045D01*
X13094Y-176413D01*
X13146Y-176500D01*
X17499D01*
Y-171770D01*
D02*
G37*
G36*
X-9730Y-225500D02*
Y-230230D01*
X-4500D01*
Y-225500D01*
X-9730D01*
D02*
G37*
G36*
X-4500Y-232770D02*
X-9730D01*
Y-235057D01*
X-9500D01*
X-9484Y-235475D01*
X-9434Y-235882D01*
X-9352Y-236280D01*
X-9236Y-236668D01*
X-9087Y-237045D01*
X-8906Y-237413D01*
X-8854Y-237500D01*
X-4500D01*
Y-232770D01*
D02*
G37*
G36*
X-17500Y-225500D02*
X-18500D01*
X-18770Y-225500D01*
X-31500D01*
Y-237500D01*
X-28314D01*
Y-250387D01*
X-31250D01*
X-33494Y-250834D01*
X-35396Y-252104D01*
X-36666Y-254007D01*
X-37113Y-256250D01*
Y-263750D01*
X-36666Y-265993D01*
X-35396Y-267896D01*
X-33494Y-269166D01*
X-31250Y-269613D01*
X-15750D01*
X-13506Y-269166D01*
X-11604Y-267896D01*
X-10334Y-265993D01*
X-9887Y-263750D01*
Y-256250D01*
X-10334Y-254007D01*
X-11604Y-252104D01*
X-13506Y-250834D01*
X-15750Y-250387D01*
X-21686D01*
Y-237500D01*
X-18770D01*
X-18500Y-237500D01*
X-17500D01*
X-17230Y-237500D01*
X-13146D01*
X-13094Y-237413D01*
X-12912Y-237045D01*
X-12764Y-236668D01*
X-12649Y-236280D01*
X-12566Y-235882D01*
X-12516Y-235475D01*
X-12500Y-235057D01*
X-12270D01*
Y-231500D01*
Y-225500D01*
X-17230D01*
X-17500Y-225500D01*
D02*
G37*
G36*
X51250Y-250387D02*
X44770D01*
Y-258730D01*
X57113D01*
Y-256250D01*
X56666Y-254007D01*
X55395Y-252104D01*
X53493Y-250834D01*
X51250Y-250387D01*
D02*
G37*
G36*
X42230D02*
X35750D01*
X33507Y-250834D01*
X31604Y-252104D01*
X30334Y-254007D01*
X29887Y-256250D01*
Y-258730D01*
X42230D01*
Y-250387D01*
D02*
G37*
G36*
X57113Y-261270D02*
X44770D01*
Y-269613D01*
X51250D01*
X53493Y-269166D01*
X55395Y-267896D01*
X56666Y-265993D01*
X57113Y-263750D01*
Y-261270D01*
D02*
G37*
G36*
X42230D02*
X31943D01*
Y-262500D01*
X31525Y-262516D01*
X31118Y-262566D01*
X30720Y-262649D01*
X30332Y-262764D01*
X29955Y-262913D01*
X29887Y-262946D01*
Y-263750D01*
X30334Y-265993D01*
X31604Y-267896D01*
X33507Y-269166D01*
X35750Y-269613D01*
X42230D01*
Y-261270D01*
D02*
G37*
G36*
X-53000Y-251392D02*
X-56263Y-251822D01*
X-59304Y-253081D01*
X-61915Y-255085D01*
X-63919Y-257696D01*
X-65178Y-260737D01*
X-65608Y-264000D01*
X-65178Y-267263D01*
X-63919Y-270304D01*
X-61915Y-272915D01*
X-59304Y-274919D01*
X-56263Y-276178D01*
X-53000Y-276608D01*
X-49737Y-276178D01*
X-46696Y-274919D01*
X-44085Y-272915D01*
X-42081Y-270304D01*
X-40822Y-267263D01*
X-40392Y-264000D01*
X-40822Y-260737D01*
X-42081Y-257696D01*
X-44085Y-255085D01*
X-46696Y-253081D01*
X-49737Y-251822D01*
X-53000Y-251392D01*
D02*
G37*
G36*
X-62270Y-134270D02*
X-68750D01*
Y-142000D01*
X-62270D01*
Y-134270D01*
D02*
G37*
G36*
X-55500Y-143500D02*
X-60230D01*
Y-148730D01*
X-55500D01*
Y-143500D01*
D02*
G37*
G36*
X-62770D02*
X-67500D01*
Y-147854D01*
X-67413Y-147906D01*
X-67045Y-148088D01*
X-66668Y-148236D01*
X-66280Y-148351D01*
X-65882Y-148434D01*
X-65475Y-148483D01*
X-65057Y-148500D01*
Y-148730D01*
X-62770D01*
Y-143500D01*
D02*
G37*
G36*
X-55500Y-151270D02*
X-60230D01*
Y-156500D01*
X-55500D01*
Y-151270D01*
D02*
G37*
G36*
X-62770D02*
X-65057D01*
Y-151500D01*
X-65475Y-151517D01*
X-65882Y-151566D01*
X-66280Y-151649D01*
X-66668Y-151764D01*
X-67045Y-151912D01*
X-67413Y-152094D01*
X-67500Y-152146D01*
Y-156500D01*
X-62770D01*
Y-151270D01*
D02*
G37*
%LPD*%
D10*
X-23000Y11000D02*
X-19000Y15000D01*
X-25194Y-5911D02*
X-9840Y9442D01*
Y29051D02*
X0Y38891D01*
X-9840Y9442D02*
Y29051D01*
X-62000Y-15000D02*
X-61142Y-14142D01*
X-3460Y-4000D02*
X7540Y-15000D01*
X18000Y61000D02*
X18250Y61250D01*
X-24395Y-35002D02*
X-13000Y-23607D01*
X-36000Y-46607D02*
X-24395Y-35002D01*
X-31252Y3780D02*
X-30104Y2631D01*
X-45608Y13789D02*
X-32515Y695D01*
X-49144Y10253D02*
X-45255Y6364D01*
X-45255D02*
X-32980Y-5911D01*
X-25194D01*
X-42073Y17324D02*
X-35749Y11000D01*
X-23000D01*
X-53033Y-14142D02*
X-49144Y-10253D01*
X-61142Y-14142D02*
X-53033D01*
X-20860Y-38537D02*
X-14322Y-32000D01*
X-5000D01*
X-13000Y-23607D02*
Y-23000D01*
X-29000Y-153000D02*
Y-76400D01*
X-36000Y-69400D02*
X-29000Y-76400D01*
X-36000Y-69400D02*
Y-46607D01*
X-68000Y-178000D02*
X-54000D01*
X-29000Y-153000D01*
X7540Y-15000D02*
X24000D01*
X19000Y124000D02*
X21500Y127000D01*
X13789Y45608D02*
X19142Y50962D01*
Y60108D01*
X18250Y61000D02*
X19142Y60108D01*
X18250Y71750D02*
X18500Y72000D01*
X18250Y61250D02*
Y71750D01*
X27500Y154000D02*
Y165000D01*
X23000Y180000D02*
Y191000D01*
X31000Y-1000D02*
X32820D01*
X45608Y-13789D01*
X24000Y-15000D02*
X25624D01*
X29624Y-11000D01*
X35749D01*
X42073Y-17324D01*
X0Y38891D02*
X49144Y-10253D01*
X53033Y-14142D01*
X63627D01*
X64475Y-14990D01*
X68010D01*
X45608Y-13789D02*
X55990Y-24170D01*
Y-27010D02*
Y-24170D01*
X10999Y-170500D02*
X11000Y-170501D01*
Y-181000D02*
Y-170501D01*
X-61500Y-150000D02*
Y-133500D01*
X-61000Y-133000D01*
X-43500Y-109500D02*
Y-94000D01*
X-45000Y-111000D02*
X-43500Y-109500D01*
X-11000Y-242000D02*
Y-231500D01*
X25000Y-261000D02*
X39000D01*
X-72000Y-150000D02*
X-61500D01*
X-45255Y6364D02*
X-45255D01*
X0Y38891D02*
X10253Y49144D01*
X-53000Y2000D02*
X-47000Y8000D01*
D11*
X40000Y180000D02*
G03*
X37000Y172757I7243J-7243D01*
G01*
Y139000D02*
X53500D01*
X54500Y140000D01*
Y141000D01*
X37000Y140250D02*
X37750Y141000D01*
X37000Y139000D02*
Y140250D01*
X13000Y218500D02*
Y238000D01*
X28000Y218500D02*
X29500Y217000D01*
X14000Y218500D02*
X28000D01*
X54000Y180000D02*
X54500Y179500D01*
Y163000D02*
Y179500D01*
X37000Y165000D02*
Y172757D01*
D12*
Y124000D02*
Y139000D01*
X1500Y58500D02*
Y72000D01*
Y58500D02*
X9395Y50605D01*
X36000Y123500D02*
Y124000D01*
X29500Y203000D02*
Y217000D01*
D16*
X750Y102238D02*
G03*
X5241Y91395I15334J0D01*
G01*
X7829Y88807D02*
G03*
X17020Y85000I9190J9190D01*
G01*
X32828Y82172D02*
G03*
X26000Y85000I-6828J-6828D01*
G01*
X37000Y73757D02*
G03*
X34000Y81000I-10243J0D01*
G01*
X34401Y51725D02*
G03*
X37000Y58000I-6275J6275D01*
G01*
X25134Y42676D02*
G03*
X25507Y42831I0J527D01*
G01*
X0Y245757D02*
G03*
X-3000Y253000I-10243J0D01*
G01*
X-8000Y199500D02*
G03*
X1000Y208500I0J9000D01*
G01*
X488Y230758D02*
G03*
X512Y230413I2500J0D01*
G01*
X750Y190750D02*
G03*
X-8000Y199500I-8750J0D01*
G01*
X5250Y102250D02*
G03*
X8432Y94568I10864J0D01*
G01*
X11000Y92000D02*
G03*
X17036Y89500I6036J6036D01*
G01*
X35994Y85370D02*
G03*
X26023Y89500I-9972J-9972D01*
G01*
X41500Y73785D02*
G03*
X37201Y84163I-14677J0D01*
G01*
X37594Y48554D02*
G03*
X41500Y57984I-9430J9430D01*
G01*
X28255Y38861D02*
G03*
X28380Y39163I-302J302D01*
G01*
X10000Y253000D02*
G03*
X6500Y244550I8450J-8450D01*
G01*
X5981Y229884D02*
G03*
X6013Y230284I-2468J400D01*
G01*
X5500Y208000D02*
G03*
X14000Y199500I8500J0D01*
G01*
D02*
G03*
X5250Y190750I0J-8750D01*
G01*
X28505Y39465D02*
G03*
X28380Y39163I302J-302D01*
G01*
X-71300Y-241300D02*
X-7317Y-177317D01*
X-17000Y-59922D02*
X-7317Y-69605D01*
Y-177317D02*
Y-69605D01*
X-60393Y-215900D02*
X-14904Y-170412D01*
Y-70464D01*
X-88900Y-215900D02*
X-60393D01*
X66106Y48429D02*
X73829D01*
X38537Y20860D02*
X66106Y48429D01*
X73829D02*
X88900Y63500D01*
X-21464Y-25000D02*
Y-9464D01*
X-1000Y11000D02*
Y20000D01*
X-21464Y-9464D02*
X-1000Y11000D01*
X-71000Y5200D02*
Y21026D01*
X-64526Y27500D02*
X-45178D01*
X-71000Y21026D02*
X-64526Y27500D01*
X-18000Y-6000D02*
X3769Y-27769D01*
Y-36231D02*
Y-27769D01*
X0Y-40000D02*
X3769Y-36231D01*
X0Y-192000D02*
Y-40000D01*
X-22000Y-63368D02*
X-14904Y-70464D01*
X-88900Y-165100D02*
X-56398D01*
X-47250Y-152750D02*
X-44500Y-150000D01*
X-47250Y-155952D02*
Y-152750D01*
X-56398Y-165100D02*
X-47250Y-155952D01*
X-88900Y-114300D02*
X-72490Y-97890D01*
Y-84121D02*
X-60161Y-71793D01*
X-72490Y-97890D02*
Y-84121D01*
X-60161Y-71793D02*
Y-42484D01*
X-60000Y-93500D02*
Y-84889D01*
X-52035Y-76924D02*
Y-41428D01*
X-60000Y-84889D02*
X-52035Y-76924D01*
X-60161Y-42484D02*
X-38537Y-20860D01*
X-52035Y-41428D02*
X-35002Y-24395D01*
X-23000Y-164000D02*
Y-71518D01*
X-28000Y-66518D02*
Y-52749D01*
Y-66518D02*
X-23000Y-71518D01*
X-22000Y-63368D02*
Y-53820D01*
X-17000Y-59922D02*
Y-55891D01*
X-49500Y-190500D02*
X-23000Y-164000D01*
X-11000Y-214500D02*
Y-203000D01*
X0Y-192000D01*
X-47553Y130228D02*
X-29000Y113000D01*
X-48178Y130808D02*
X-47553Y130228D01*
X17324Y42073D02*
X29000Y53749D01*
Y64000D01*
X19000Y99000D02*
X35000D01*
X47000Y97800D02*
X88900Y139700D01*
X35000Y99000D02*
X71000Y135000D01*
X47000Y50535D02*
Y97800D01*
X71000Y135000D02*
Y198000D01*
X5241Y91395D02*
X7829Y88807D01*
X17020Y85000D02*
X26000D01*
X32828Y82172D02*
X34000Y81000D01*
X37000Y58000D02*
Y73757D01*
X25507Y42831D02*
X34401Y51725D01*
X20995Y38537D02*
X25134Y42676D01*
X488Y230758D02*
Y232500D01*
X0Y238000D02*
Y245757D01*
X750Y102238D02*
Y190750D01*
X512Y230413D02*
X513Y230409D01*
X8432Y94568D02*
X11000Y92000D01*
X17036Y89500D02*
X26023D01*
X35995Y85370D02*
X37201Y84163D01*
X41500Y57984D02*
Y73785D01*
X28505Y39465D02*
X37594Y48554D01*
X24395Y35002D02*
X28255Y38861D01*
X6500Y238000D02*
Y244550D01*
X5979Y229873D02*
X5981Y229884D01*
X5500Y208000D02*
Y227000D01*
X5250Y102250D02*
Y190750D01*
X27931Y31466D02*
X47000Y50535D01*
X31729Y146000D02*
X37000Y151271D01*
X23000Y146000D02*
X31729D01*
X37000Y151271D02*
Y165000D01*
X-20000Y73000D02*
X-10000Y63000D01*
X-20000Y73000D02*
Y186539D01*
X-65000Y120478D02*
X-34050Y89528D01*
Y65870D02*
X-13789Y45608D01*
X-34050Y65870D02*
Y89528D01*
X-88900Y114300D02*
X-70410Y95810D01*
Y88088D02*
X-20860Y38537D01*
X-70410Y88088D02*
Y95810D01*
X-58562Y128562D02*
X-27208Y97207D01*
Y66098D02*
Y97207D01*
X-72000Y112575D02*
X-41420Y81995D01*
Y66169D02*
Y81995D01*
Y66169D02*
X-17324Y42073D01*
X-27208Y66098D02*
X-10253Y49144D01*
X-26461Y193000D02*
X-20000Y186539D01*
X-42000Y193000D02*
X-26461D01*
X-45350Y183400D02*
X-43915Y184835D01*
Y191085D01*
X-42000Y193000D01*
X-57624Y145300D02*
X-45350D01*
X-58562Y128562D02*
Y144362D01*
X-88900Y190500D02*
X-58562Y160162D01*
Y144362D02*
Y160162D01*
X-88900Y215900D02*
X-57100Y184100D01*
X-46050D01*
X-45350Y183400D01*
X11000Y-154499D02*
Y-141000D01*
X10999Y-154500D02*
X11000Y-154499D01*
Y-124000D02*
Y-114000D01*
X-27931Y-31466D02*
X-21464Y-25000D01*
X-25000Y-214500D02*
X-11000D01*
X-25000Y-258000D02*
Y-231500D01*
X-72000Y112575D02*
Y122800D01*
X-65000Y120478D02*
Y141200D01*
X-88900Y139700D02*
X-72000Y122800D01*
X-88900Y88900D02*
X-56000Y56000D01*
X-45393D02*
X-24395Y35002D01*
X-56000Y56000D02*
X-45393D01*
X-88900Y63500D02*
X-72400Y47000D01*
X-43464D02*
X-27931Y31466D01*
X-72400Y47000D02*
X-43464D01*
X-60500Y-110500D02*
Y-94000D01*
X-61000Y-111000D02*
X-60500Y-110500D01*
X-88900Y-139700D02*
X-88450D01*
X-61000Y-112250D01*
Y-111000D01*
X-44500Y-150000D02*
Y-133500D01*
X-45000Y-133000D02*
X-44500Y-133500D01*
X-45000Y-133000D02*
Y-131750D01*
X-35000Y-121750D01*
Y-80000D01*
X-44000Y-71000D02*
Y-40465D01*
Y-71000D02*
X-35000Y-80000D01*
X-44000Y-40465D02*
X-31466Y-27931D01*
X-60500Y-94000D02*
X-60000Y-93500D01*
X-88900Y-88900D02*
X-68193Y-68193D01*
Y-43444D02*
X-42073Y-17324D01*
X-68193Y-68193D02*
Y-43444D01*
X-87500Y-63500D02*
X-74670Y-50670D01*
Y-42850D02*
X-45608Y-13789D01*
X-74670Y-50670D02*
Y-42850D01*
X-88900Y-63500D02*
X-87500D01*
X-88900Y-190500D02*
X-49500D01*
X-88900Y-241300D02*
X-71300D01*
X-28000Y-52749D02*
X-17324Y-42073D01*
X-22000Y-53820D02*
X-13789Y-45608D01*
X-10253Y-49144D02*
Y-49144D01*
X-17000Y-55891D02*
X-10253Y-49144D01*
X-88900Y12700D02*
X-69001Y32599D01*
X-43205D02*
X-35002Y24395D01*
X-69001Y32599D02*
X-43205D01*
X-45178Y27500D02*
X-38537Y20860D01*
X-88900Y-12700D02*
X-71000Y5200D01*
X-38673Y20860D02*
X-38537D01*
X-88900Y38100D02*
X-41771D01*
X-31602Y27931D02*
X-31466D01*
X-41771Y38100D02*
X-31602Y27931D01*
X-88900Y165100D02*
X-65000Y141200D01*
X71000Y198000D02*
X88900Y215900D01*
X55000Y80400D02*
X88900Y114300D01*
X55000Y51464D02*
Y80400D01*
X31466Y27931D02*
X55000Y51464D01*
X62269Y62269D02*
X88900Y88900D01*
X62269Y51663D02*
Y62269D01*
X35002Y24395D02*
X62269Y51663D01*
X62849Y38100D02*
X88900D01*
X42073Y17324D02*
X62849Y38100D01*
X76600Y25000D02*
X88900Y12700D01*
X45608Y13789D02*
X56820Y25000D01*
X76600D01*
X62200Y14000D02*
X88900Y-12700D01*
X52937Y14000D02*
X62200D01*
X22638Y-200438D02*
X88900Y-266700D01*
X10253Y-49144D02*
X22638Y-61529D01*
Y-200438D02*
Y-61529D01*
X13789Y-45608D02*
X29806Y-61626D01*
Y-182206D02*
X88900Y-241300D01*
X29806Y-182206D02*
Y-61626D01*
X17324Y-42073D02*
X37110Y-61859D01*
Y-164110D02*
X88900Y-215900D01*
X37110Y-164110D02*
Y-61859D01*
X20860Y-38537D02*
X44549Y-62226D01*
Y-146549D02*
X88500Y-190500D01*
X44549Y-146549D02*
Y-62226D01*
X24395Y-35002D02*
X52055Y-62662D01*
Y-128255D02*
Y-62662D01*
Y-128255D02*
X88900Y-165100D01*
X27931Y-31466D02*
X59494Y-63029D01*
Y-110294D02*
X88900Y-139700D01*
X59494Y-110294D02*
Y-63029D01*
X31466Y-27931D02*
X67068Y-63532D01*
Y-92468D02*
X88900Y-114300D01*
X67068Y-92468D02*
Y-63532D01*
X35002Y-24395D02*
X74000Y-63393D01*
Y-74000D02*
X88900Y-88900D01*
X74000Y-74000D02*
Y-63393D01*
X88500Y-190500D02*
X88900D01*
X66400Y-41000D02*
X88900Y-63500D01*
X58678Y-41000D02*
X66400D01*
X38537Y-20860D02*
X58678Y-41000D01*
X5750Y237250D02*
X6500Y238000D01*
X20860Y38537D02*
X20995D01*
X1000Y208500D02*
Y226952D01*
X18000Y151000D02*
Y165000D01*
X-58001Y237000D02*
Y250499D01*
X-58000Y250500D01*
X0Y238000D02*
X750Y237250D01*
X18000Y151000D02*
X23000Y146000D01*
X5500Y227000D02*
X5979Y229873D01*
X513Y230409D02*
X1000Y226952D01*
X0Y238000D02*
X488Y232500D01*
X6013D02*
X6500Y238000D01*
X6013Y230284D02*
Y232500D01*
D42*
X23500Y111000D02*
G03*
X36000Y123500I0J12500D01*
G01*
X54500Y179500D02*
G03*
X58000Y187950I-8450J8450D01*
G01*
X57454Y203000D02*
G03*
X58000Y203226I0J772D01*
G01*
Y201682D02*
G03*
X57454Y203000I-1864J0D01*
G01*
X19000Y111000D02*
X23500D01*
X-9681D02*
Y132600D01*
X1420Y72080D02*
Y72580D01*
X1000Y73000D02*
X1420Y72580D01*
X-9681Y83181D02*
Y111000D01*
X500Y73000D02*
X1000D01*
X-9681Y83181D02*
X500Y73000D01*
X-42000Y218085D02*
X-9681Y185766D01*
Y132600D02*
Y185766D01*
X-42000Y218085D02*
Y263000D01*
X-46500Y267500D02*
X-42000Y263000D01*
X-58000Y267500D02*
X-46500D01*
X-85000D02*
X-58000D01*
X40000Y180000D02*
X54000D01*
X58000Y203226D02*
Y238000D01*
X46500Y203000D02*
X57454D01*
X58000Y187950D02*
Y201682D01*
X62100Y239900D02*
X88900Y266700D01*
D43*
X-61000Y-111000D02*
D03*
Y-133000D02*
D03*
X-45000D02*
D03*
Y-111000D02*
D03*
D44*
X-44500Y-150000D02*
D03*
X-61500D02*
D03*
X-60500Y-94000D02*
D03*
X-43500D02*
D03*
X29500Y203000D02*
D03*
X46500D02*
D03*
X19000Y124000D02*
D03*
X36000D02*
D03*
X23000Y180000D02*
D03*
X40000D02*
D03*
X46500Y217000D02*
D03*
X29500D02*
D03*
X18500Y72000D02*
D03*
X1500D02*
D03*
D45*
X-53000Y-264000D02*
D03*
D46*
X-49144Y-10253D02*
D03*
D47*
X-45608Y-13789D02*
D03*
X-42073Y-17324D02*
D03*
X-38537Y-20860D02*
D03*
X-35002Y-24395D02*
D03*
X-31466Y-27931D02*
D03*
X-27931Y-31466D02*
D03*
X-24395Y-35002D02*
D03*
X-20860Y-38537D02*
D03*
X-17324Y-42073D02*
D03*
X-13789Y-45608D02*
D03*
X-10253Y-49144D02*
D03*
X49144Y10253D02*
D03*
X45608Y13789D02*
D03*
X42073Y17324D02*
D03*
X38537Y20860D02*
D03*
X35002Y24395D02*
D03*
X31466Y27931D02*
D03*
X27931Y31466D02*
D03*
X24395Y35002D02*
D03*
X20860Y38537D02*
D03*
X17324Y42073D02*
D03*
X13789Y45608D02*
D03*
X10253Y49144D02*
D03*
D48*
Y-49144D02*
D03*
X13789Y-45608D02*
D03*
X17324Y-42073D02*
D03*
X20860Y-38537D02*
D03*
X24395Y-35002D02*
D03*
X27931Y-31466D02*
D03*
X31466Y-27931D02*
D03*
X35002Y-24395D02*
D03*
X38537Y-20860D02*
D03*
X42073Y-17324D02*
D03*
X45608Y-13789D02*
D03*
X49144Y-10253D02*
D03*
X-10253Y49144D02*
D03*
X-13789Y45608D02*
D03*
X-17324Y42073D02*
D03*
X-20860Y38537D02*
D03*
X-24395Y35002D02*
D03*
X-27931Y31466D02*
D03*
X-31466Y27931D02*
D03*
X-35002Y24395D02*
D03*
X-38537Y20860D02*
D03*
X-42073Y17324D02*
D03*
X-45608Y13789D02*
D03*
X-49144Y10253D02*
D03*
D49*
X-25000Y-214500D02*
D03*
Y-231500D02*
D03*
X-11000D02*
D03*
Y-214500D02*
D03*
X10999Y-154500D02*
D03*
Y-170500D02*
D03*
X-58001Y221000D02*
D03*
Y237000D02*
D03*
X11000Y-124000D02*
D03*
Y-141000D02*
D03*
X-58000Y267500D02*
D03*
Y250500D02*
D03*
D50*
X58000Y268000D02*
D03*
Y238000D02*
D03*
D51*
X13000D02*
D03*
D52*
X6500D02*
D03*
X0D02*
D03*
X-6500D02*
D03*
X-13000D02*
D03*
D53*
X-23500Y-260000D02*
D03*
X43500D02*
D03*
D54*
X54500Y163000D02*
D03*
Y141000D02*
D03*
D55*
X18000Y165000D02*
D03*
X27500D02*
D03*
X18000Y139000D02*
D03*
X37000D02*
D03*
D56*
Y165000D02*
D03*
D57*
X55990Y-27010D02*
D03*
X68010Y-14990D02*
D03*
D58*
X-8000Y216500D02*
D03*
D59*
Y199500D02*
D03*
X14000D02*
D03*
Y218500D02*
D03*
D60*
X88900Y-190500D02*
D03*
Y-165100D02*
D03*
Y-139700D02*
D03*
Y-114300D02*
D03*
Y-63500D02*
D03*
Y-38100D02*
D03*
Y63500D02*
D03*
Y139700D02*
D03*
Y190500D02*
D03*
Y241300D02*
D03*
Y215900D02*
D03*
Y165100D02*
D03*
Y114300D02*
D03*
Y88900D02*
D03*
Y38100D02*
D03*
Y12700D02*
D03*
Y-12700D02*
D03*
Y-88900D02*
D03*
Y-215900D02*
D03*
Y-241300D02*
D03*
Y-266700D02*
D03*
X-88900Y-190500D02*
D03*
Y-165100D02*
D03*
Y-139700D02*
D03*
Y-114300D02*
D03*
Y-63500D02*
D03*
Y-38100D02*
D03*
Y63500D02*
D03*
Y139700D02*
D03*
Y190500D02*
D03*
Y241300D02*
D03*
Y215900D02*
D03*
Y165100D02*
D03*
Y114300D02*
D03*
Y88900D02*
D03*
Y38100D02*
D03*
Y12700D02*
D03*
Y-12700D02*
D03*
Y-88900D02*
D03*
Y-215900D02*
D03*
Y-241300D02*
D03*
Y-266700D02*
D03*
D61*
X88900Y266700D02*
D03*
X-88900D02*
D03*
D62*
X-46850Y132600D02*
D03*
Y145300D02*
D03*
Y158000D02*
D03*
Y170700D02*
D03*
Y183400D02*
D03*
X-31150Y145300D02*
D03*
Y158000D02*
D03*
Y170700D02*
D03*
Y183400D02*
D03*
D63*
Y132600D02*
D03*
D64*
X28250Y264800D02*
D03*
X-28250D02*
D03*
D65*
X-36000Y-58003D02*
D03*
X-74000Y-25000D02*
D03*
X49000Y127000D02*
D03*
X-3460Y-4000D02*
D03*
X-19000Y15000D02*
D03*
X-30104Y2631D02*
D03*
X-62000Y-14140D02*
D03*
X-13000Y-23000D02*
D03*
X-5000Y-32000D02*
D03*
X11000Y-98000D02*
D03*
X-68000Y-178000D02*
D03*
X-29000Y113000D02*
D03*
X38000Y228000D02*
D03*
X27545Y134750D02*
D03*
X35000Y99000D02*
D03*
X29000Y64000D02*
D03*
X19000Y99000D02*
D03*
X18250Y61000D02*
D03*
X27500Y154000D02*
D03*
X23000Y191000D02*
D03*
X-10000Y63000D02*
D03*
X-1000Y20000D02*
D03*
X30367Y-2815D02*
D03*
X24000Y-15000D02*
D03*
X11000Y-181000D02*
D03*
Y-114000D02*
D03*
X-11000Y-242000D02*
D03*
X25000Y-261000D02*
D03*
X-72000Y-150000D02*
D03*
X-45023Y-81891D02*
D03*
X-53000Y2000D02*
D03*
X-3000Y253000D02*
D03*
X10000D02*
D03*
D66*
X-28000Y231000D02*
D03*
X-20000Y216000D02*
D03*
X-9681Y111000D02*
D03*
Y132600D02*
D03*
X19000Y111000D02*
D03*
M02*
