M48
;Layer_Color=9474304
;FILE_FORMAT=4:3
METRIC,TZ
;TYPE=PLATED
T01F00S00C0.300
T02F00S00C0.400
T04F00S00C0.600
T05F00S00C0.800
T06F00S00C1.100
;TYPE=NON_PLATED
T07F00S00C0.600
%
T01
X-1556Y0
X-778Y778
X0Y1556
X778Y-778
X0Y-1556
X1556Y0
T02
X-4400Y-19600
X-3100
X1700Y-19000
Y-17800
X1465Y-14348
Y-13148
X4300Y-15700
X-2600Y-10600
X-1803Y-8013
X-4103
X-2474Y-5100
X-2474Y-3962
X-3645Y-1877
X-4500Y2200
Y8500
X-1900Y10259
X1500Y7900
X1800Y6600
X872Y4228
X4300Y2800
Y1700
X4700Y-1700
X3100Y14500
X1500
X-680Y15213
X0Y17500
X-1270Y18400
X1270Y18570
X4112Y17383
T04
X-2540Y21065
X-1270
X0
X1270
X2540
Y22335
X1270
X0
X-1270
X-2540
T05
X-600Y9400
Y11400
X-4300Y14800
Y16800
T06
X-8890Y-19050
Y-16510
Y-13970
Y-11430
Y-8890
Y-6350
Y-3810
Y-1270
Y1270
Y3810
Y6350
Y8890
Y11430
Y13970
Y16510
X8890
Y13970
Y11430
Y8890
Y6350
Y3810
Y1270
Y-1270
Y-3810
Y-6350
Y-8890
Y-11430
Y-13970
Y-16510
Y-19050
Y19050
X-8890
T07
X-2000Y-21030
X2000
M30
