Version 4
SHEET 1 880 680
WIRE 16 -80 -208 -80
WIRE 160 -80 16 -80
WIRE 160 -32 160 -80
WIRE 160 -32 128 -32
WIRE 208 -32 160 -32
WIRE 320 -32 208 -32
WIRE 544 -32 320 -32
WIRE -208 -16 -208 -80
WIRE -96 -16 -128 -16
WIRE 96 32 -32 32
WIRE 16 48 16 -80
WIRE 208 48 208 -32
WIRE -32 64 -32 32
WIRE -16 64 -32 64
WIRE 96 80 96 32
WIRE 96 80 48 80
WIRE -96 96 -96 64
WIRE -96 96 -160 96
WIRE -16 96 -96 96
WIRE 96 96 96 80
WIRE 144 96 96 96
WIRE 320 96 320 -32
WIRE -96 128 -96 96
WIRE 256 144 208 144
WIRE 544 192 544 -32
WIRE 320 208 320 192
WIRE 336 208 320 208
WIRE 320 224 320 208
WIRE -96 240 -96 208
WIRE 320 336 320 304
WIRE -96 368 -96 320
FLAG 48 -32 0
FLAG 320 336 0
FLAG -96 368 0
FLAG 16 112 0
DATAFLAG 336 208 ""
DATAFLAG -160 96 ""
SYMBOL npn 256 96 R0
SYMATTR InstName Q1
SYMATTR Value TIP41C
SYMBOL voltage 144 -32 R90
WINDOW 123 0 0 Left 0
WINDOW 39 0 0 Left 0
SYMATTR InstName V1
SYMATTR Value 24
SYMBOL npn 144 48 R0
SYMATTR InstName Q2
SYMATTR Value TIP41C
SYMBOL res 304 208 R0
SYMATTR InstName R1
SYMATTR Value 220
SYMBOL diode 528 256 R0
SYMATTR InstName D1
SYMBOL diode 528 192 R0
SYMATTR InstName D2
SYMBOL res -112 224 R0
SYMATTR InstName R2
SYMATTR Value {27k/2}
SYMBOL res -112 112 R0
SYMATTR InstName R3
SYMATTR Value 1m
SYMBOL res -112 -32 R0
SYMATTR InstName R4
SYMATTR Value 91.4k
SYMBOL res -112 -32 R90
WINDOW 0 0 56 VBottom 2
WINDOW 3 32 56 VTop 2
SYMATTR InstName R5
SYMATTR Value 120k
SYMBOL Opamps\\UniversalOpamp2 16 80 R0
SYMATTR InstName U1
SYMBOL diode 16 32 R0
SYMATTR InstName D3
TEXT 98 290 Left 2 !.op
