X,CH1,CH2,Start,Increment,
Sequence,Volt,Volt,2.184000e-01,2.000000e-06
0,2.00e-01,1.48e+01,
1,-4.00e-01,1.42e+01,
2,2.00e-01,1.48e+01,
3,-4.00e-01,1.42e+01,
4,2.00e-01,1.48e+01,
5,-2.00e-01,1.42e+01,
6,2.00e-01,1.48e+01,
7,-2.00e-01,1.42e+01,
8,2.00e-01,1.48e+01,
9,-4.00e-01,1.42e+01,
10,2.00e-01,1.48e+01,
11,-2.00e-01,1.42e+01,
12,2.00e-01,1.48e+01,
13,-2.00e-01,1.42e+01,
14,2.00e-01,1.48e+01,
15,-2.00e-01,1.42e+01,
16,2.00e-01,1.48e+01,
17,-2.00e-01,1.42e+01,
18,2.00e-01,1.48e+01,
19,-2.00e-01,1.42e+01,
20,2.00e-01,1.48e+01,
21,-2.00e-01,1.42e+01,
22,2.00e-01,1.48e+01,
23,-2.00e-01,1.42e+01,
24,2.00e-01,1.48e+01,
25,-2.00e-01,1.42e+01,
26,2.00e-01,1.48e+01,
27,-4.00e-01,1.42e+01,
28,2.00e-01,1.48e+01,
29,-4.00e-01,1.42e+01,
30,2.00e-01,1.48e+01,
31,-2.00e-01,1.42e+01,
32,2.00e-01,1.48e+01,
33,-4.00e-01,1.42e+01,
34,2.00e-01,1.48e+01,
35,-4.00e-01,1.42e+01,
36,2.00e-01,1.48e+01,
37,-2.00e-01,1.42e+01,
38,2.00e-01,1.48e+01,
39,-4.00e-01,1.42e+01,
40,2.00e-01,1.42e+01,
41,-4.00e-01,1.48e+01,
42,2.00e-01,1.48e+01,
43,-4.00e-01,1.42e+01,
44,2.00e-01,1.48e+01,
45,-2.00e-01,1.42e+01,
46,2.00e-01,1.48e+01,
47,-2.00e-01,1.42e+01,
48,2.00e-01,1.48e+01,
49,-2.32e+01,-9.40e+00,
50,-1.94e+01,-6.20e+00,
51,-1.40e+01,-4.80e+00,
52,-1.40e+01,-5.60e+00,
53,-1.10e+01,-5.00e+00,
54,-1.14e+01,-5.60e+00,
55,-9.20e+00,-5.00e+00,
56,-9.20e+00,-5.60e+00,
57,-7.60e+00,-5.00e+00,
58,-8.00e+00,-5.60e+00,
59,-6.80e+00,-5.00e+00,
60,-7.20e+00,-5.60e+00,
61,-6.20e+00,-5.00e+00,
62,-6.60e+00,-5.60e+00,
63,-5.40e+00,-5.00e+00,
64,-6.00e+00,-5.00e+00,
65,-5.00e+00,-5.60e+00,
66,-5.40e+00,-5.60e+00,
67,-4.60e+00,-5.00e+00,
68,-5.20e+00,-5.60e+00,
69,-4.40e+00,-5.00e+00,
70,-4.80e+00,-5.00e+00,
71,-4.20e+00,-5.60e+00,
72,-4.60e+00,-5.00e+00,
73,-4.00e+00,-5.60e+00,
74,-4.40e+00,-5.00e+00,
75,-3.60e+00,-5.40e+00,
76,-4.20e+00,-5.00e+00,
77,-3.60e+00,-5.40e+00,
78,-4.00e+00,-5.40e+00,
79,-3.40e+00,-5.00e+00,
80,-3.80e+00,-5.40e+00,
81,-3.00e+00,-4.80e+00,
82,-3.60e+00,-5.40e+00,
83,-2.60e+00,-4.80e+00,
84,-3.20e+00,-5.40e+00,
85,-2.40e+00,-4.80e+00,
86,-2.80e+00,-5.40e+00,
87,-2.20e+00,-4.80e+00,
88,-2.60e+00,-4.80e+00,
89,-1.80e+00,-5.40e+00,
90,-2.20e+00,-5.40e+00,
91,-1.60e+00,-4.80e+00,
92,-2.00e+00,-5.40e+00,
93,-1.20e+00,-4.80e+00,
94,-1.60e+00,-4.80e+00,
95,-8.00e-01,-5.40e+00,
96,-1.40e+00,-4.80e+00,
97,-6.00e-01,-5.40e+00,
98,-1.20e+00,-5.40e+00,
99,-4.00e-01,-4.80e+00,
100,-8.00e-01,-4.80e+00,
101,-2.00e-01,-5.40e+00,
102,-8.00e-01,-5.40e+00,
103,0.00e+00,-4.80e+00,
104,-6.00e-01,-4.80e+00,
105,0.00e+00,-5.40e+00,
106,-4.00e-01,-4.80e+00,
107,2.00e-01,-5.20e+00,
108,-4.00e-01,-4.80e+00,
109,2.00e-01,-5.20e+00,
110,2.00e-01,-4.80e+00,
111,-4.00e-01,-5.20e+00,
112,2.00e-01,-4.80e+00,
113,-4.00e-01,-5.20e+00,
114,-2.00e-01,-5.20e+00,
115,4.00e-01,-4.60e+00,
116,-2.00e-01,-4.80e+00,
117,4.00e-01,-5.20e+00,
118,-2.00e-01,-4.80e+00,
119,4.00e-01,-5.20e+00,
120,-2.00e-01,-4.80e+00,
121,4.00e-01,-5.20e+00,
122,2.00e-01,-5.20e+00,
123,-2.00e-01,-4.80e+00,
124,-2.00e-01,-5.20e+00,
125,4.00e-01,-4.60e+00,
126,-2.00e-01,-4.60e+00,
127,4.00e-01,-5.20e+00,
128,2.00e-01,-5.20e+00,
129,-2.00e-01,-4.60e+00,
130,-2.00e-01,-4.80e+00,
131,2.00e-01,-5.20e+00,
132,2.00e-01,-4.80e+00,
133,-2.00e-01,-5.20e+00,
134,2.00e-01,-5.20e+00,
135,-4.00e-01,-4.60e+00,
136,2.00e-01,-5.20e+00,
137,-4.00e-01,-4.60e+00,
138,2.00e-01,-5.20e+00,
139,-4.00e-01,-4.80e+00,
140,2.00e-01,-5.20e+00,
141,-4.00e-01,-4.60e+00,
142,2.00e-01,-4.80e+00,
143,-4.00e-01,-5.20e+00,
144,2.00e-01,-4.80e+00,
145,-4.00e-01,-5.20e+00,
146,2.00e-01,-5.20e+00,
147,-4.00e-01,-4.60e+00,
148,2.00e-01,-5.20e+00,
149,-4.00e-01,-4.60e+00,
150,2.00e-01,-5.20e+00,
151,-4.00e-01,-4.60e+00,
152,2.00e-01,-5.20e+00,
153,-4.00e-01,-4.60e+00,
154,2.00e-01,-5.20e+00,
155,-4.00e-01,-4.60e+00,
156,2.00e-01,-5.20e+00,
157,-4.00e-01,-4.60e+00,
158,-4.00e-01,-5.20e+00,
159,2.00e-01,-4.60e+00,
160,2.00e-01,-5.20e+00,
161,-4.00e-01,-4.60e+00,
162,2.00e-01,-5.20e+00,
163,-4.00e-01,-4.60e+00,
164,2.00e-01,-4.60e+00,
165,-4.00e-01,-5.20e+00,
166,2.00e-01,-5.20e+00,
167,-4.00e-01,-4.60e+00,
168,2.00e-01,-5.20e+00,
169,-4.00e-01,-4.60e+00,
170,-4.00e-01,-5.20e+00,
171,2.00e-01,-4.60e+00,
172,2.00e-01,-4.60e+00,
173,-4.00e-01,-5.20e+00,
174,-4.00e-01,-4.60e+00,
175,2.00e-01,-5.20e+00,
176,2.00e-01,-4.60e+00,
177,-4.00e-01,-5.20e+00,
178,2.00e-01,-4.60e+00,
179,-4.00e-01,-5.20e+00,
180,2.00e-01,-4.60e+00,
181,-4.00e-01,-5.20e+00,
182,2.00e-01,-4.60e+00,
183,-4.00e-01,-5.20e+00,
184,-4.00e-01,-5.20e+00,
185,2.00e-01,-4.60e+00,
186,2.00e-01,-4.60e+00,
187,-4.00e-01,-5.20e+00,
188,2.00e-01,-4.60e+00,
189,-4.00e-01,-5.20e+00,
190,-4.00e-01,-4.60e+00,
191,2.00e-01,-5.20e+00,
192,2.00e-01,-4.60e+00,
193,-4.00e-01,-5.20e+00,
194,-4.00e-01,-4.60e+00,
195,2.00e-01,-5.20e+00,
196,-4.00e-01,-4.60e+00,
197,2.00e-01,-5.20e+00,
198,-4.00e-01,-4.60e+00,
199,2.00e-01,-5.20e+00,
200,2.00e-01,-4.60e+00,
201,-4.00e-01,-5.20e+00,
202,2.00e-01,-4.60e+00,
203,-4.00e-01,-5.20e+00,
204,2.00e-01,-4.60e+00,
205,-4.00e-01,-5.20e+00,
206,2.00e-01,-4.60e+00,
207,-4.00e-01,-5.20e+00,
208,2.00e-01,-4.60e+00,
209,-4.00e-01,-5.20e+00,
210,2.00e-01,-5.20e+00,
211,-4.00e-01,-4.60e+00,
212,2.00e-01,-4.60e+00,
213,-4.00e-01,-5.20e+00,
214,-4.00e-01,-4.60e+00,
215,2.00e-01,-5.20e+00,
216,2.00e-01,-4.60e+00,
217,-4.00e-01,-5.20e+00,
218,2.00e-01,-4.60e+00,
219,-4.00e-01,-5.20e+00,
220,-4.00e-01,-4.60e+00,
221,2.00e-01,-5.20e+00,
222,2.00e-01,-4.60e+00,
223,-4.00e-01,-5.20e+00,
224,-4.00e-01,-4.60e+00,
225,2.00e-01,-5.20e+00,
226,2.00e-01,-4.60e+00,
227,-4.00e-01,-5.20e+00,
228,-4.00e-01,-5.20e+00,
229,2.00e-01,-4.60e+00,
230,2.00e-01,-4.60e+00,
231,-4.00e-01,-5.20e+00,
232,2.00e-01,-5.20e+00,
233,-4.00e-01,-4.60e+00,
234,2.00e-01,-4.60e+00,
235,-4.00e-01,-5.20e+00,
236,2.00e-01,-4.60e+00,
237,-4.00e-01,-5.20e+00,
238,2.00e-01,-4.60e+00,
239,-4.00e-01,-5.20e+00,
240,2.00e-01,-4.60e+00,
241,-4.00e-01,-5.20e+00,
242,2.00e-01,-4.60e+00,
243,-4.00e-01,-5.20e+00,
244,-4.00e-01,-4.60e+00,
245,2.00e-01,-5.20e+00,
246,2.00e-01,-4.60e+00,
247,-4.00e-01,-5.20e+00,
248,2.00e-01,-4.60e+00,
249,-4.00e-01,-5.20e+00,
250,-4.00e-01,-5.20e+00,
251,2.00e-01,-4.60e+00,
252,2.00e-01,-4.60e+00,
253,-4.00e-01,-5.20e+00,
254,2.00e-01,-4.60e+00,
255,-4.00e-01,-5.20e+00,
256,2.00e-01,-4.60e+00,
257,-4.00e-01,-5.20e+00,
258,2.00e-01,-4.60e+00,
259,-4.00e-01,-5.20e+00,
260,2.00e-01,-5.20e+00,
261,-4.00e-01,-4.60e+00,
262,2.00e-01,-5.20e+00,
263,-4.00e-01,-4.60e+00,
264,2.00e-01,-5.20e+00,
265,-4.00e-01,-4.60e+00,
266,-4.00e-01,-4.60e+00,
267,2.00e-01,-5.20e+00,
268,2.00e-01,-4.60e+00,
269,-4.00e-01,-5.20e+00,
270,2.00e-01,-5.20e+00,
271,-4.00e-01,-4.60e+00,
272,2.00e-01,-5.20e+00,
273,-4.00e-01,-4.60e+00,
274,2.00e-01,-4.60e+00,
275,-4.00e-01,-5.20e+00,
276,2.00e-01,-4.60e+00,
277,-4.00e-01,-5.20e+00,
278,2.00e-01,-4.60e+00,
279,-4.00e-01,-5.20e+00,
280,2.00e-01,-4.60e+00,
281,-4.00e-01,-5.20e+00,
282,2.00e-01,-4.60e+00,
283,-4.00e-01,-5.20e+00,
284,2.00e-01,-4.60e+00,
285,-4.00e-01,-5.20e+00,
286,-4.00e-01,-4.60e+00,
287,2.00e-01,-5.20e+00,
288,2.00e-01,-4.60e+00,
289,-4.00e-01,-5.20e+00,
290,-4.00e-01,-4.60e+00,
291,2.00e-01,-5.20e+00,
292,2.00e-01,-4.60e+00,
293,-4.00e-01,-5.20e+00,
294,2.00e-01,-4.60e+00,
295,-4.00e-01,-5.20e+00,
296,2.00e-01,-4.60e+00,
297,-4.00e-01,-5.20e+00,
298,-4.00e-01,-5.20e+00,
299,2.02e+01,1.72e+01,
300,1.00e+01,1.58e+01,
301,1.36e+01,1.44e+01,
302,1.34e+01,1.54e+01,
303,1.18e+01,1.48e+01,
304,1.24e+01,1.48e+01,
305,1.08e+01,1.54e+01,
306,1.14e+01,1.50e+01,
307,9.60e+00,1.54e+01,
308,1.02e+01,1.50e+01,
309,8.40e+00,1.56e+01,
310,9.20e+00,1.54e+01,
311,7.40e+00,1.46e+01,
312,8.00e+00,1.54e+01,
313,6.40e+00,1.46e+01,
314,7.00e+00,1.54e+01,
315,5.60e+00,1.48e+01,
316,6.00e+00,1.46e+01,
317,4.80e+00,1.54e+01,
318,5.20e+00,1.54e+01,
319,3.80e+00,1.46e+01,
320,4.20e+00,1.46e+01,
321,3.20e+00,1.54e+01,
322,3.60e+00,1.52e+01,
323,2.60e+00,1.46e+01,
324,3.00e+00,1.46e+01,
325,2.00e+00,1.54e+01,
326,2.40e+00,1.46e+01,
327,1.60e+00,1.52e+01,
328,2.00e+00,1.46e+01,
329,1.20e+00,1.52e+01,
330,1.80e+00,1.52e+01,
331,1.00e+00,1.46e+01,
332,1.40e+00,1.52e+01,
333,8.00e-01,1.46e+01,
334,1.20e+00,1.46e+01,
335,6.00e-01,1.52e+01,
336,1.00e+00,1.46e+01,
337,4.00e-01,1.52e+01,
338,4.00e-01,1.50e+01,
339,8.00e-01,1.46e+01,
340,8.00e-01,1.50e+01,
341,0.00e+00,1.46e+01,
342,8.00e-01,1.50e+01,
343,0.00e+00,1.44e+01,
344,4.00e-01,1.50e+01,
345,0.00e+00,1.44e+01,
346,4.00e-01,1.46e+01,
347,-2.00e-01,1.50e+01,
348,-2.00e-01,1.44e+01,
349,4.00e-01,1.50e+01,
350,-2.00e-01,1.50e+01,
351,4.00e-01,1.44e+01,
352,-2.00e-01,1.44e+01,
353,4.00e-01,1.52e+01,
354,2.00e-01,1.44e+01,
355,-2.00e-01,1.50e+01,
356,2.00e-01,1.50e+01,
357,-2.00e-01,1.44e+01,
358,2.00e-01,1.44e+01,
359,-2.00e-01,1.50e+01,
360,2.00e-01,1.44e+01,
361,-2.00e-01,1.50e+01,
362,2.00e-01,1.44e+01,
363,-4.00e-01,1.50e+01,
364,2.00e-01,1.44e+01,
365,-4.00e-01,1.50e+01,
366,2.00e-01,1.50e+01,
367,-4.00e-01,1.44e+01,
368,2.00e-01,1.44e+01,
369,-4.00e-01,1.50e+01,
370,2.00e-01,1.50e+01,
371,-4.00e-01,1.44e+01,
372,2.00e-01,1.44e+01,
373,-4.00e-01,1.50e+01,
374,2.00e-01,1.50e+01,
375,-4.00e-01,1.44e+01,
376,2.00e-01,1.44e+01,
377,-4.00e-01,1.50e+01,
378,2.00e-01,1.44e+01,
379,-4.00e-01,1.50e+01,
380,2.00e-01,1.44e+01,
381,-4.00e-01,1.50e+01,
382,2.00e-01,1.44e+01,
383,-4.00e-01,1.50e+01,
384,2.00e-01,1.44e+01,
385,-4.00e-01,1.50e+01,
386,2.00e-01,1.44e+01,
387,-4.00e-01,1.50e+01,
388,2.00e-01,1.48e+01,
389,-4.00e-01,1.44e+01,
390,2.00e-01,1.48e+01,
391,-4.00e-01,1.44e+01,
392,2.00e-01,1.48e+01,
393,-4.00e-01,1.42e+01,
394,2.00e-01,1.48e+01,
395,-4.00e-01,1.42e+01,
396,-4.00e-01,1.50e+01,
397,2.00e-01,1.42e+01,
398,2.00e-01,1.48e+01,
399,-4.00e-01,1.44e+01,
400,2.00e-01,1.48e+01,
401,-4.00e-01,1.44e+01,
402,2.00e-01,1.44e+01,
403,-2.00e-01,1.50e+01,
404,2.00e-01,1.48e+01,
405,-2.00e-01,1.42e+01,
406,2.00e-01,1.48e+01,
407,-4.00e-01,1.42e+01,
408,2.00e-01,1.48e+01,
409,-2.00e-01,1.44e+01,
410,2.00e-01,1.50e+01,
411,-2.00e-01,1.42e+01,
412,2.00e-01,1.48e+01,
413,-4.00e-01,1.44e+01,
414,2.00e-01,1.48e+01,
415,-4.00e-01,1.42e+01,
416,2.00e-01,1.48e+01,
417,-4.00e-01,1.44e+01,
418,2.00e-01,1.48e+01,
419,-2.00e-01,1.42e+01,
420,2.00e-01,1.48e+01,
421,-4.00e-01,1.42e+01,
422,2.00e-01,1.48e+01,
423,-4.00e-01,1.42e+01,
424,2.00e-01,1.48e+01,
425,-4.00e-01,1.42e+01,
426,2.00e-01,1.48e+01,
427,-4.00e-01,1.42e+01,
428,2.00e-01,1.48e+01,
429,-4.00e-01,1.42e+01,
430,-4.00e-01,1.48e+01,
431,2.00e-01,1.42e+01,
432,2.00e-01,1.48e+01,
433,-4.00e-01,1.42e+01,
434,2.00e-01,1.48e+01,
435,-4.00e-01,1.42e+01,
436,2.00e-01,1.48e+01,
437,-4.00e-01,1.42e+01,
438,2.00e-01,1.48e+01,
439,-4.00e-01,1.42e+01,
440,2.00e-01,1.48e+01,
441,-4.00e-01,1.42e+01,
442,2.00e-01,1.48e+01,
443,-4.00e-01,1.42e+01,
444,2.00e-01,1.48e+01,
445,-4.00e-01,1.42e+01,
446,-4.00e-01,1.48e+01,
447,2.00e-01,1.42e+01,
448,2.00e-01,1.48e+01,
449,-4.00e-01,1.42e+01,
450,2.00e-01,1.48e+01,
451,-2.00e-01,1.42e+01,
452,2.00e-01,1.48e+01,
453,-4.00e-01,1.42e+01,
454,2.00e-01,1.48e+01,
455,-4.00e-01,1.42e+01,
456,2.00e-01,1.48e+01,
457,-2.00e-01,1.42e+01,
458,2.00e-01,1.48e+01,
459,-2.00e-01,1.42e+01,
460,2.00e-01,1.48e+01,
461,-4.00e-01,1.42e+01,
462,2.00e-01,1.42e+01,
463,-4.00e-01,1.48e+01,
464,2.00e-01,1.48e+01,
465,-4.00e-01,1.42e+01,
466,2.00e-01,1.48e+01,
467,-4.00e-01,1.42e+01,
468,2.00e-01,1.42e+01,
469,-4.00e-01,1.48e+01,
470,2.00e-01,1.48e+01,
471,-4.00e-01,1.42e+01,
472,-2.00e-01,1.48e+01,
473,2.00e-01,1.42e+01,
474,2.00e-01,1.48e+01,
475,-4.00e-01,1.42e+01,
476,2.00e-01,1.48e+01,
477,-4.00e-01,1.42e+01,
478,2.00e-01,1.48e+01,
479,-4.00e-01,1.42e+01,
480,2.00e-01,1.48e+01,
481,-4.00e-01,1.42e+01,
482,2.00e-01,1.48e+01,
483,-2.00e-01,1.42e+01,
484,2.00e-01,1.48e+01,
485,-4.00e-01,1.42e+01,
486,2.00e-01,1.48e+01,
487,-4.00e-01,1.42e+01,
488,2.00e-01,1.48e+01,
489,-4.00e-01,1.42e+01,
490,-2.00e-01,1.48e+01,
491,2.00e-01,1.42e+01,
492,2.00e-01,1.48e+01,
493,-4.00e-01,1.42e+01,
494,-4.00e-01,1.48e+01,
495,2.00e-01,1.42e+01,
496,2.00e-01,1.48e+01,
497,-4.00e-01,1.42e+01,
498,2.00e-01,1.48e+01,
499,-4.00e-01,1.42e+01,
500,2.00e-01,1.42e+01,
501,-4.00e-01,1.48e+01,
502,2.00e-01,1.48e+01,
503,-4.00e-01,1.42e+01,
504,2.00e-01,1.48e+01,
505,-4.00e-01,1.42e+01,
506,2.00e-01,1.48e+01,
507,-4.00e-01,1.42e+01,
508,2.00e-01,1.42e+01,
509,-4.00e-01,1.48e+01,
510,2.00e-01,1.42e+01,
511,-2.00e-01,1.48e+01,
512,2.00e-01,1.48e+01,
513,-4.00e-01,1.42e+01,
514,2.00e-01,1.48e+01,
515,-4.00e-01,1.42e+01,
516,2.00e-01,1.48e+01,
517,-4.00e-01,1.42e+01,
518,2.00e-01,1.42e+01,
519,-4.00e-01,1.48e+01,
520,2.00e-01,1.48e+01,
521,-2.00e-01,1.42e+01,
522,2.00e-01,1.48e+01,
523,-4.00e-01,1.42e+01,
524,2.00e-01,1.48e+01,
525,-4.00e-01,1.42e+01,
526,2.00e-01,1.48e+01,
527,-4.00e-01,1.42e+01,
528,2.00e-01,1.48e+01,
529,-4.00e-01,1.42e+01,
530,2.00e-01,1.48e+01,
531,-4.00e-01,1.42e+01,
532,2.00e-01,1.42e+01,
533,-4.00e-01,1.48e+01,
534,2.00e-01,1.48e+01,
535,-4.00e-01,1.42e+01,
536,2.00e-01,1.48e+01,
537,-4.00e-01,1.42e+01,
538,2.00e-01,1.48e+01,
539,-4.00e-01,1.42e+01,
540,2.00e-01,1.48e+01,
541,-4.00e-01,1.42e+01,
542,2.00e-01,1.48e+01,
543,-2.00e-01,1.42e+01,
544,2.00e-01,1.48e+01,
545,-4.00e-01,1.42e+01,
546,2.00e-01,1.48e+01,
547,-4.00e-01,1.42e+01,
548,2.00e-01,1.48e+01,
549,-2.30e+01,-9.20e+00,
550,-1.88e+01,-6.00e+00,
551,-1.36e+01,-4.80e+00,
552,-1.42e+01,-5.60e+00,
553,-1.10e+01,-5.00e+00,
554,-1.14e+01,-5.60e+00,
555,-8.80e+00,-5.20e+00,
556,-9.20e+00,-5.60e+00,
557,-7.60e+00,-5.00e+00,
558,-8.00e+00,-5.60e+00,
559,-6.80e+00,-5.00e+00,
560,-7.20e+00,-5.60e+00,
561,-6.20e+00,-5.00e+00,
562,-6.60e+00,-5.60e+00,
563,-5.40e+00,-5.00e+00,
564,-6.00e+00,-5.60e+00,
565,-5.00e+00,-5.00e+00,
566,-5.40e+00,-5.60e+00,
567,-4.80e+00,-5.00e+00,
568,-5.20e+00,-5.00e+00,
569,-4.40e+00,-5.60e+00,
570,-5.00e+00,-5.00e+00,
571,-4.20e+00,-5.60e+00,
572,-4.60e+00,-5.00e+00,
573,-4.00e+00,-5.60e+00,
574,-4.40e+00,-5.40e+00,
575,-3.60e+00,-4.80e+00,
576,-4.40e+00,-5.40e+00,
577,-3.60e+00,-5.00e+00,
578,-4.20e+00,-5.40e+00,
579,-3.40e+00,-4.80e+00,
580,-3.80e+00,-5.40e+00,
581,-3.00e+00,-4.80e+00,
582,-3.60e+00,-5.00e+00,
583,-2.80e+00,-5.40e+00,
584,-3.20e+00,-5.40e+00,
585,-2.40e+00,-4.80e+00,
586,-3.00e+00,-5.40e+00,
587,-2.20e+00,-4.80e+00,
588,-2.60e+00,-5.40e+00,
589,-1.80e+00,-4.80e+00,
590,-2.20e+00,-4.80e+00,
591,-1.40e+00,-5.40e+00,
592,-1.80e+00,-5.40e+00,
593,-1.00e+00,-4.80e+00,
594,-1.60e+00,-4.80e+00,
595,-8.00e-01,-5.40e+00,
596,-1.40e+00,-5.40e+00,
597,-6.00e-01,-4.80e+00,
598,-1.20e+00,-4.80e+00,
599,-4.00e-01,-5.40e+00,
600,-8.00e-01,-4.80e+00,
601,-2.00e-01,-5.40e+00,
602,-8.00e-01,-4.80e+00,
603,0.00e+00,-5.40e+00,
604,0.00e+00,-4.80e+00,
605,-6.00e-01,-5.40e+00,
606,-4.00e-01,-4.80e+00,
607,2.00e-01,-5.40e+00,
608,-4.00e-01,-4.80e+00,
609,2.00e-01,-5.40e+00,
610,2.00e-01,-4.80e+00,
611,-4.00e-01,-5.40e+00,
612,2.00e-01,-4.80e+00,
613,-2.00e-01,-5.20e+00,
614,-2.00e-01,-4.80e+00,
615,2.00e-01,-5.20e+00,
616,-2.00e-01,-4.80e+00,
617,4.00e-01,-5.20e+00,
618,-2.00e-01,-4.80e+00,
619,2.00e-01,-5.20e+00,
620,2.00e-01,-4.80e+00,
621,-2.00e-01,-5.20e+00,
622,-2.00e-01,-5.20e+00,
623,2.00e-01,-4.80e+00,
624,2.00e-01,-4.80e+00,
625,-2.00e-01,-5.20e+00,
626,-2.00e-01,-5.20e+00,
627,4.00e-01,-4.60e+00,
628,2.00e-01,-5.20e+00,
629,-2.00e-01,-4.80e+00,
630,2.00e-01,-5.20e+00,
631,-2.00e-01,-4.60e+00,
632,2.00e-01,-5.20e+00,
633,-2.00e-01,-4.60e+00,
634,2.00e-01,-5.20e+00,
635,-4.00e-01,-4.80e+00,
636,2.00e-01,-5.20e+00,
637,-4.00e-01,-4.60e+00,
638,2.00e-01,-5.20e+00,
639,-4.00e-01,-4.80e+00,
640,2.00e-01,-5.20e+00,
641,-4.00e-01,-4.60e+00,
642,2.00e-01,-5.20e+00,
643,-4.00e-01,-4.60e+00,
644,2.00e-01,-5.20e+00,
645,-4.00e-01,-4.60e+00,
646,2.00e-01,-5.20e+00,
647,-4.00e-01,-4.60e+00,
648,2.00e-01,-5.20e+00,
649,-4.00e-01,-4.60e+00,
650,2.00e-01,-5.20e+00,
651,-4.00e-01,-4.60e+00,
652,2.00e-01,-4.60e+00,
653,-4.00e-01,-5.20e+00,
654,2.00e-01,-5.20e+00,
655,-4.00e-01,-4.60e+00,
656,2.00e-01,-4.60e+00,
657,-4.00e-01,-5.20e+00,
658,-4.00e-01,-5.20e+00,
659,2.00e-01,-4.60e+00,
660,-4.00e-01,-5.20e+00,
661,2.00e-01,-4.60e+00,
662,2.00e-01,-5.20e+00,
663,-4.00e-01,-4.60e+00,
664,-4.00e-01,-5.20e+00,
665,2.00e-01,-4.60e+00,
666,2.00e-01,-4.60e+00,
667,-4.00e-01,-5.20e+00,
668,-4.00e-01,-5.20e+00,
669,2.00e-01,-4.60e+00,
670,-4.00e-01,-5.20e+00,
671,2.00e-01,-4.60e+00,
672,-4.00e-01,-4.60e+00,
673,2.00e-01,-5.20e+00,
674,-4.00e-01,-5.20e+00,
675,2.00e-01,-4.60e+00,
676,2.00e-01,-4.60e+00,
677,-4.00e-01,-5.20e+00,
678,-4.00e-01,-4.60e+00,
679,2.00e-01,-5.20e+00,
680,-4.00e-01,-5.20e+00,
681,2.00e-01,-4.60e+00,
682,2.00e-01,-4.60e+00,
683,-4.00e-01,-5.20e+00,
684,-4.00e-01,-5.20e+00,
685,2.00e-01,-4.60e+00,
686,-4.00e-01,-4.60e+00,
687,2.00e-01,-5.20e+00,
688,2.00e-01,-4.60e+00,
689,-4.00e-01,-5.20e+00,
690,2.00e-01,-5.20e+00,
691,-4.00e-01,-4.60e+00,
692,2.00e-01,-4.60e+00,
693,-4.00e-01,-5.20e+00,
694,2.00e-01,-4.60e+00,
695,-4.00e-01,-5.20e+00,
696,2.00e-01,-4.60e+00,
697,-4.00e-01,-5.20e+00,
698,2.00e-01,-4.60e+00,
699,-4.00e-01,-5.20e+00,
700,2.00e-01,-4.60e+00,
701,-4.00e-01,-5.20e+00,
702,2.00e-01,-4.60e+00,
703,-4.00e-01,-5.20e+00,
704,2.00e-01,-4.60e+00,
705,-4.00e-01,-5.20e+00,
706,2.00e-01,-4.60e+00,
707,-4.00e-01,-5.20e+00,
708,2.00e-01,-4.60e+00,
709,-4.00e-01,-5.20e+00,
710,2.00e-01,-4.60e+00,
711,-4.00e-01,-5.20e+00,
712,2.00e-01,-4.60e+00,
713,-4.00e-01,-5.20e+00,
714,2.00e-01,-4.60e+00,
715,-4.00e-01,-5.20e+00,
716,2.00e-01,-4.60e+00,
717,-4.00e-01,-5.20e+00,
718,2.00e-01,-4.60e+00,
719,-4.00e-01,-5.20e+00,
720,2.00e-01,-4.60e+00,
721,-4.00e-01,-5.20e+00,
722,2.00e-01,-4.60e+00,
723,-4.00e-01,-5.20e+00,
724,2.00e-01,-4.60e+00,
725,-4.00e-01,-5.20e+00,
726,2.00e-01,-5.20e+00,
727,-4.00e-01,-4.60e+00,
728,-4.00e-01,-5.20e+00,
729,2.00e-01,-4.60e+00,
730,2.00e-01,-4.60e+00,
731,-4.00e-01,-5.20e+00,
732,2.00e-01,-4.60e+00,
733,-4.00e-01,-5.20e+00,
734,-4.00e-01,-4.60e+00,
735,2.00e-01,-5.20e+00,
736,2.00e-01,-4.60e+00,
737,-4.00e-01,-5.20e+00,
738,2.00e-01,-4.60e+00,
739,-4.00e-01,-5.20e+00,
740,2.00e-01,-4.60e+00,
741,-4.00e-01,-5.20e+00,
742,2.00e-01,-4.60e+00,
743,-4.00e-01,-5.20e+00,
744,2.00e-01,-5.20e+00,
745,-4.00e-01,-4.60e+00,
746,2.00e-01,-4.60e+00,
747,-4.00e-01,-5.20e+00,
748,-4.00e-01,-4.60e+00,
749,2.00e-01,-5.20e+00,
750,2.00e-01,-5.20e+00,
751,-4.00e-01,-4.60e+00,
752,2.00e-01,-4.60e+00,
753,-4.00e-01,-5.20e+00,
754,2.00e-01,-4.60e+00,
755,-4.00e-01,-5.20e+00,
756,2.00e-01,-4.60e+00,
757,-4.00e-01,-5.20e+00,
758,2.00e-01,-4.60e+00,
759,-4.00e-01,-5.20e+00,
760,2.00e-01,-4.60e+00,
761,-4.00e-01,-5.20e+00,
762,-4.00e-01,-4.60e+00,
763,2.00e-01,-5.20e+00,
764,2.00e-01,-4.60e+00,
765,-4.00e-01,-5.20e+00,
766,2.00e-01,-4.60e+00,
767,-4.00e-01,-5.20e+00,
768,2.00e-01,-5.20e+00,
769,-4.00e-01,-4.60e+00,
770,2.00e-01,-4.60e+00,
771,-4.00e-01,-5.20e+00,
772,2.00e-01,-5.20e+00,
773,-4.00e-01,-4.60e+00,
774,2.00e-01,-4.60e+00,
775,-4.00e-01,-5.20e+00,
776,2.00e-01,-4.60e+00,
777,-4.00e-01,-5.20e+00,
778,2.00e-01,-4.60e+00,
779,-4.00e-01,-5.20e+00,
780,2.00e-01,-4.60e+00,
781,-4.00e-01,-5.20e+00,
782,-4.00e-01,-4.60e+00,
783,2.00e-01,-5.20e+00,
784,2.00e-01,-4.60e+00,
785,-4.00e-01,-5.20e+00,
786,2.00e-01,-5.20e+00,
787,-4.00e-01,-4.60e+00,
788,2.00e-01,-5.20e+00,
789,-4.00e-01,-4.60e+00,
790,2.00e-01,-4.60e+00,
791,-4.00e-01,-5.20e+00,
792,2.00e-01,-4.60e+00,
793,-4.00e-01,-5.20e+00,
794,2.00e-01,-4.60e+00,
795,-4.00e-01,-5.20e+00,
796,2.00e-01,-4.60e+00,
797,-4.00e-01,-5.20e+00,
798,-2.00e-01,-5.00e+00,
799,2.00e+01,1.74e+01,
800,1.02e+01,1.58e+01,
801,1.38e+01,1.44e+01,
802,1.32e+01,1.46e+01,
803,1.18e+01,1.56e+01,
804,1.24e+01,1.54e+01,
805,1.08e+01,1.48e+01,
806,1.14e+01,1.54e+01,
807,9.60e+00,1.48e+01,
808,1.02e+01,1.48e+01,
809,8.40e+00,1.54e+01,
810,9.00e+00,1.54e+01,
811,7.40e+00,1.48e+01,
812,8.00e+00,1.54e+01,
813,6.60e+00,1.48e+01,
814,6.80e+00,1.54e+01,
815,5.60e+00,1.48e+01,
816,6.00e+00,1.46e+01,
817,4.80e+00,1.54e+01,
818,5.40e+00,1.54e+01,
819,3.80e+00,1.46e+01,
820,4.20e+00,1.46e+01,
821,3.20e+00,1.54e+01,
822,3.60e+00,1.52e+01,
823,2.60e+00,1.46e+01,
824,3.00e+00,1.46e+01,
825,2.00e+00,1.54e+01,
826,2.40e+00,1.46e+01,
827,1.40e+00,1.52e+01,
828,2.00e+00,1.46e+01,
829,1.20e+00,1.52e+01,
830,1.80e+00,1.46e+01,
831,1.00e+00,1.52e+01,
832,1.40e+00,1.50e+01,
833,8.00e-01,1.46e+01,
834,1.20e+00,1.52e+01,
835,6.00e-01,1.46e+01,
836,1.00e+00,1.50e+01,
837,4.00e-01,1.46e+01,
838,4.00e-01,1.50e+01,
839,1.00e+00,1.46e+01,
840,8.00e-01,1.50e+01,
841,2.00e-01,1.46e+01,
842,6.00e-01,1.50e+01,
843,0.00e+00,1.46e+01,
844,6.00e-01,1.50e+01,
845,-2.00e-01,1.46e+01,
846,4.00e-01,1.50e+01,
847,-2.00e-01,1.44e+01,
848,-2.00e-01,1.50e+01,
849,4.00e-01,1.44e+01,
850,-2.00e-01,1.50e+01,
851,4.00e-01,1.44e+01,
852,-2.00e-01,1.50e+01,
853,2.00e-01,1.44e+01,
854,2.00e-01,1.50e+01,
855,-2.00e-01,1.44e+01,
856,2.00e-01,1.50e+01,
857,-4.00e-01,1.44e+01,
858,-2.00e-01,1.44e+01,
859,2.00e-01,1.50e+01,
860,2.00e-01,1.44e+01,
861,-4.00e-01,1.50e+01,
862,2.00e-01,1.50e+01,
863,-4.00e-01,1.44e+01,
864,2.00e-01,1.44e+01,
865,-4.00e-01,1.50e+01,
866,2.00e-01,1.44e+01,
867,-4.00e-01,1.50e+01,
868,2.00e-01,1.44e+01,
869,-4.00e-01,1.50e+01,
870,2.00e-01,1.44e+01,
871,-4.00e-01,1.50e+01,
872,2.00e-01,1.44e+01,
873,-4.00e-01,1.50e+01,
874,2.00e-01,1.50e+01,
875,-4.00e-01,1.44e+01,
876,2.00e-01,1.44e+01,
877,-4.00e-01,1.50e+01,
878,2.00e-01,1.44e+01,
879,-4.00e-01,1.50e+01,
880,2.00e-01,1.50e+01,
881,-4.00e-01,1.44e+01,
882,2.00e-01,1.44e+01,
883,-2.00e-01,1.50e+01,
884,2.00e-01,1.50e+01,
885,-2.00e-01,1.44e+01,
886,2.00e-01,1.44e+01,
887,-4.00e-01,1.50e+01,
888,2.00e-01,1.44e+01,
889,-4.00e-01,1.50e+01,
890,2.00e-01,1.44e+01,
891,-4.00e-01,1.50e+01,
892,2.00e-01,1.44e+01,
893,-4.00e-01,1.50e+01,
894,2.00e-01,1.44e+01,
895,-4.00e-01,1.50e+01,
896,2.00e-01,1.48e+01,
897,-4.00e-01,1.44e+01,
898,2.00e-01,1.48e+01,
899,-4.00e-01,1.44e+01,
900,2.00e-01,1.48e+01,
901,-4.00e-01,1.44e+01,
902,2.00e-01,1.48e+01,
903,-4.00e-01,1.44e+01,
904,2.00e-01,1.42e+01,
905,-4.00e-01,1.50e+01,
906,2.00e-01,1.48e+01,
907,-2.00e-01,1.44e+01,
908,2.00e-01,1.48e+01,
909,-4.00e-01,1.44e+01,
910,2.00e-01,1.48e+01,
911,-2.00e-01,1.46e+01,
912,2.00e-01,1.48e+01,
913,-4.00e-01,1.42e+01,
914,2.00e-01,1.48e+01,
915,-4.00e-01,1.42e+01,
916,2.00e-01,1.48e+01,
917,-4.00e-01,1.42e+01,
918,2.00e-01,1.48e+01,
919,-4.00e-01,1.42e+01,
920,2.00e-01,1.48e+01,
921,-2.00e-01,1.42e+01,
922,2.00e-01,1.44e+01,
923,-4.00e-01,1.48e+01,
924,2.00e-01,1.48e+01,
925,-4.00e-01,1.42e+01,
926,2.00e-01,1.48e+01,
927,-4.00e-01,1.42e+01,
928,2.00e-01,1.48e+01,
929,-4.00e-01,1.42e+01,
930,2.00e-01,1.42e+01,
931,-2.00e-01,1.48e+01,
932,2.00e-01,1.48e+01,
933,-4.00e-01,1.42e+01,
934,2.00e-01,1.48e+01,
935,-2.00e-01,1.42e+01,
936,2.00e-01,1.48e+01,
937,-4.00e-01,1.42e+01,
938,2.00e-01,1.48e+01,
939,-4.00e-01,1.42e+01,
940,2.00e-01,1.48e+01,
941,-2.00e-01,1.42e+01,
942,2.00e-01,1.48e+01,
943,-4.00e-01,1.42e+01,
944,-2.00e-01,1.48e+01,
945,4.00e-01,1.42e+01,
946,2.00e-01,1.48e+01,
947,-2.00e-01,1.42e+01,
948,2.00e-01,1.48e+01,
949,-4.00e-01,1.42e+01,
950,2.00e-01,1.48e+01,
951,-2.00e-01,1.42e+01,
952,2.00e-01,1.42e+01,
953,-2.00e-01,1.50e+01,
954,2.00e-01,1.48e+01,
955,-4.00e-01,1.42e+01,
956,2.00e-01,1.48e+01,
957,-4.00e-01,1.42e+01,
958,2.00e-01,1.48e+01,
959,-4.00e-01,1.42e+01,
960,2.00e-01,1.48e+01,
961,-2.00e-01,1.42e+01,
962,2.00e-01,1.48e+01,
963,-2.00e-01,1.42e+01,
964,2.00e-01,1.48e+01,
965,-4.00e-01,1.42e+01,
966,2.00e-01,1.48e+01,
967,-2.00e-01,1.42e+01,
968,2.00e-01,1.48e+01,
969,-2.00e-01,1.42e+01,
970,2.00e-01,1.48e+01,
971,-4.00e-01,1.42e+01,
972,2.00e-01,1.48e+01,
973,-2.00e-01,1.42e+01,
974,2.00e-01,1.48e+01,
975,-4.00e-01,1.42e+01,
976,2.00e-01,1.48e+01,
977,-4.00e-01,1.42e+01,
978,2.00e-01,1.48e+01,
979,-4.00e-01,1.42e+01,
980,2.00e-01,1.48e+01,
981,-4.00e-01,1.42e+01,
982,2.00e-01,1.42e+01,
983,-4.00e-01,1.48e+01,
984,2.00e-01,1.42e+01,
985,-4.00e-01,1.48e+01,
986,2.00e-01,1.42e+01,
987,-4.00e-01,1.48e+01,
988,2.00e-01,1.48e+01,
989,-4.00e-01,1.42e+01,
990,2.00e-01,1.42e+01,
991,-4.00e-01,1.48e+01,
992,2.00e-01,1.48e+01,
993,-4.00e-01,1.42e+01,
994,2.00e-01,1.48e+01,
995,-4.00e-01,1.42e+01,
996,2.00e-01,1.48e+01,
997,-4.00e-01,1.42e+01,
998,2.00e-01,1.48e+01,
999,-4.00e-01,1.42e+01,
1000,2.00e-01,1.48e+01,
1001,-2.00e-01,1.42e+01,
1002,2.00e-01,1.48e+01,
1003,-4.00e-01,1.42e+01,
1004,2.00e-01,1.48e+01,
1005,-2.00e-01,1.42e+01,
1006,2.00e-01,1.42e+01,
1007,-4.00e-01,1.48e+01,
1008,2.00e-01,1.48e+01,
1009,-4.00e-01,1.42e+01,
1010,2.00e-01,1.48e+01,
1011,-4.00e-01,1.42e+01,
1012,2.00e-01,1.48e+01,
1013,-4.00e-01,1.42e+01,
1014,2.00e-01,1.48e+01,
1015,-4.00e-01,1.42e+01,
1016,2.00e-01,1.42e+01,
1017,-4.00e-01,1.48e+01,
1018,2.00e-01,1.48e+01,
1019,-4.00e-01,1.42e+01,
1020,2.00e-01,1.48e+01,
1021,-4.00e-01,1.42e+01,
1022,2.00e-01,1.48e+01,
1023,-2.00e-01,1.42e+01,
1024,2.00e-01,1.48e+01,
1025,-2.00e-01,1.42e+01,
1026,2.00e-01,1.48e+01,
1027,-4.00e-01,1.42e+01,
1028,2.00e-01,1.48e+01,
1029,-2.00e-01,1.42e+01,
1030,2.00e-01,1.48e+01,
1031,-2.00e-01,1.42e+01,
1032,2.00e-01,1.48e+01,
1033,-2.00e-01,1.42e+01,
1034,2.00e-01,1.48e+01,
1035,-4.00e-01,1.42e+01,
1036,2.00e-01,1.42e+01,
1037,-2.00e-01,1.50e+01,
1038,2.00e-01,1.48e+01,
1039,-2.00e-01,1.42e+01,
1040,2.00e-01,1.48e+01,
1041,-2.00e-01,1.42e+01,
1042,2.00e-01,1.42e+01,
1043,-2.00e-01,1.50e+01,
1044,2.00e-01,1.48e+01,
1045,-2.00e-01,1.42e+01,
1046,2.00e-01,1.48e+01,
1047,-4.00e-01,1.42e+01,
1048,2.00e-01,1.48e+01,
1049,-2.22e+01,-8.60e+00,
1050,-1.88e+01,-4.40e+00,
1051,-1.40e+01,-6.00e+00,
1052,-1.40e+01,-5.00e+00,
1053,-1.10e+01,-5.60e+00,
1054,-1.14e+01,-5.60e+00,
1055,-8.80e+00,-5.00e+00,
1056,-9.20e+00,-5.00e+00,
1057,-7.60e+00,-5.60e+00,
1058,-8.00e+00,-5.60e+00,
1059,-6.80e+00,-5.00e+00,
1060,-7.20e+00,-5.60e+00,
1061,-6.20e+00,-5.00e+00,
1062,-6.60e+00,-5.60e+00,
1063,-5.40e+00,-5.00e+00,
1064,-6.00e+00,-5.60e+00,
1065,-5.00e+00,-5.00e+00,
1066,-5.40e+00,-5.60e+00,
1067,-4.60e+00,-5.00e+00,
1068,-5.20e+00,-5.00e+00,
1069,-4.40e+00,-5.60e+00,
1070,-4.80e+00,-5.00e+00,
1071,-4.20e+00,-5.60e+00,
1072,-4.60e+00,-5.00e+00,
1073,-4.00e+00,-5.60e+00,
1074,-4.40e+00,-5.00e+00,
1075,-3.60e+00,-5.40e+00,
1076,-4.40e+00,-5.40e+00,
1077,-3.60e+00,-5.00e+00,
1078,-4.20e+00,-5.00e+00,
1079,-3.40e+00,-5.40e+00,
1080,-3.80e+00,-5.00e+00,
1081,-3.00e+00,-5.40e+00,
1082,-3.60e+00,-5.40e+00,
1083,-2.80e+00,-4.80e+00,
1084,-3.20e+00,-5.00e+00,
1085,-2.40e+00,-5.40e+00,
1086,-2.80e+00,-5.40e+00,
1087,-2.20e+00,-4.80e+00,
1088,-2.60e+00,-5.40e+00,
1089,-1.80e+00,-4.80e+00,
1090,-2.20e+00,-4.80e+00,
1091,-1.40e+00,-5.40e+00,
1092,-1.80e+00,-5.40e+00,
1093,-1.00e+00,-4.80e+00,
1094,-1.60e+00,-4.80e+00,
1095,-8.00e-01,-5.40e+00,
1096,-1.40e+00,-4.80e+00,
1097,-6.00e-01,-5.40e+00,
1098,-1.00e+00,-4.80e+00,
1099,-4.00e-01,-5.40e+00,
1100,-8.00e-01,-4.80e+00,
1101,-2.00e-01,-5.40e+00,
1102,-6.00e-01,-4.80e+00,
1103,0.00e+00,-5.20e+00,
1104,0.00e+00,-4.80e+00,
1105,-6.00e-01,-5.40e+00,
1106,-4.00e-01,-4.80e+00,
1107,2.00e-01,-5.40e+00,
1108,2.00e-01,-4.80e+00,
1109,-4.00e-01,-5.20e+00,
1110,2.00e-01,-4.80e+00,
1111,-4.00e-01,-5.20e+00,
1112,2.00e-01,-5.00e+00,
1113,-2.00e-01,-4.80e+00,
1114,2.00e-01,-4.80e+00,
1115,-2.00e-01,-5.40e+00,
1116,-2.00e-01,-4.80e+00,
1117,6.00e-01,-5.20e+00,
1118,-2.00e-01,-4.80e+00,
1119,4.00e-01,-5.20e+00,
1120,-2.00e-01,-5.20e+00,
1121,4.00e-01,-4.80e+00,
1122,2.00e-01,-5.20e+00,
1123,-2.00e-01,-4.80e+00,
1124,2.00e-01,-5.20e+00,
1125,-2.00e-01,-4.60e+00,
1126,2.00e-01,-5.20e+00,
1127,-2.00e-01,-4.80e+00,
1128,2.00e-01,-4.80e+00,
1129,-2.00e-01,-5.20e+00,
1130,2.00e-01,-4.80e+00,
1131,-2.00e-01,-5.20e+00,
1132,2.00e-01,-5.20e+00,
1133,-2.00e-01,-4.60e+00,
1134,2.00e-01,-5.20e+00,
1135,-4.00e-01,-4.60e+00,
1136,2.00e-01,-5.20e+00,
1137,-2.00e-01,-4.60e+00,
1138,2.00e-01,-5.20e+00,
1139,-4.00e-01,-4.60e+00,
1140,2.00e-01,-5.20e+00,
1141,-4.00e-01,-4.60e+00,
1142,2.00e-01,-5.20e+00,
1143,-4.00e-01,-4.60e+00,
1144,2.00e-01,-5.20e+00,
1145,-4.00e-01,-4.60e+00,
1146,2.00e-01,-5.20e+00,
1147,-4.00e-01,-4.60e+00,
1148,2.00e-01,-5.20e+00,
1149,-4.00e-01,-4.60e+00,
1150,-4.00e-01,-5.20e+00,
1151,2.00e-01,-4.60e+00,
1152,2.00e-01,-5.20e+00,
1153,-4.00e-01,-4.60e+00,
1154,2.00e-01,-4.60e+00,
1155,-4.00e-01,-5.20e+00,
1156,2.00e-01,-5.20e+00,
1157,-4.00e-01,-4.60e+00,
1158,2.00e-01,-5.20e+00,
1159,-4.00e-01,-4.60e+00,
1160,2.00e-01,-5.20e+00,
1161,-4.00e-01,-4.60e+00,
1162,2.00e-01,-4.60e+00,
1163,-4.00e-01,-5.20e+00,
1164,2.00e-01,-5.20e+00,
1165,-4.00e-01,-4.60e+00,
1166,-4.00e-01,-4.60e+00,
1167,2.00e-01,-5.20e+00,
1168,-4.00e-01,-5.20e+00,
1169,2.00e-01,-4.60e+00,
1170,2.00e-01,-5.20e+00,
1171,-4.00e-01,-4.60e+00,
1172,2.00e-01,-4.60e+00,
1173,-4.00e-01,-5.20e+00,
1174,2.00e-01,-5.20e+00,
1175,-4.00e-01,-4.60e+00,
1176,-4.00e-01,-4.60e+00,
1177,2.00e-01,-5.20e+00,
1178,2.00e-01,-4.60e+00,
1179,-4.00e-01,-5.20e+00,
1180,-4.00e-01,-5.20e+00,
1181,2.00e-01,-4.60e+00,
1182,2.00e-01,-5.20e+00,
1183,-4.00e-01,-4.60e+00,
1184,-4.00e-01,-5.20e+00,
1185,2.00e-01,-4.60e+00,
1186,-4.00e-01,-5.20e+00,
1187,2.00e-01,-4.60e+00,
1188,2.00e-01,-4.60e+00,
1189,-4.00e-01,-5.20e+00,
1190,-4.00e-01,-5.20e+00,
1191,2.00e-01,-4.60e+00,
1192,-4.00e-01,-5.20e+00,
1193,2.00e-01,-4.60e+00,
1194,-4.00e-01,-5.20e+00,
1195,2.00e-01,-4.60e+00,
1196,-4.00e-01,-5.20e+00,
1197,2.00e-01,-4.60e+00,
1198,-4.00e-01,-5.20e+00,
1199,2.00e-01,-4.60e+00,
