(kicad_sch (version 20211123) (generator eeschema)

  (uuid c04a8b9f-0a96-4633-a91f-b11fafedf343)

  (paper "A4")

  (lib_symbols
    (symbol "Connector:Conn_Coaxial" (pin_names (offset 1.016) hide) (in_bom yes) (on_board yes)
      (property "Reference" "J" (id 0) (at 0.254 3.048 0)
        (effects (font (size 1.27 1.27)))
      )
      (property "Value" "Conn_Coaxial" (id 1) (at 2.921 0 90)
        (effects (font (size 1.27 1.27)))
      )
      (property "Footprint" "" (id 2) (at 0 0 0)
        (effects (font (size 1.27 1.27)) hide)
      )
      (property "Datasheet" " ~" (id 3) (at 0 0 0)
        (effects (font (size 1.27 1.27)) hide)
      )
      (property "ki_keywords" "BNC SMA SMB SMC LEMO coaxial connector CINCH RCA" (id 4) (at 0 0 0)
        (effects (font (size 1.27 1.27)) hide)
      )
      (property "ki_description" "coaxial connector (BNC, SMA, SMB, SMC, Cinch/RCA, LEMO, ...)" (id 5) (at 0 0 0)
        (effects (font (size 1.27 1.27)) hide)
      )
      (property "ki_fp_filters" "*BNC* *SMA* *SMB* *SMC* *Cinch* *LEMO*" (id 6) (at 0 0 0)
        (effects (font (size 1.27 1.27)) hide)
      )
      (symbol "Conn_Coaxial_0_1"
        (arc (start -1.778 -0.508) (mid 0.222 -1.808) (end 1.778 0)
          (stroke (width 0.254) (type default) (color 0 0 0 0))
          (fill (type none))
        )
        (polyline
          (pts
            (xy -2.54 0)
            (xy -0.508 0)
          )
          (stroke (width 0) (type default) (color 0 0 0 0))
          (fill (type none))
        )
        (polyline
          (pts
            (xy 0 -2.54)
            (xy 0 -1.778)
          )
          (stroke (width 0) (type default) (color 0 0 0 0))
          (fill (type none))
        )
        (circle (center 0 0) (radius 0.508)
          (stroke (width 0.2032) (type default) (color 0 0 0 0))
          (fill (type none))
        )
        (arc (start 1.778 0) (mid 0.222 1.8083) (end -1.778 0.508)
          (stroke (width 0.254) (type default) (color 0 0 0 0))
          (fill (type none))
        )
      )
      (symbol "Conn_Coaxial_1_1"
        (pin passive line (at -5.08 0 0) (length 2.54)
          (name "In" (effects (font (size 1.27 1.27))))
          (number "1" (effects (font (size 1.27 1.27))))
        )
        (pin passive line (at 0 -5.08 90) (length 2.54)
          (name "Ext" (effects (font (size 1.27 1.27))))
          (number "2" (effects (font (size 1.27 1.27))))
        )
      )
    )
    (symbol "Device:C" (pin_numbers hide) (pin_names (offset 0.254)) (in_bom yes) (on_board yes)
      (property "Reference" "C" (id 0) (at 0.635 2.54 0)
        (effects (font (size 1.27 1.27)) (justify left))
      )
      (property "Value" "C" (id 1) (at 0.635 -2.54 0)
        (effects (font (size 1.27 1.27)) (justify left))
      )
      (property "Footprint" "" (id 2) (at 0.9652 -3.81 0)
        (effects (font (size 1.27 1.27)) hide)
      )
      (property "Datasheet" "~" (id 3) (at 0 0 0)
        (effects (font (size 1.27 1.27)) hide)
      )
      (property "ki_keywords" "cap capacitor" (id 4) (at 0 0 0)
        (effects (font (size 1.27 1.27)) hide)
      )
      (property "ki_description" "Unpolarized capacitor" (id 5) (at 0 0 0)
        (effects (font (size 1.27 1.27)) hide)
      )
      (property "ki_fp_filters" "C_*" (id 6) (at 0 0 0)
        (effects (font (size 1.27 1.27)) hide)
      )
      (symbol "C_0_1"
        (polyline
          (pts
            (xy -2.032 -0.762)
            (xy 2.032 -0.762)
          )
          (stroke (width 0.508) (type default) (color 0 0 0 0))
          (fill (type none))
        )
        (polyline
          (pts
            (xy -2.032 0.762)
            (xy 2.032 0.762)
          )
          (stroke (width 0.508) (type default) (color 0 0 0 0))
          (fill (type none))
        )
      )
      (symbol "C_1_1"
        (pin passive line (at 0 3.81 270) (length 2.794)
          (name "~" (effects (font (size 1.27 1.27))))
          (number "1" (effects (font (size 1.27 1.27))))
        )
        (pin passive line (at 0 -3.81 90) (length 2.794)
          (name "~" (effects (font (size 1.27 1.27))))
          (number "2" (effects (font (size 1.27 1.27))))
        )
      )
    )
    (symbol "Device:L" (pin_numbers hide) (pin_names (offset 1.016) hide) (in_bom yes) (on_board yes)
      (property "Reference" "L" (id 0) (at -1.27 0 90)
        (effects (font (size 1.27 1.27)))
      )
      (property "Value" "L" (id 1) (at 1.905 0 90)
        (effects (font (size 1.27 1.27)))
      )
      (property "Footprint" "" (id 2) (at 0 0 0)
        (effects (font (size 1.27 1.27)) hide)
      )
      (property "Datasheet" "~" (id 3) (at 0 0 0)
        (effects (font (size 1.27 1.27)) hide)
      )
      (property "ki_keywords" "inductor choke coil reactor magnetic" (id 4) (at 0 0 0)
        (effects (font (size 1.27 1.27)) hide)
      )
      (property "ki_description" "Inductor" (id 5) (at 0 0 0)
        (effects (font (size 1.27 1.27)) hide)
      )
      (property "ki_fp_filters" "Choke_* *Coil* Inductor_* L_*" (id 6) (at 0 0 0)
        (effects (font (size 1.27 1.27)) hide)
      )
      (symbol "L_0_1"
        (arc (start 0 -2.54) (mid 0.635 -1.905) (end 0 -1.27)
          (stroke (width 0) (type default) (color 0 0 0 0))
          (fill (type none))
        )
        (arc (start 0 -1.27) (mid 0.635 -0.635) (end 0 0)
          (stroke (width 0) (type default) (color 0 0 0 0))
          (fill (type none))
        )
        (arc (start 0 0) (mid 0.635 0.635) (end 0 1.27)
          (stroke (width 0) (type default) (color 0 0 0 0))
          (fill (type none))
        )
        (arc (start 0 1.27) (mid 0.635 1.905) (end 0 2.54)
          (stroke (width 0) (type default) (color 0 0 0 0))
          (fill (type none))
        )
      )
      (symbol "L_1_1"
        (pin passive line (at 0 3.81 270) (length 1.27)
          (name "1" (effects (font (size 1.27 1.27))))
          (number "1" (effects (font (size 1.27 1.27))))
        )
        (pin passive line (at 0 -3.81 90) (length 1.27)
          (name "2" (effects (font (size 1.27 1.27))))
          (number "2" (effects (font (size 1.27 1.27))))
        )
      )
    )
    (symbol "RF_Amplifier:ADL5610" (in_bom yes) (on_board yes)
      (property "Reference" "U" (id 0) (at -1.27 7.62 0)
        (effects (font (size 1.27 1.27)))
      )
      (property "Value" "ADL5610" (id 1) (at 2.54 5.08 0)
        (effects (font (size 1.27 1.27)))
      )
      (property "Footprint" "Package_TO_SOT_SMD:SOT-89-3" (id 2) (at 1.27 10.16 0)
        (effects (font (size 1.27 1.27)) hide)
      )
      (property "Datasheet" "https://www.analog.com/media/en/technical-documentation/data-sheets/ADL5610.pdf" (id 3) (at 0 0 0)
        (effects (font (size 1.27 1.27)) hide)
      )
      (property "ki_keywords" "RF GAIN BLOCK" (id 4) (at 0 0 0)
        (effects (font (size 1.27 1.27)) hide)
      )
      (property "ki_description" "30-6000MHz RF/IF +18.4dB gain block, SOT-89" (id 5) (at 0 0 0)
        (effects (font (size 1.27 1.27)) hide)
      )
      (property "ki_fp_filters" "SOT?89*" (id 6) (at 0 0 0)
        (effects (font (size 1.27 1.27)) hide)
      )
      (symbol "ADL5610_0_1"
        (polyline
          (pts
            (xy 5.08 0)
            (xy -5.08 5.08)
            (xy -5.08 -5.08)
            (xy 5.08 0)
          )
          (stroke (width 0.254) (type default) (color 0 0 0 0))
          (fill (type background))
        )
      )
      (symbol "ADL5610_1_1"
        (pin input line (at -7.62 0 0) (length 2.54)
          (name "~" (effects (font (size 1.27 1.27))))
          (number "1" (effects (font (size 1.27 1.27))))
        )
        (pin power_in line (at -2.54 -7.62 90) (length 3.81)
          (name "GND" (effects (font (size 1.27 1.27))))
          (number "2" (effects (font (size 1.27 1.27))))
        )
        (pin output line (at 7.62 0 180) (length 2.54)
          (name "~" (effects (font (size 1.27 1.27))))
          (number "3" (effects (font (size 1.27 1.27))))
        )
      )
    )
    (symbol "power:GND" (power) (pin_names (offset 0)) (in_bom yes) (on_board yes)
      (property "Reference" "#PWR" (id 0) (at 0 -6.35 0)
        (effects (font (size 1.27 1.27)) hide)
      )
      (property "Value" "GND" (id 1) (at 0 -3.81 0)
        (effects (font (size 1.27 1.27)))
      )
      (property "Footprint" "" (id 2) (at 0 0 0)
        (effects (font (size 1.27 1.27)) hide)
      )
      (property "Datasheet" "" (id 3) (at 0 0 0)
        (effects (font (size 1.27 1.27)) hide)
      )
      (property "ki_keywords" "power-flag" (id 4) (at 0 0 0)
        (effects (font (size 1.27 1.27)) hide)
      )
      (property "ki_description" "Power symbol creates a global label with name \"GND\" , ground" (id 5) (at 0 0 0)
        (effects (font (size 1.27 1.27)) hide)
      )
      (symbol "GND_0_1"
        (polyline
          (pts
            (xy 0 0)
            (xy 0 -1.27)
            (xy 1.27 -1.27)
            (xy 0 -2.54)
            (xy -1.27 -1.27)
            (xy 0 -1.27)
          )
          (stroke (width 0) (type default) (color 0 0 0 0))
          (fill (type none))
        )
      )
      (symbol "GND_1_1"
        (pin power_in line (at 0 0 270) (length 0) hide
          (name "GND" (effects (font (size 1.27 1.27))))
          (number "1" (effects (font (size 1.27 1.27))))
        )
      )
    )
  )

  (junction (at 125.73 46.355) (diameter 0) (color 0 0 0 0)
    (uuid 3ba9c81c-cbff-40c6-95e4-3598a16565f6)
  )
  (junction (at 125.73 73.66) (diameter 0) (color 0 0 0 0)
    (uuid 452e83e2-6e9b-4896-90f0-cb5ec9a516f3)
  )

  (polyline (pts (xy 104.775 54.61) (xy 151.13 54.61))
    (stroke (width 0) (type default) (color 0 0 0 0))
    (uuid 072f4c94-f38d-4ebe-a49b-43c54de5a831)
  )
  (polyline (pts (xy 81.28 57.785) (xy 81.28 79.375))
    (stroke (width 0) (type default) (color 0 0 0 0))
    (uuid 08c701f2-bffa-4254-bb75-059033876bb2)
  )

  (wire (pts (xy 145.415 73.66) (xy 151.13 73.66))
    (stroke (width 0) (type default) (color 0 0 0 0))
    (uuid 187ef990-f4be-4599-87f0-67228a93fac3)
  )
  (polyline (pts (xy 136.525 79.375) (xy 151.13 79.375))
    (stroke (width 0) (type default) (color 0 0 0 0))
    (uuid 1d0f8e2e-cf3e-4e72-978a-c389d6a196ac)
  )
  (polyline (pts (xy 112.395 57.785) (xy 112.395 79.375))
    (stroke (width 0) (type default) (color 0 0 0 0))
    (uuid 387eede2-c15d-42a7-b53f-ae4c171096f5)
  )

  (wire (pts (xy 125.73 71.755) (xy 125.73 73.66))
    (stroke (width 0) (type default) (color 0 0 0 0))
    (uuid 3eae78e9-7c70-456c-af34-a4f5765a9543)
  )
  (polyline (pts (xy 151.13 57.785) (xy 136.525 57.785))
    (stroke (width 0) (type default) (color 0 0 0 0))
    (uuid 3f078dcc-ae71-4248-a4f4-6e6ff0aeb15d)
  )
  (polyline (pts (xy 81.28 79.375) (xy 95.885 79.375))
    (stroke (width 0) (type default) (color 0 0 0 0))
    (uuid 4289a8b7-5158-43d5-9353-6536afc63f8c)
  )
  (polyline (pts (xy 130.175 79.375) (xy 130.175 57.785))
    (stroke (width 0) (type default) (color 0 0 0 0))
    (uuid 4b194baa-2431-4ed0-ac6c-1db6b872372c)
  )

  (wire (pts (xy 125.73 26.035) (xy 125.73 46.355))
    (stroke (width 0) (type default) (color 0 0 0 0))
    (uuid 50d20f4e-cc11-43ca-a8ea-c4bd88a71365)
  )
  (wire (pts (xy 71.755 73.66) (xy 85.09 73.66))
    (stroke (width 0) (type default) (color 0 0 0 0))
    (uuid 5bfaf067-f00d-40b9-af96-33b29de098ca)
  )
  (wire (pts (xy 125.73 26.035) (xy 126.365 26.035))
    (stroke (width 0) (type default) (color 0 0 0 0))
    (uuid 696157d0-f4f3-431d-88e8-a8f85204e316)
  )
  (wire (pts (xy 118.11 46.355) (xy 125.73 46.355))
    (stroke (width 0) (type default) (color 0 0 0 0))
    (uuid 7302719c-a125-4830-ae72-480c146d514a)
  )
  (polyline (pts (xy 95.885 79.375) (xy 95.885 57.785))
    (stroke (width 0) (type default) (color 0 0 0 0))
    (uuid 73133231-a156-42e5-8065-4dfc6d3b31b5)
  )
  (polyline (pts (xy 151.13 79.375) (xy 151.13 57.785))
    (stroke (width 0) (type default) (color 0 0 0 0))
    (uuid 81c71d85-efa1-487f-a18a-f7d8cacd38fa)
  )

  (wire (pts (xy 112.395 73.66) (xy 125.73 73.66))
    (stroke (width 0) (type default) (color 0 0 0 0))
    (uuid 87c48847-4082-45ba-b865-af9d4c654788)
  )
  (polyline (pts (xy 112.395 79.375) (xy 130.175 79.375))
    (stroke (width 0) (type default) (color 0 0 0 0))
    (uuid 8b33f57e-8d3e-4abe-85a7-65c55fb58588)
  )
  (polyline (pts (xy 104.775 32.385) (xy 151.13 32.385))
    (stroke (width 0) (type default) (color 0 0 0 0))
    (uuid 95f18c33-49c2-4317-9380-b370b1e80dac)
  )
  (polyline (pts (xy 95.885 57.785) (xy 81.28 57.785))
    (stroke (width 0) (type default) (color 0 0 0 0))
    (uuid 9a3bbd50-237b-4bfc-a06a-e3b9c0bd8207)
  )

  (wire (pts (xy 92.71 73.66) (xy 97.155 73.66))
    (stroke (width 0) (type default) (color 0 0 0 0))
    (uuid 9c2d0c91-4089-423c-bf5b-eb6f5eff255b)
  )
  (wire (pts (xy 125.73 46.355) (xy 135.255 46.355))
    (stroke (width 0) (type default) (color 0 0 0 0))
    (uuid a4a2a681-726a-4510-b0a7-1c772b64c532)
  )
  (polyline (pts (xy 136.525 57.785) (xy 136.525 79.375))
    (stroke (width 0) (type default) (color 0 0 0 0))
    (uuid a9c0685b-6ce5-4ff1-9beb-8e472978dedd)
  )
  (polyline (pts (xy 130.175 57.785) (xy 112.395 57.785))
    (stroke (width 0) (type default) (color 0 0 0 0))
    (uuid ac3a3535-ab25-4ea7-9997-a3a3a7ad77f5)
  )
  (polyline (pts (xy 104.775 54.61) (xy 104.775 32.385))
    (stroke (width 0) (type default) (color 0 0 0 0))
    (uuid c071c532-4fd4-414e-9213-7c7549c8bed6)
  )

  (wire (pts (xy 142.875 46.355) (xy 142.875 46.99))
    (stroke (width 0) (type default) (color 0 0 0 0))
    (uuid c1dee64e-71a9-444d-be78-8c18a2b24d44)
  )
  (wire (pts (xy 125.73 46.355) (xy 125.73 64.135))
    (stroke (width 0) (type default) (color 0 0 0 0))
    (uuid c2aeff83-cf67-43b1-995a-41d0f606f510)
  )
  (wire (pts (xy 125.73 73.66) (xy 137.795 73.66))
    (stroke (width 0) (type default) (color 0 0 0 0))
    (uuid c9a4103a-8e82-452d-8969-b5622d227025)
  )
  (wire (pts (xy 110.49 46.355) (xy 110.49 46.99))
    (stroke (width 0) (type default) (color 0 0 0 0))
    (uuid d753c034-780c-4228-b014-97000b909556)
  )
  (polyline (pts (xy 151.13 32.385) (xy 151.13 54.61))
    (stroke (width 0) (type default) (color 0 0 0 0))
    (uuid dad60de3-e7c7-447c-b0d1-e4fa801bc8e9)
  )

  (text "DC block" (at 81.915 60.96 0)
    (effects (font (size 1.27 1.27)) (justify left bottom))
    (uuid 2595d668-5cd7-4043-a16b-b89ca36679bc)
  )
  (text "DC noise reduce" (at 133.985 35.56 0)
    (effects (font (size 1.27 1.27)) (justify left bottom))
    (uuid 3a710ad1-7159-4a30-b644-643698af0013)
  )
  (text "DC block" (at 137.16 60.96 0)
    (effects (font (size 1.27 1.27)) (justify left bottom))
    (uuid 5e1c7ef6-b2d7-4117-b8f7-c37640930174)
  )
  (text "RF block" (at 116.205 60.96 0)
    (effects (font (size 1.27 1.27)) (justify left bottom))
    (uuid 6cf8a524-d7fc-43a7-b6ef-e45d8b1d713b)
  )
  (text "footprint fehlt\n" (at 115.57 78.74 0)
    (effects (font (size 1.27 1.27)) (justify left bottom))
    (uuid e4a48658-cefd-4f0b-9e44-9c418792e486)
  )

  (global_label "Vcc" (shape input) (at 126.365 26.035 0) (fields_autoplaced)
    (effects (font (size 1.27 1.27)) (justify left))
    (uuid 2f8d8737-edb9-4cbf-9636-b5c12a5f1578)
    (property "Intersheet References" "${INTERSHEET_REFS}" (id 0) (at 132.0438 25.9556 0)
      (effects (font (size 1.27 1.27)) (justify left) hide)
    )
  )

  (symbol (lib_id "Device:L") (at 125.73 67.945 0) (unit 1)
    (in_bom yes) (on_board yes)
    (uuid 198efdfd-062c-4896-8cab-2695902271f0)
    (property "Reference" "L1" (id 0) (at 120.65 67.31 0)
      (effects (font (size 1.27 1.27)) (justify left))
    )
    (property "Value" "6,5u" (id 1) (at 120.65 69.215 0)
      (effects (font (size 1.27 1.27)) (justify left))
    )
    (property "Footprint" "Library:BCR-652JLC" (id 2) (at 125.73 67.945 0)
      (effects (font (size 1.27 1.27)) hide)
    )
    (property "Datasheet" "~" (id 3) (at 125.73 67.945 0)
      (effects (font (size 1.27 1.27)) hide)
    )
    (pin "1" (uuid ed7e357b-8a93-4d4a-bfd1-9cbda82b3008))
    (pin "2" (uuid 376a7fa1-90b3-4380-ab37-4c7ef319d2ed))
  )

  (symbol (lib_id "Connector:Conn_Coaxial") (at 156.21 73.66 0) (unit 1)
    (in_bom yes) (on_board yes) (fields_autoplaced)
    (uuid 58a2c676-8870-4a27-8001-2b59d129aa6d)
    (property "Reference" "J2" (id 0) (at 159.385 72.6831 0)
      (effects (font (size 1.27 1.27)) (justify left))
    )
    (property "Value" "Conn_Coaxial" (id 1) (at 159.385 75.2231 0)
      (effects (font (size 1.27 1.27)) (justify left))
    )
    (property "Footprint" "Library:SMACONNECTOR" (id 2) (at 156.21 73.66 0)
      (effects (font (size 1.27 1.27)) hide)
    )
    (property "Datasheet" " ~" (id 3) (at 156.21 73.66 0)
      (effects (font (size 1.27 1.27)) hide)
    )
    (pin "1" (uuid 1f604859-9f68-4051-968c-93315e3b82f9))
    (pin "2" (uuid 19b69f7f-25f4-45ee-9ef6-1abed2b2ef02))
  )

  (symbol (lib_id "RF_Amplifier:ADL5610") (at 104.775 73.66 0) (unit 1)
    (in_bom yes) (on_board yes)
    (uuid 6ce94413-f70e-4c97-bf47-3d6d84121121)
    (property "Reference" "U1" (id 0) (at 104.775 63.5 0))
    (property "Value" "EHA-163L+" (id 1) (at 104.775 66.04 0))
    (property "Footprint" "Library:EHA-163L+" (id 2) (at 106.68 88.9 0))
    (property "Datasheet" "https://www.analog.com/media/en/technical-documentation/data-sheets/ADL5610.pdf" (id 3) (at 104.775 73.66 0)
      (effects (font (size 1.27 1.27)) hide)
    )
    (pin "1" (uuid 5f49d06b-8a02-4072-8d9d-4270287445f9))
    (pin "2" (uuid f3bb5e1f-d512-42e9-848a-523a7fdbd090))
    (pin "3" (uuid 84b09667-72a0-4e3e-a12d-d100fdaafb50))
  )

  (symbol (lib_id "Device:C") (at 141.605 73.66 90) (unit 1)
    (in_bom yes) (on_board yes) (fields_autoplaced)
    (uuid 6db1c935-8967-45a3-84c3-b393f7e203d4)
    (property "Reference" "C2" (id 0) (at 141.605 66.04 90))
    (property "Value" "100n" (id 1) (at 141.605 68.58 90))
    (property "Footprint" "Capacitor_SMD:C_0402_1005Metric" (id 2) (at 145.415 72.6948 0)
      (effects (font (size 1.27 1.27)) hide)
    )
    (property "Datasheet" "~" (id 3) (at 141.605 73.66 0)
      (effects (font (size 1.27 1.27)) hide)
    )
    (pin "1" (uuid 25651312-4515-4118-ab25-60e117a2e0f5))
    (pin "2" (uuid 800f73d2-8ffb-44a0-887c-807147d52872))
  )

  (symbol (lib_id "Device:C") (at 88.9 73.66 90) (unit 1)
    (in_bom yes) (on_board yes) (fields_autoplaced)
    (uuid 7da34c30-1dce-4689-b0e2-af7bc61a930d)
    (property "Reference" "C1" (id 0) (at 88.9 66.04 90))
    (property "Value" "100n" (id 1) (at 88.9 68.58 90))
    (property "Footprint" "Capacitor_SMD:C_0402_1005Metric" (id 2) (at 92.71 72.6948 0)
      (effects (font (size 1.27 1.27)) hide)
    )
    (property "Datasheet" "~" (id 3) (at 88.9 73.66 0)
      (effects (font (size 1.27 1.27)) hide)
    )
    (pin "1" (uuid 71ee266a-1c85-4d69-8b42-62676ea39635))
    (pin "2" (uuid 8b882bfb-29bf-4d28-a006-6779d91e4270))
  )

  (symbol (lib_id "power:GND") (at 66.675 78.74 0) (unit 1)
    (in_bom yes) (on_board yes) (fields_autoplaced)
    (uuid 8469d4b9-aee8-4139-8ad5-2e758679f8a0)
    (property "Reference" "#PWR0105" (id 0) (at 66.675 85.09 0)
      (effects (font (size 1.27 1.27)) hide)
    )
    (property "Value" "GND" (id 1) (at 66.675 83.82 0))
    (property "Footprint" "" (id 2) (at 66.675 78.74 0)
      (effects (font (size 1.27 1.27)) hide)
    )
    (property "Datasheet" "" (id 3) (at 66.675 78.74 0)
      (effects (font (size 1.27 1.27)) hide)
    )
    (pin "1" (uuid 74e0ca7f-1031-4a93-8005-92456125adc1))
  )

  (symbol (lib_id "power:GND") (at 156.21 78.74 0) (mirror y) (unit 1)
    (in_bom yes) (on_board yes) (fields_autoplaced)
    (uuid a4358598-4a21-4399-b6d3-9b020449ef8c)
    (property "Reference" "#PWR0101" (id 0) (at 156.21 85.09 0)
      (effects (font (size 1.27 1.27)) hide)
    )
    (property "Value" "GND" (id 1) (at 156.21 83.82 0))
    (property "Footprint" "" (id 2) (at 156.21 78.74 0)
      (effects (font (size 1.27 1.27)) hide)
    )
    (property "Datasheet" "" (id 3) (at 156.21 78.74 0)
      (effects (font (size 1.27 1.27)) hide)
    )
    (pin "1" (uuid 231b4afb-cc92-4042-80bb-401896c4a0b5))
  )

  (symbol (lib_id "power:GND") (at 142.875 46.99 0) (mirror y) (unit 1)
    (in_bom yes) (on_board yes) (fields_autoplaced)
    (uuid ac875c2c-49e3-4e87-ac5e-1fb97ebb3d2c)
    (property "Reference" "#PWR0102" (id 0) (at 142.875 53.34 0)
      (effects (font (size 1.27 1.27)) hide)
    )
    (property "Value" "GND" (id 1) (at 142.875 52.07 0))
    (property "Footprint" "" (id 2) (at 142.875 46.99 0)
      (effects (font (size 1.27 1.27)) hide)
    )
    (property "Datasheet" "" (id 3) (at 142.875 46.99 0)
      (effects (font (size 1.27 1.27)) hide)
    )
    (pin "1" (uuid 08c3abbf-9001-461c-819c-53d6d3fba570))
  )

  (symbol (lib_id "Connector:Conn_Coaxial") (at 66.675 73.66 0) (mirror y) (unit 1)
    (in_bom yes) (on_board yes) (fields_autoplaced)
    (uuid afcd8bdb-28ec-4af6-bca9-dc938f0e111d)
    (property "Reference" "J1" (id 0) (at 66.9924 66.04 0))
    (property "Value" "Conn_Coaxial" (id 1) (at 66.9924 68.58 0))
    (property "Footprint" "Library:SMACONNECTOR" (id 2) (at 66.675 73.66 0)
      (effects (font (size 1.27 1.27)) hide)
    )
    (property "Datasheet" " ~" (id 3) (at 66.675 73.66 0)
      (effects (font (size 1.27 1.27)) hide)
    )
    (pin "1" (uuid ba231f7c-1672-4030-a6a8-8b97a6cb5254))
    (pin "2" (uuid 73b39ce7-14d4-417e-b994-aad2a2baf4c1))
  )

  (symbol (lib_id "power:GND") (at 102.235 81.28 0) (unit 1)
    (in_bom yes) (on_board yes) (fields_autoplaced)
    (uuid b3c7dff8-4869-48f3-bb6f-a8d39d961bad)
    (property "Reference" "#PWR0104" (id 0) (at 102.235 87.63 0)
      (effects (font (size 1.27 1.27)) hide)
    )
    (property "Value" "GND" (id 1) (at 102.235 86.36 0))
    (property "Footprint" "" (id 2) (at 102.235 81.28 0)
      (effects (font (size 1.27 1.27)) hide)
    )
    (property "Datasheet" "" (id 3) (at 102.235 81.28 0)
      (effects (font (size 1.27 1.27)) hide)
    )
    (pin "1" (uuid 1046c355-11d4-4640-9816-f2429595395f))
  )

  (symbol (lib_id "Device:C") (at 114.3 46.355 90) (unit 1)
    (in_bom yes) (on_board yes) (fields_autoplaced)
    (uuid c5dadda8-6a13-472e-a32c-490746a4abae)
    (property "Reference" "C3" (id 0) (at 114.3 39.37 90))
    (property "Value" "10u" (id 1) (at 114.3 41.91 90))
    (property "Footprint" "Capacitor_SMD:C_1210_3225Metric" (id 2) (at 118.11 45.3898 0)
      (effects (font (size 1.27 1.27)) hide)
    )
    (property "Datasheet" "~" (id 3) (at 114.3 46.355 0)
      (effects (font (size 1.27 1.27)) hide)
    )
    (pin "1" (uuid 2e8f2ce4-636b-49b6-a7a6-11f92452c5cb))
    (pin "2" (uuid c80990fb-86a3-4164-8aa0-7f5605bd3c04))
  )

  (symbol (lib_id "power:GND") (at 110.49 46.99 0) (mirror y) (unit 1)
    (in_bom yes) (on_board yes) (fields_autoplaced)
    (uuid e2e55d33-2b23-4b8c-be44-2eab56b89eb9)
    (property "Reference" "#PWR0103" (id 0) (at 110.49 53.34 0)
      (effects (font (size 1.27 1.27)) hide)
    )
    (property "Value" "GND" (id 1) (at 110.49 52.07 0))
    (property "Footprint" "" (id 2) (at 110.49 46.99 0)
      (effects (font (size 1.27 1.27)) hide)
    )
    (property "Datasheet" "" (id 3) (at 110.49 46.99 0)
      (effects (font (size 1.27 1.27)) hide)
    )
    (pin "1" (uuid 78beb75c-1563-4a84-875e-b8c162eb087d))
  )

  (symbol (lib_id "Device:C") (at 139.065 46.355 90) (unit 1)
    (in_bom yes) (on_board yes) (fields_autoplaced)
    (uuid e820b79c-6b29-4c1e-a07c-3c14aa68b7cc)
    (property "Reference" "C4" (id 0) (at 139.065 39.37 90))
    (property "Value" "10n" (id 1) (at 139.065 41.91 90))
    (property "Footprint" "Capacitor_SMD:C_0201_0603Metric" (id 2) (at 142.875 45.3898 0)
      (effects (font (size 1.27 1.27)) hide)
    )
    (property "Datasheet" "~" (id 3) (at 139.065 46.355 0)
      (effects (font (size 1.27 1.27)) hide)
    )
    (pin "1" (uuid c881e51b-0586-4baa-a62a-a2f7b3140517))
    (pin "2" (uuid 6411bce8-f617-4a41-b2f9-74ac82a6a69e))
  )

  (sheet_instances
    (path "/" (page "1"))
  )

  (symbol_instances
    (path "/a4358598-4a21-4399-b6d3-9b020449ef8c"
      (reference "#PWR0101") (unit 1) (value "GND") (footprint "")
    )
    (path "/ac875c2c-49e3-4e87-ac5e-1fb97ebb3d2c"
      (reference "#PWR0102") (unit 1) (value "GND") (footprint "")
    )
    (path "/e2e55d33-2b23-4b8c-be44-2eab56b89eb9"
      (reference "#PWR0103") (unit 1) (value "GND") (footprint "")
    )
    (path "/b3c7dff8-4869-48f3-bb6f-a8d39d961bad"
      (reference "#PWR0104") (unit 1) (value "GND") (footprint "")
    )
    (path "/8469d4b9-aee8-4139-8ad5-2e758679f8a0"
      (reference "#PWR0105") (unit 1) (value "GND") (footprint "")
    )
    (path "/7da34c30-1dce-4689-b0e2-af7bc61a930d"
      (reference "C1") (unit 1) (value "100n") (footprint "Capacitor_SMD:C_0402_1005Metric")
    )
    (path "/6db1c935-8967-45a3-84c3-b393f7e203d4"
      (reference "C2") (unit 1) (value "100n") (footprint "Capacitor_SMD:C_0402_1005Metric")
    )
    (path "/c5dadda8-6a13-472e-a32c-490746a4abae"
      (reference "C3") (unit 1) (value "10u") (footprint "Capacitor_SMD:C_1210_3225Metric")
    )
    (path "/e820b79c-6b29-4c1e-a07c-3c14aa68b7cc"
      (reference "C4") (unit 1) (value "10n") (footprint "Capacitor_SMD:C_0201_0603Metric")
    )
    (path "/afcd8bdb-28ec-4af6-bca9-dc938f0e111d"
      (reference "J1") (unit 1) (value "Conn_Coaxial") (footprint "Library:SMACONNECTOR")
    )
    (path "/58a2c676-8870-4a27-8001-2b59d129aa6d"
      (reference "J2") (unit 1) (value "Conn_Coaxial") (footprint "Library:SMACONNECTOR")
    )
    (path "/198efdfd-062c-4896-8cab-2695902271f0"
      (reference "L1") (unit 1) (value "6,5u") (footprint "Library:BCR-652JLC")
    )
    (path "/6ce94413-f70e-4c97-bf47-3d6d84121121"
      (reference "U1") (unit 1) (value "EHA-163L+") (footprint "Library:EHA-163L+")
    )
  )
)
