2020-07-06T02:02+00:00	1
2020-07-06T03:02+00:00	1
2020-07-06T04:02+00:00	1
2020-07-06T05:02+00:00	1
2020-07-06T06:02+00:00	1
2020-07-06T07:02+00:00	1
2020-07-06T08:02+00:00	1
2020-07-06T09:02+00:00	0
2020-07-06T10:02+00:00	0
2020-07-06T11:00+00:00	1
2020-07-06T11:15+00:00	2
2020-07-06T11:30+00:00	3
2020-07-06T11:45+00:00	3
2020-07-06T12:00+00:00	3
2020-07-06T12:15+00:00	3
2020-07-06T12:30+00:00	3
2020-07-06T12:45+00:00	4
2020-07-06T13:00+00:00	4
2020-07-06T13:15+00:00	5
2020-07-06T13:30+00:00	5
2020-07-06T13:45+00:00	5
2020-07-06T14:00+00:00	6
2020-07-06T14:15+00:00	6
2020-07-06T14:30+00:00	6
2020-07-06T14:45+00:00	6
2020-07-06T15:00+00:00	6
2020-07-06T15:15+00:00	6
2020-07-06T15:30+00:00	6
2020-07-06T15:45+00:00	6
2020-07-06T16:00+00:00	6
2020-07-06T16:15+00:00	6
2020-07-06T16:30+00:00	6
2020-07-06T16:45+00:00	6
2020-07-06T17:00+00:00	6
2020-07-06T17:15+00:00	6
2020-07-06T17:30+00:00	6
2020-07-06T17:45+00:00	6
2020-07-06T18:00+00:00	6
2020-07-06T18:15+00:00	6
2020-07-06T18:30+00:00	6
2020-07-06T18:45+00:00	6
2020-07-06T19:00+00:00	7
2020-07-06T19:15+00:00	7
2020-07-06T19:30+00:00	7
2020-07-06T19:45+00:00	7
2020-07-06T20:00+00:00	7
2020-07-06T20:15+00:00	7
2020-07-06T20:30+00:00	7
2020-07-06T20:45+00:00	7
2020-07-06T21:00+00:00	7
2020-07-06T21:15+00:00	7
2020-07-06T21:30+00:00	7
2020-07-06T21:45+00:00	7
2020-07-06T22:00+00:00	7
2020-07-06T22:15+00:00	7
2020-07-06T22:30+00:00	7
2020-07-06T22:45+00:00	7
2020-07-06T23:00+00:00	7
2020-07-06T23:15+00:00	7
2020-07-06T23:30+00:00	7
2020-07-06T23:45+00:00	7
2020-07-07T00:00+00:00	7
2020-07-07T00:15+00:00	7
2020-07-07T00:30+00:00	7
2020-07-07T00:45+00:00	7
2020-07-07T01:00+00:00	7
2020-07-07T01:15+00:00	7
2020-07-07T01:30+00:00	7
2020-07-07T01:45+00:00	7
2020-07-07T02:00+00:00	7
2020-07-07T02:15+00:00	7
2020-07-07T02:30+00:00	7
2020-07-07T02:45+00:00	7
2020-07-07T03:00+00:00	7
2020-07-07T03:15+00:00	7
2020-07-07T03:30+00:00	7
2020-07-07T03:45+00:00	7
2020-07-07T04:00+00:00	7
2020-07-07T04:15+00:00	7
2020-07-07T04:30+00:00	7
2020-07-07T04:45+00:00	8
2020-07-07T05:00+00:00	8
2020-07-07T05:15+00:00	8
2020-07-07T05:30+00:00	8
2020-07-07T05:45+00:00	8
2020-07-07T06:00+00:00	8
2020-07-07T06:15+00:00	8
2020-07-07T06:30+00:00	8
2020-07-07T06:45+00:00	8
2020-07-07T07:00+00:00	8
2020-07-07T07:15+00:00	8
2020-07-07T07:30+00:00	8
2020-07-07T07:45+00:00	8
2020-07-07T08:00+00:00	8
2020-07-07T08:15+00:00	8
2020-07-07T08:30+00:00	8
2020-07-07T08:45+00:00	8
2020-07-07T09:00+00:00	8
2020-07-07T09:15+00:00	8
2020-07-07T09:30+00:00	8
2020-07-07T09:45+00:00	8
2020-07-07T10:00+00:00	8
2020-07-07T10:15+00:00	8
2020-07-07T10:30+00:00	8
2020-07-07T10:45+00:00	8
2020-07-07T11:00+00:00	8
2020-07-07T11:15+00:00	8
2020-07-07T11:30+00:00	10
2020-07-07T11:45+00:00	10
2020-07-07T12:00+00:00	10
2020-07-07T12:15+00:00	10
2020-07-07T12:30+00:00	10
2020-07-07T12:45+00:00	10
2020-07-07T13:00+00:00	10
2020-07-07T13:15+00:00	10
2020-07-07T13:30+00:00	10
2020-07-07T13:45+00:00	10
2020-07-07T14:00+00:00	10
2020-07-07T14:15+00:00	10
2020-07-07T14:30+00:00	12
2020-07-07T14:45+00:00	12
2020-07-07T15:00+00:00	12
2020-07-07T15:15+00:00	12
2020-07-07T15:30+00:00	12
2020-07-07T15:45+00:00	12
2020-07-07T16:00+00:00	12
2020-07-07T16:15+00:00	12
2020-07-07T16:30+00:00	12
2020-07-07T16:45+00:00	12
2020-07-07T17:00+00:00	12
2020-07-07T17:15+00:00	12
2020-07-07T17:30+00:00	13
2020-07-07T17:45+00:00	13
2020-07-07T18:00+00:00	13
2020-07-07T18:15+00:00	13
2020-07-07T18:30+00:00	13
2020-07-07T18:45+00:00	13
2020-07-07T19:00+00:00	13
2020-07-07T19:15+00:00	13
2020-07-07T19:30+00:00	13
2020-07-07T19:45+00:00	13
2020-07-07T20:00+00:00	13
2020-07-07T20:15+00:00	13
2020-07-07T20:30+00:00	13
2020-07-07T20:45+00:00	13
2020-07-07T21:00+00:00	13
2020-07-07T21:15+00:00	13
2020-07-07T21:30+00:00	13
2020-07-07T21:45+00:00	13
2020-07-07T22:00+00:00	13
2020-07-07T22:15+00:00	13
2020-07-07T22:30+00:00	13
2020-07-07T22:45+00:00	13
2020-07-07T23:00+00:00	13
2020-07-07T23:15+00:00	13
2020-07-07T23:30+00:00	13
2020-07-07T23:45+00:00	13
2020-07-08T00:00+00:00	13
2020-07-08T00:15+00:00	13
2020-07-08T00:30+00:00	13
2020-07-08T00:45+00:00	13
2020-07-08T01:00+00:00	13
2020-07-08T01:15+00:00	13
2020-07-08T01:30+00:00	13
2020-07-08T01:45+00:00	13
2020-07-08T02:00+00:00	13
2020-07-08T02:15+00:00	13
2020-07-08T02:30+00:00	13
2020-07-08T02:45+00:00	13
2020-07-08T03:00+00:00	13
2020-07-08T03:15+00:00	13
2020-07-08T03:30+00:00	13
2020-07-08T03:45+00:00	13
2020-07-08T04:00+00:00	13
2020-07-08T04:15+00:00	13
2020-07-08T04:30+00:00	13
2020-07-08T04:45+00:00	13
2020-07-08T05:00+00:00	13
2020-07-08T05:15+00:00	13
2020-07-08T05:30+00:00	13
2020-07-08T05:45+00:00	13
2020-07-08T06:00+00:00	13
2020-07-08T06:15+00:00	13
2020-07-08T06:30+00:00	13
2020-07-08T06:45+00:00	13
2020-07-08T07:00+00:00	13
2020-07-08T07:15+00:00	13
2020-07-08T07:30+00:00	13
2020-07-08T07:45+00:00	13
2020-07-08T08:00+00:00	13
2020-07-08T08:15+00:00	13
2020-07-08T08:30+00:00	13
2020-07-08T08:45+00:00	13
2020-07-08T09:00+00:00	13
2020-07-08T09:15+00:00	13
2020-07-08T09:30+00:00	13
2020-07-08T09:45+00:00	13
2020-07-08T10:00+00:00	13
2020-07-08T10:15+00:00	13
2020-07-08T10:30+00:00	13
2020-07-08T10:45+00:00	13
2020-07-08T11:00+00:00	13
2020-07-08T11:15+00:00	13
2020-07-08T11:30+00:00	13
2020-07-08T11:45+00:00	13
2020-07-08T12:00+00:00	13
2020-07-08T12:15+00:00	13
2020-07-08T12:30+00:00	13
2020-07-08T12:45+00:00	17
2020-07-08T13:00+00:00	20
2020-07-08T13:15+00:00	21
2020-07-08T13:30+00:00	24
2020-07-08T13:45+00:00	24
2020-07-08T14:00+00:00	25
2020-07-08T14:15+00:00	27
2020-07-08T14:30+00:00	30
2020-07-08T14:45+00:00	31
2020-07-08T15:00+00:00	32
2020-07-08T15:15+00:00	33
2020-07-08T15:30+00:00	34
2020-07-08T15:45+00:00	35
2020-07-08T16:00+00:00	35
2020-07-08T16:15+00:00	36
2020-07-08T16:30+00:00	39
2020-07-08T16:45+00:00	39
2020-07-08T17:00+00:00	40
2020-07-08T17:15+00:00	43
2020-07-08T17:30+00:00	44
2020-07-08T17:45+00:00	45
2020-07-08T18:00+00:00	46
2020-07-08T18:15+00:00	46
2020-07-08T18:30+00:00	47
2020-07-08T18:45+00:00	47
2020-07-08T19:00+00:00	47
2020-07-08T19:15+00:00	47
2020-07-08T19:30+00:00	50
2020-07-08T19:45+00:00	50
2020-07-08T20:00+00:00	50
2020-07-08T20:15+00:00	53
2020-07-08T20:30+00:00	54
2020-07-08T20:45+00:00	55
2020-07-08T21:00+00:00	55
2020-07-08T21:15+00:00	55
2020-07-08T21:30+00:00	55
2020-07-08T21:45+00:00	55
2020-07-08T22:00+00:00	55
2020-07-08T22:15+00:00	55
2020-07-08T22:30+00:00	55
2020-07-08T22:45+00:00	56
2020-07-08T23:00+00:00	56
2020-07-08T23:15+00:00	56
2020-07-08T23:30+00:00	56
2020-07-08T23:45+00:00	56
2020-07-09T00:00+00:00	56
2020-07-09T00:15+00:00	56
2020-07-09T00:30+00:00	56
2020-07-09T00:45+00:00	56
2020-07-09T01:00+00:00	56
2020-07-09T01:15+00:00	56
2020-07-09T01:30+00:00	56
2020-07-09T01:45+00:00	56
2020-07-09T02:00+00:00	56
2020-07-09T02:15+00:00	56
2020-07-09T02:30+00:00	56
2020-07-09T02:45+00:00	56
2020-07-09T03:00+00:00	56
2020-07-09T03:15+00:00	56
2020-07-09T03:30+00:00	56
2020-07-09T03:45+00:00	56
2020-07-09T04:00+00:00	56
2020-07-09T04:15+00:00	56
2020-07-09T04:30+00:00	56
2020-07-09T04:45+00:00	56
2020-07-09T05:00+00:00	56
2020-07-09T05:15+00:00	56
2020-07-09T05:30+00:00	56
2020-07-09T05:45+00:00	56
2020-07-09T06:00+00:00	57
2020-07-09T06:15+00:00	57
2020-07-09T06:30+00:00	57
2020-07-09T06:45+00:00	57
2020-07-09T07:00+00:00	59
2020-07-09T07:15+00:00	61
2020-07-09T07:30+00:00	61
2020-07-09T07:45+00:00	61
2020-07-09T08:00+00:00	61
2020-07-09T08:15+00:00	62
2020-07-09T08:30+00:00	63
2020-07-09T08:45+00:00	63
2020-07-09T09:00+00:00	63
2020-07-09T09:15+00:00	66
2020-07-09T09:30+00:00	66
2020-07-09T09:45+00:00	66
2020-07-09T10:00+00:00	67
2020-07-09T10:15+00:00	69
2020-07-09T10:30+00:00	69
2020-07-09T10:45+00:00	70
2020-07-09T11:00+00:00	70
2020-07-09T11:15+00:00	70
2020-07-09T11:30+00:00	70
2020-07-09T11:45+00:00	70
2020-07-09T12:00+00:00	70
2020-07-09T12:15+00:00	70
2020-07-09T12:30+00:00	71
2020-07-09T12:45+00:00	72
2020-07-09T13:00+00:00	72
2020-07-09T13:15+00:00	73
2020-07-09T13:30+00:00	73
2020-07-09T13:45+00:00	73
2020-07-09T14:00+00:00	73
2020-07-09T14:15+00:00	73
2020-07-09T14:30+00:00	73
2020-07-09T14:45+00:00	73
2020-07-09T15:00+00:00	73
2020-07-09T15:15+00:00	73
2020-07-09T15:30+00:00	73
2020-07-09T15:45+00:00	74
2020-07-09T16:00+00:00	74
2020-07-09T16:15+00:00	75
2020-07-09T16:30+00:00	75
2020-07-09T16:45+00:00	75
2020-07-09T17:00+00:00	76
2020-07-09T17:15+00:00	76
2020-07-09T17:30+00:00	76
2020-07-09T17:45+00:00	76
2020-07-09T18:00+00:00	76
2020-07-09T18:15+00:00	76
2020-07-09T18:30+00:00	76
2020-07-09T18:45+00:00	76
2020-07-09T19:00+00:00	76
2020-07-09T19:15+00:00	76
2020-07-09T19:30+00:00	76
2020-07-09T19:45+00:00	77
2020-07-09T20:00+00:00	77
2020-07-09T20:15+00:00	77
2020-07-09T20:30+00:00	77
2020-07-09T20:45+00:00	77
2020-07-09T21:00+00:00	77
2020-07-09T21:15+00:00	77
2020-07-09T21:30+00:00	77
2020-07-09T21:45+00:00	77
2020-07-09T22:00+00:00	77
2020-07-09T22:15+00:00	77
2020-07-09T22:30+00:00	77
2020-07-09T22:45+00:00	77
2020-07-09T23:00+00:00	77
2020-07-09T23:15+00:00	77
2020-07-09T23:30+00:00	77
2020-07-09T23:45+00:00	77
2020-07-10T00:00+00:00	77
2020-07-10T00:15+00:00	77
2020-07-10T00:30+00:00	77
2020-07-10T00:45+00:00	77
2020-07-10T01:00+00:00	77
2020-07-10T01:15+00:00	77
2020-07-10T01:30+00:00	77
2020-07-10T01:45+00:00	77
2020-07-10T02:00+00:00	77
2020-07-10T02:15+00:00	77
2020-07-10T02:30+00:00	77
2020-07-10T02:45+00:00	77
2020-07-10T03:00+00:00	77
2020-07-10T03:15+00:00	77
2020-07-10T03:30+00:00	77
2020-07-10T03:45+00:00	77
2020-07-10T04:00+00:00	77
2020-07-10T04:15+00:00	77
2020-07-10T04:30+00:00	77
2020-07-10T04:45+00:00	77
2020-07-10T05:00+00:00	77
2020-07-10T05:15+00:00	77
2020-07-10T05:30+00:00	77
2020-07-10T05:45+00:00	77
2020-07-10T06:00+00:00	77
2020-07-10T06:15+00:00	77
2020-07-10T06:30+00:00	77
2020-07-10T06:45+00:00	77
2020-07-10T07:00+00:00	78
2020-07-10T07:15+00:00	78
2020-07-10T07:30+00:00	78
2020-07-10T07:45+00:00	79
2020-07-10T08:00+00:00	79
2020-07-10T08:15+00:00	79
2020-07-10T08:30+00:00	79
2020-07-10T08:45+00:00	79
2020-07-10T09:00+00:00	81
2020-07-10T09:15+00:00	82
2020-07-10T09:30+00:00	82
2020-07-10T09:45+00:00	82
2020-07-10T10:00+00:00	82
2020-07-10T10:15+00:00	83
2020-07-10T10:30+00:00	83
2020-07-10T10:45+00:00	83
2020-07-10T11:00+00:00	83
2020-07-10T11:15+00:00	83
2020-07-10T11:30+00:00	83
2020-07-10T11:45+00:00	83
2020-07-10T12:00+00:00	83
2020-07-10T12:15+00:00	83
2020-07-10T12:30+00:00	84
2020-07-10T12:45+00:00	84
2020-07-10T13:00+00:00	84
2020-07-10T13:15+00:00	84
2020-07-10T13:30+00:00	84
2020-07-10T13:45+00:00	84
2020-07-10T14:00+00:00	84
2020-07-10T14:15+00:00	84
2020-07-10T14:30+00:00	84
2020-07-10T14:45+00:00	84
2020-07-10T15:00+00:00	84
2020-07-10T15:15+00:00	85
2020-07-10T15:30+00:00	86
2020-07-10T15:45+00:00	86
2020-07-10T16:00+00:00	86
2020-07-10T16:15+00:00	86
2020-07-10T16:30+00:00	86
2020-07-10T16:45+00:00	86
2020-07-10T17:00+00:00	86
2020-07-10T17:15+00:00	87
2020-07-10T17:30+00:00	87
2020-07-10T17:45+00:00	87
2020-07-10T18:00+00:00	87
2020-07-10T18:15+00:00	87
2020-07-10T18:30+00:00	88
2020-07-10T18:45+00:00	88
2020-07-10T19:00+00:00	88
2020-07-10T19:15+00:00	88
2020-07-10T19:30+00:00	89
2020-07-10T19:45+00:00	89
2020-07-10T20:00+00:00	89
2020-07-10T20:15+00:00	89
2020-07-10T20:31+00:00	90
2020-07-10T20:45+00:00	90
2020-07-10T21:00+00:00	90
2020-07-10T21:15+00:00	90
2020-07-10T21:30+00:00	90
2020-07-10T21:45+00:00	90
2020-07-10T22:00+00:00	90
2020-07-10T22:15+00:00	90
2020-07-10T22:30+00:00	91
2020-07-10T22:45+00:00	91
2020-07-10T23:00+00:00	91
2020-07-10T23:15+00:00	91
2020-07-10T23:30+00:00	91
2020-07-10T23:45+00:00	91
2020-07-11T00:00+00:00	91
2020-07-11T00:15+00:00	91
2020-07-11T00:30+00:00	91
2020-07-11T00:45+00:00	91
2020-07-11T01:00+00:00	91
2020-07-11T01:15+00:00	91
2020-07-11T01:30+00:00	91
2020-07-11T01:45+00:00	91
2020-07-11T02:00+00:00	91
2020-07-11T02:15+00:00	91
2020-07-11T02:30+00:00	91
2020-07-11T02:45+00:00	91
2020-07-11T03:00+00:00	91
2020-07-11T03:15+00:00	91
2020-07-11T03:30+00:00	91
2020-07-11T03:45+00:00	91
2020-07-11T04:00+00:00	91
2020-07-11T04:15+00:00	91
2020-07-11T04:30+00:00	91
2020-07-11T04:45+00:00	91
2020-07-11T05:00+00:00	91
2020-07-11T05:15+00:00	91
2020-07-11T05:30+00:00	91
2020-07-11T05:45+00:00	91
2020-07-11T06:00+00:00	91
2020-07-11T06:15+00:00	91
2020-07-11T06:30+00:00	91
2020-07-11T06:45+00:00	91
2020-07-11T07:00+00:00	91
2020-07-11T07:15+00:00	92
2020-07-11T07:30+00:00	92
2020-07-11T07:45+00:00	92
2020-07-11T08:00+00:00	93
2020-07-11T08:15+00:00	93
2020-07-11T08:30+00:00	93
2020-07-11T08:45+00:00	93
2020-07-11T09:00+00:00	93
2020-07-11T09:15+00:00	93
2020-07-11T09:30+00:00	93
2020-07-11T09:45+00:00	93
2020-07-11T10:00+00:00	93
2020-07-11T10:15+00:00	93
2020-07-11T10:30+00:00	93
2020-07-11T10:45+00:00	93
2020-07-11T11:00+00:00	93
2020-07-11T11:15+00:00	93
2020-07-11T11:30+00:00	93
2020-07-11T11:45+00:00	93
2020-07-11T12:00+00:00	93
2020-07-11T12:15+00:00	93
2020-07-11T12:30+00:00	93
2020-07-11T12:45+00:00	93
2020-07-11T13:00+00:00	94
2020-07-11T13:15+00:00	94
2020-07-11T13:30+00:00	94
2020-07-11T13:45+00:00	94
2020-07-11T14:00+00:00	96
2020-07-11T14:15+00:00	96
2020-07-11T14:30+00:00	96
2020-07-11T14:45+00:00	98
2020-07-11T15:00+00:00	98
2020-07-11T15:15+00:00	98
2020-07-11T15:30+00:00	98
2020-07-11T15:45+00:00	98
2020-07-11T16:00+00:00	98
2020-07-11T16:15+00:00	98
2020-07-11T16:30+00:00	98
2020-07-11T16:45+00:00	98
2020-07-11T17:00+00:00	98
2020-07-11T17:15+00:00	98
2020-07-11T17:30+00:00	98
2020-07-11T17:45+00:00	98
2020-07-11T18:00+00:00	98
2020-07-11T18:15+00:00	98
2020-07-11T18:30+00:00	99
2020-07-11T18:45+00:00	99
2020-07-11T19:00+00:00	99
2020-07-11T19:15+00:00	100
2020-07-11T19:30+00:00	101
2020-07-11T19:45+00:00	101
2020-07-11T20:00+00:00	101
2020-07-11T20:15+00:00	101
2020-07-11T20:30+00:00	101
2020-07-11T20:45+00:00	101
2020-07-11T21:00+00:00	101
2020-07-11T21:15+00:00	101
2020-07-11T21:30+00:00	101
2020-07-11T21:45+00:00	101
2020-07-11T22:00+00:00	101
2020-07-11T22:15+00:00	101
2020-07-11T22:30+00:00	101
2020-07-11T22:45+00:00	101
2020-07-11T23:00+00:00	101
2020-07-11T23:15+00:00	101
2020-07-11T23:30+00:00	101
2020-07-11T23:45+00:00	101
2020-07-12T00:00+00:00	101
2020-07-12T00:15+00:00	101
2020-07-12T00:30+00:00	101
2020-07-12T00:45+00:00	101
2020-07-12T01:00+00:00	101
2020-07-12T01:15+00:00	101
2020-07-12T01:30+00:00	101
2020-07-12T01:45+00:00	101
2020-07-12T02:00+00:00	101
2020-07-12T02:15+00:00	101
2020-07-12T02:30+00:00	101
2020-07-12T02:45+00:00	101
2020-07-12T03:00+00:00	101
2020-07-12T03:15+00:00	101
2020-07-12T03:30+00:00	101
2020-07-12T03:45+00:00	101
2020-07-12T04:00+00:00	101
2020-07-12T04:15+00:00	101
2020-07-12T04:30+00:00	101
2020-07-12T04:45+00:00	102
2020-07-12T05:00+00:00	102
2020-07-12T05:15+00:00	102
2020-07-12T05:30+00:00	102
2020-07-12T05:45+00:00	102
2020-07-12T06:00+00:00	102
2020-07-12T06:15+00:00	102
2020-07-12T06:30+00:00	102
2020-07-12T06:45+00:00	102
2020-07-12T07:00+00:00	102
2020-07-12T07:15+00:00	102
2020-07-12T07:30+00:00	102
2020-07-12T07:45+00:00	103
2020-07-12T08:00+00:00	103
2020-07-12T08:15+00:00	103
2020-07-12T08:30+00:00	103
2020-07-12T08:45+00:00	103
2020-07-12T09:00+00:00	104
2020-07-12T09:15+00:00	104
2020-07-12T09:30+00:00	104
2020-07-12T09:45+00:00	104
2020-07-12T10:00+00:00	104
2020-07-12T10:15+00:00	104
2020-07-12T10:30+00:00	104
2020-07-12T10:45+00:00	104
2020-07-12T11:00+00:00	104
2020-07-12T11:15+00:00	104
2020-07-12T11:30+00:00	104
2020-07-12T11:45+00:00	104
2020-07-12T12:00+00:00	104
2020-07-12T12:15+00:00	104
2020-07-12T12:30+00:00	104
2020-07-12T12:45+00:00	104
2020-07-12T13:00+00:00	104
2020-07-12T13:15+00:00	104
2020-07-12T13:30+00:00	104
2020-07-12T13:45+00:00	104
2020-07-12T14:00+00:00	104
2020-07-12T14:15+00:00	104
2020-07-12T14:30+00:00	104
2020-07-12T14:45+00:00	104
2020-07-12T15:00+00:00	104
2020-07-12T15:15+00:00	104
2020-07-12T15:30+00:00	104
2020-07-12T15:45+00:00	104
2020-07-12T16:00+00:00	104
2020-07-12T16:15+00:00	104
2020-07-12T16:30+00:00	105
2020-07-12T16:45+00:00	105
2020-07-12T17:00+00:00	105
2020-07-12T17:15+00:00	105
2020-07-12T17:30+00:00	105
2020-07-12T17:45+00:00	105
2020-07-12T18:00+00:00	105
2020-07-12T18:15+00:00	105
2020-07-12T18:30+00:00	105
2020-07-12T18:45+00:00	105
2020-07-12T19:00+00:00	105
2020-07-12T19:15+00:00	105
2020-07-12T19:30+00:00	105
2020-07-12T19:45+00:00	105
2020-07-12T20:00+00:00	105
2020-07-12T20:15+00:00	105
2020-07-12T20:30+00:00	106
2020-07-12T20:45+00:00	106
2020-07-12T21:00+00:00	106
2020-07-12T21:15+00:00	107
2020-07-12T21:30+00:00	107
2020-07-12T21:45+00:00	107
2020-07-12T22:00+00:00	107
2020-07-12T22:15+00:00	107
2020-07-12T22:30+00:00	107
2020-07-12T22:45+00:00	107
2020-07-12T23:00+00:00	107
2020-07-12T23:15+00:00	107
2020-07-12T23:30+00:00	107
2020-07-12T23:45+00:00	107
2020-07-13T00:00+00:00	107
2020-07-13T00:15+00:00	107
2020-07-13T00:30+00:00	107
2020-07-13T00:45+00:00	107
2020-07-13T01:00+00:00	107
2020-07-13T01:15+00:00	107
2020-07-13T01:30+00:00	107
2020-07-13T01:45+00:00	107
2020-07-13T02:00+00:00	107
2020-07-13T02:15+00:00	107
2020-07-13T02:30+00:00	107
2020-07-13T02:45+00:00	107
2020-07-13T03:00+00:00	107
2020-07-13T03:15+00:00	107
2020-07-13T03:30+00:00	107
2020-07-13T03:45+00:00	107
2020-07-13T04:00+00:00	107
2020-07-13T04:15+00:00	107
2020-07-13T04:30+00:00	107
2020-07-13T04:45+00:00	107
2020-07-13T05:00+00:00	107
2020-07-13T05:15+00:00	107
2020-07-13T05:30+00:00	107
2020-07-13T05:45+00:00	107
2020-07-13T06:00+00:00	107
2020-07-13T06:15+00:00	107
2020-07-13T06:30+00:00	107
2020-07-13T06:45+00:00	107
2020-07-13T07:00+00:00	107
2020-07-13T07:15+00:00	107
2020-07-13T07:30+00:00	107
2020-07-13T07:45+00:00	107
2020-07-13T08:00+00:00	107
2020-07-13T08:15+00:00	107
2020-07-13T08:30+00:00	107
2020-07-13T08:45+00:00	107
2020-07-13T09:00+00:00	108
2020-07-13T09:15+00:00	109
2020-07-13T09:30+00:00	109
2020-07-13T09:45+00:00	109
2020-07-13T10:00+00:00	109
2020-07-13T10:15+00:00	109
2020-07-13T10:30+00:00	109
2020-07-13T10:45+00:00	109
2020-07-13T11:00+00:00	109
2020-07-13T11:15+00:00	109
2020-07-13T11:30+00:00	109
2020-07-13T11:45+00:00	109
2020-07-13T12:00+00:00	109
2020-07-13T12:15+00:00	109
2020-07-13T12:30+00:00	109
2020-07-13T12:45+00:00	109
2020-07-13T13:01+00:00	109
2020-07-13T13:15+00:00	110
2020-07-13T13:30+00:00	110
2020-07-13T13:45+00:00	110
2020-07-13T14:00+00:00	110
2020-07-13T14:15+00:00	110
2020-07-13T14:30+00:00	110
2020-07-13T14:45+00:00	110
2020-07-13T15:00+00:00	110
2020-07-13T15:15+00:00	110
2020-07-13T15:30+00:00	110
2020-07-13T15:45+00:00	110
2020-07-13T16:00+00:00	110
2020-07-13T16:15+00:00	110
2020-07-13T16:30+00:00	110
2020-07-13T16:45+00:00	110
2020-07-13T17:00+00:00	110
2020-07-13T17:15+00:00	110
2020-07-13T17:30+00:00	110
2020-07-13T17:45+00:00	110
2020-07-13T18:00+00:00	110
2020-07-13T18:15+00:00	110
2020-07-13T18:30+00:00	110
2020-07-13T18:45+00:00	110
2020-07-13T19:00+00:00	110
2020-07-13T19:15+00:00	111
2020-07-13T19:30+00:00	111
2020-07-13T19:45+00:00	111
2020-07-13T20:00+00:00	111
2020-07-13T20:15+00:00	111
2020-07-13T20:30+00:00	111
2020-07-13T20:45+00:00	112
2020-07-13T21:00+00:00	112
2020-07-13T21:15+00:00	112
2020-07-13T21:30+00:00	112
2020-07-13T21:45+00:00	112
2020-07-13T22:00+00:00	112
2020-07-13T22:15+00:00	112
2020-07-13T22:30+00:00	112
2020-07-13T22:45+00:00	112
2020-07-13T23:00+00:00	112
2020-07-13T23:15+00:00	112
2020-07-13T23:30+00:00	112
2020-07-13T23:45+00:00	112
2020-07-14T00:00+00:00	112
2020-07-14T00:15+00:00	112
2020-07-14T00:30+00:00	112
2020-07-14T00:45+00:00	112
2020-07-14T01:00+00:00	112
2020-07-14T01:15+00:00	112
2020-07-14T01:30+00:00	112
2020-07-14T01:45+00:00	112
2020-07-14T02:00+00:00	112
2020-07-14T02:15+00:00	112
2020-07-14T02:30+00:00	112
2020-07-14T02:45+00:00	112
2020-07-14T03:00+00:00	112
2020-07-14T03:15+00:00	112
2020-07-14T03:30+00:00	112
2020-07-14T03:45+00:00	112
2020-07-14T04:00+00:00	112
2020-07-14T04:15+00:00	112
2020-07-14T04:30+00:00	112
2020-07-14T04:45+00:00	112
2020-07-14T05:00+00:00	112
2020-07-14T05:15+00:00	112
2020-07-14T05:30+00:00	112
2020-07-14T05:45+00:00	112
2020-07-14T06:00+00:00	112
2020-07-14T06:15+00:00	112
2020-07-14T06:30+00:00	112
2020-07-14T06:45+00:00	112
2020-07-14T07:00+00:00	112
2020-07-14T07:15+00:00	112
2020-07-14T07:30+00:00	112
2020-07-14T07:45+00:00	112
2020-07-14T08:00+00:00	112
2020-07-14T08:15+00:00	112
2020-07-14T08:30+00:00	114
2020-07-14T08:45+00:00	114
2020-07-14T09:00+00:00	114
2020-07-14T09:15+00:00	114
2020-07-14T09:30+00:00	114
2020-07-14T09:45+00:00	117
2020-07-14T10:00+00:00	117
2020-07-14T10:15+00:00	117
2020-07-14T10:30+00:00	117
2020-07-14T10:45+00:00	117
2020-07-14T11:00+00:00	117
2020-07-14T11:15+00:00	117
2020-07-14T11:30+00:00	117
2020-07-14T11:45+00:00	117
2020-07-14T12:00+00:00	117
2020-07-14T12:15+00:00	117
2020-07-14T12:30+00:00	118
2020-07-14T12:45+00:00	118
2020-07-14T13:00+00:00	118
2020-07-14T13:15+00:00	118
2020-07-14T13:30+00:00	118
2020-07-14T13:45+00:00	118
2020-07-14T14:00+00:00	118
2020-07-14T14:15+00:00	119
2020-07-14T14:30+00:00	119
2020-07-14T14:45+00:00	119
2020-07-14T15:00+00:00	119
2020-07-14T15:15+00:00	119
2020-07-14T15:30+00:00	119
2020-07-14T15:45+00:00	119
2020-07-14T16:00+00:00	119
2020-07-14T16:15+00:00	119
2020-07-14T16:30+00:00	119
2020-07-14T16:45+00:00	119
2020-07-14T17:00+00:00	119
2020-07-14T17:15+00:00	119
2020-07-14T17:30+00:00	119
2020-07-14T17:45+00:00	119
2020-07-14T18:00+00:00	119
2020-07-14T18:15+00:00	119
2020-07-14T18:30+00:00	120
2020-07-14T18:45+00:00	120
2020-07-14T19:00+00:00	120
2020-07-14T19:15+00:00	120
2020-07-14T19:30+00:00	120
2020-07-14T19:45+00:00	120
2020-07-14T20:00+00:00	121
2020-07-14T20:15+00:00	122
2020-07-14T20:30+00:00	122
2020-07-14T20:45+00:00	122
2020-07-14T21:00+00:00	122
2020-07-14T21:15+00:00	122
2020-07-14T21:30+00:00	122
2020-07-14T21:45+00:00	122
2020-07-14T22:00+00:00	122
2020-07-14T22:15+00:00	122
2020-07-14T22:30+00:00	123
2020-07-14T22:45+00:00	123
2020-07-14T23:00+00:00	123
2020-07-14T23:15+00:00	123
2020-07-14T23:30+00:00	123
2020-07-14T23:45+00:00	123
2020-07-15T00:00+00:00	123
2020-07-15T00:15+00:00	123
2020-07-15T00:30+00:00	123
2020-07-15T00:45+00:00	123
2020-07-15T01:00+00:00	123
2020-07-15T01:15+00:00	123
2020-07-15T01:30+00:00	123
2020-07-15T01:45+00:00	123
2020-07-15T02:00+00:00	123
2020-07-15T02:15+00:00	123
2020-07-15T02:30+00:00	123
2020-07-15T02:45+00:00	123
2020-07-15T03:00+00:00	123
2020-07-15T03:15+00:00	123
2020-07-15T03:30+00:00	123
2020-07-15T03:45+00:00	123
2020-07-15T04:00+00:00	123
2020-07-15T04:15+00:00	123
2020-07-15T04:30+00:00	123
2020-07-15T04:45+00:00	123
2020-07-15T05:00+00:00	123
2020-07-15T05:15+00:00	124
2020-07-15T05:30+00:00	124
2020-07-15T05:45+00:00	124
2020-07-15T06:00+00:00	124
2020-07-15T06:15+00:00	124
2020-07-15T06:30+00:00	124
2020-07-15T06:45+00:00	124
2020-07-15T07:00+00:00	124
2020-07-15T07:15+00:00	124
2020-07-15T07:30+00:00	124
2020-07-15T07:45+00:00	124
2020-07-15T08:00+00:00	124
2020-07-15T08:15+00:00	124
2020-07-15T08:30+00:00	124
2020-07-15T08:45+00:00	124
2020-07-15T09:00+00:00	124
2020-07-15T09:15+00:00	124
2020-07-15T09:30+00:00	124
2020-07-15T09:45+00:00	124
2020-07-15T10:00+00:00	124
2020-07-15T10:15+00:00	124
2020-07-15T10:30+00:00	125
2020-07-15T10:45+00:00	125
2020-07-15T11:00+00:00	125
2020-07-15T11:15+00:00	125
2020-07-15T11:30+00:00	125
2020-07-15T11:45+00:00	125
2020-07-15T12:00+00:00	125
2020-07-15T12:15+00:00	126
2020-07-15T12:30+00:00	126
2020-07-15T12:45+00:00	126
2020-07-15T13:00+00:00	126
2020-07-15T13:15+00:00	126
2020-07-15T13:30+00:00	126
2020-07-15T13:45+00:00	126
2020-07-15T14:00+00:00	126
2020-07-15T14:15+00:00	126
2020-07-15T14:30+00:00	126
2020-07-15T14:45+00:00	126
2020-07-15T15:00+00:00	126
2020-07-15T15:15+00:00	126
2020-07-15T15:30+00:00	126
2020-07-15T15:45+00:00	127
2020-07-15T16:00+00:00	127
2020-07-15T16:15+00:00	127
2020-07-15T16:30+00:00	128
2020-07-15T16:45+00:00	129
2020-07-15T17:00+00:00	129
2020-07-15T17:15+00:00	129
2020-07-15T17:30+00:00	129
2020-07-15T17:45+00:00	129
2020-07-15T18:00+00:00	129
2020-07-15T18:15+00:00	129
2020-07-15T18:30+00:00	129
2020-07-15T18:45+00:00	129
2020-07-15T19:00+00:00	129
2020-07-15T19:15+00:00	129
2020-07-15T19:30+00:00	129
2020-07-15T19:45+00:00	129
2020-07-15T20:00+00:00	129
2020-07-15T20:15+00:00	129
2020-07-15T20:30+00:00	131
2020-07-15T20:45+00:00	131
2020-07-15T21:00+00:00	131
2020-07-15T21:15+00:00	131
2020-07-15T21:30+00:00	131
2020-07-15T21:45+00:00	131
2020-07-15T22:00+00:00	131
2020-07-15T22:15+00:00	131
2020-07-15T22:30+00:00	131
2020-07-15T22:45+00:00	131
2020-07-15T23:00+00:00	131
2020-07-15T23:15+00:00	131
2020-07-15T23:30+00:00	131
2020-07-15T23:45+00:00	131
2020-07-16T00:00+00:00	131
2020-07-16T00:15+00:00	131
2020-07-16T00:30+00:00	131
2020-07-16T00:45+00:00	131
2020-07-16T01:00+00:00	131
2020-07-16T01:15+00:00	131
2020-07-16T01:30+00:00	131
2020-07-16T01:45+00:00	131
2020-07-16T02:00+00:00	131
2020-07-16T02:15+00:00	131
2020-07-16T02:30+00:00	131
2020-07-16T02:45+00:00	131
2020-07-16T03:00+00:00	131
2020-07-16T03:15+00:00	131
2020-07-16T03:30+00:00	131
2020-07-16T03:45+00:00	131
2020-07-16T04:00+00:00	131
2020-07-16T04:15+00:00	131
2020-07-16T04:30+00:00	132
2020-07-16T04:45+00:00	132
2020-07-16T05:00+00:00	132
2020-07-16T05:15+00:00	132
2020-07-16T05:30+00:00	132
2020-07-16T05:45+00:00	132
2020-07-16T06:00+00:00	132
2020-07-16T06:15+00:00	132
2020-07-16T06:30+00:00	132
2020-07-16T06:45+00:00	132
2020-07-16T07:00+00:00	132
2020-07-16T07:15+00:00	132
2020-07-16T07:30+00:00	132
2020-07-16T07:45+00:00	134
2020-07-16T08:00+00:00	134
2020-07-16T08:15+00:00	134
2020-07-16T08:30+00:00	134
2020-07-16T08:45+00:00	134
2020-07-16T09:00+00:00	134
2020-07-16T09:15+00:00	134
2020-07-16T09:30+00:00	135
2020-07-16T09:45+00:00	135
2020-07-16T10:00+00:00	135
2020-07-16T10:15+00:00	135
2020-07-16T10:30+00:00	135
2020-07-16T10:45+00:00	135
2020-07-16T11:00+00:00	135
2020-07-16T11:15+00:00	135
2020-07-16T11:30+00:00	135
2020-07-16T11:45+00:00	135
2020-07-16T12:00+00:00	135
2020-07-16T12:15+00:00	135
2020-07-16T12:30+00:00	135
2020-07-16T12:45+00:00	135
2020-07-16T13:00+00:00	135
2020-07-16T13:15+00:00	135
2020-07-16T13:30+00:00	135
2020-07-16T13:45+00:00	135
2020-07-16T14:00+00:00	135
2020-07-16T14:15+00:00	135
2020-07-16T14:30+00:00	135
2020-07-16T14:45+00:00	135
2020-07-16T15:00+00:00	135
2020-07-16T15:15+00:00	135
2020-07-16T15:30+00:00	135
2020-07-16T15:45+00:00	135
2020-07-16T16:00+00:00	135
2020-07-16T16:15+00:00	135
2020-07-16T16:30+00:00	135
2020-07-16T16:45+00:00	135
2020-07-16T17:00+00:00	136
2020-07-16T17:15+00:00	136
2020-07-16T17:30+00:00	137
2020-07-16T17:45+00:00	137
2020-07-16T18:00+00:00	137
2020-07-16T18:15+00:00	137
2020-07-16T18:30+00:00	137
2020-07-16T18:45+00:00	137
2020-07-16T19:00+00:00	137
2020-07-16T19:15+00:00	137
2020-07-16T19:30+00:00	137
2020-07-16T19:45+00:00	137
2020-07-16T20:00+00:00	137
2020-07-16T20:15+00:00	137
2020-07-16T20:30+00:00	137
2020-07-16T20:45+00:00	137
2020-07-16T21:00+00:00	137
2020-07-16T21:15+00:00	137
2020-07-16T21:30+00:00	137
2020-07-16T21:45+00:00	138
2020-07-16T22:00+00:00	138
2020-07-16T22:15+00:00	138
2020-07-16T22:30+00:00	138
2020-07-16T22:45+00:00	138
2020-07-16T23:00+00:00	138
2020-07-16T23:15+00:00	138
2020-07-16T23:30+00:00	138
2020-07-16T23:45+00:00	138
2020-07-17T00:00+00:00	138
2020-07-17T00:15+00:00	138
2020-07-17T00:30+00:00	138
2020-07-17T00:45+00:00	138
2020-07-17T01:00+00:00	138
2020-07-17T01:15+00:00	138
2020-07-17T01:30+00:00	138
2020-07-17T01:45+00:00	138
2020-07-17T02:00+00:00	138
2020-07-17T02:15+00:00	138
2020-07-17T02:30+00:00	138
2020-07-17T02:45+00:00	138
2020-07-17T03:00+00:00	138
2020-07-17T03:15+00:00	138
2020-07-17T03:30+00:00	138
2020-07-17T03:45+00:00	138
2020-07-17T04:00+00:00	138
2020-07-17T04:15+00:00	138
2020-07-17T04:30+00:00	138
2020-07-17T04:45+00:00	138
2020-07-17T05:00+00:00	138
2020-07-17T05:15+00:00	138
2020-07-17T05:30+00:00	138
2020-07-17T05:45+00:00	138
2020-07-17T06:00+00:00	138
2020-07-17T06:15+00:00	138
2020-07-17T06:30+00:00	139
2020-07-17T06:45+00:00	139
2020-07-17T07:00+00:00	139
2020-07-17T07:15+00:00	139
2020-07-17T07:30+00:00	139
2020-07-17T07:45+00:00	139
2020-07-17T08:00+00:00	139
2020-07-17T08:15+00:00	139
2020-07-17T08:30+00:00	139
2020-07-17T08:45+00:00	139
2020-07-17T09:00+00:00	139
2020-07-17T09:15+00:00	139
2020-07-17T09:30+00:00	139
2020-07-17T09:45+00:00	139
2020-07-17T10:00+00:00	139
2020-07-17T10:15+00:00	139
2020-07-17T10:30+00:00	139
2020-07-17T10:45+00:00	139
2020-07-17T11:00+00:00	139
2020-07-17T11:15+00:00	139
2020-07-17T11:30+00:00	139
2020-07-17T11:45+00:00	139
2020-07-17T12:00+00:00	139
2020-07-17T12:15+00:00	139
2020-07-17T12:30+00:00	139
2020-07-17T12:45+00:00	139
2020-07-17T13:00+00:00	139
2020-07-17T13:15+00:00	139
2020-07-17T13:30+00:00	139
2020-07-17T13:45+00:00	139
2020-07-17T14:00+00:00	139
2020-07-17T14:15+00:00	139
2020-07-17T14:30+00:00	139
2020-07-17T14:45+00:00	139
2020-07-17T15:00+00:00	139
2020-07-17T15:15+00:00	139
2020-07-17T15:30+00:00	139
2020-07-17T15:45+00:00	139
2020-07-17T16:00+00:00	141
2020-07-17T16:15+00:00	141
2020-07-17T16:30+00:00	141
2020-07-17T16:45+00:00	141
2020-07-17T17:00+00:00	141
2020-07-17T17:15+00:00	141
2020-07-17T17:30+00:00	141
2020-07-17T17:45+00:00	141
2020-07-17T18:00+00:00	141
2020-07-17T18:15+00:00	141
2020-07-17T18:30+00:00	141
2020-07-17T18:45+00:00	141
2020-07-17T19:00+00:00	141
2020-07-17T19:15+00:00	141
2020-07-17T19:30+00:00	142
2020-07-17T19:45+00:00	142
2020-07-17T20:00+00:00	142
2020-07-17T20:15+00:00	142
2020-07-17T20:30+00:00	142
2020-07-17T20:45+00:00	142
2020-07-17T21:00+00:00	142
2020-07-17T21:15+00:00	142
2020-07-17T21:30+00:00	142
2020-07-17T21:45+00:00	142
2020-07-17T22:00+00:00	142
2020-07-17T22:15+00:00	142
2020-07-17T22:30+00:00	142
2020-07-17T22:45+00:00	142
2020-07-17T23:00+00:00	142
2020-07-17T23:15+00:00	142
2020-07-17T23:30+00:00	142
2020-07-17T23:45+00:00	142
2020-07-18T00:00+00:00	142
2020-07-18T00:15+00:00	142
2020-07-18T00:30+00:00	142
2020-07-18T00:45+00:00	142
2020-07-18T01:00+00:00	142
2020-07-18T01:15+00:00	142
2020-07-18T01:30+00:00	142
2020-07-18T01:45+00:00	142
2020-07-18T02:00+00:00	142
2020-07-18T02:15+00:00	142
2020-07-18T02:30+00:00	142
2020-07-18T02:45+00:00	142
2020-07-18T03:00+00:00	142
2020-07-18T03:15+00:00	142
2020-07-18T03:30+00:00	142
2020-07-18T03:45+00:00	142
2020-07-18T04:00+00:00	142
2020-07-18T04:15+00:00	142
2020-07-18T04:30+00:00	142
2020-07-18T04:45+00:00	142
2020-07-18T05:00+00:00	142
2020-07-18T05:15+00:00	142
2020-07-18T05:30+00:00	142
2020-07-18T05:45+00:00	142
2020-07-18T06:00+00:00	142
2020-07-18T06:15+00:00	142
2020-07-18T06:30+00:00	142
2020-07-18T06:45+00:00	142
2020-07-18T07:00+00:00	142
2020-07-18T07:15+00:00	142
2020-07-18T07:30+00:00	142
2020-07-18T07:45+00:00	142
2020-07-18T08:00+00:00	142
2020-07-18T08:15+00:00	142
2020-07-18T08:30+00:00	142
2020-07-18T08:45+00:00	142
2020-07-18T09:00+00:00	142
2020-07-18T09:15+00:00	142
2020-07-18T09:30+00:00	142
2020-07-18T09:45+00:00	142
2020-07-18T10:00+00:00	142
2020-07-18T10:15+00:00	143
2020-07-18T10:30+00:00	143
2020-07-18T10:45+00:00	143
2020-07-18T11:00+00:00	143
2020-07-18T11:15+00:00	143
2020-07-18T11:30+00:00	143
2020-07-18T11:45+00:00	143
2020-07-18T12:00+00:00	143
2020-07-18T12:15+00:00	143
2020-07-18T12:30+00:00	143
2020-07-18T12:45+00:00	144
2020-07-18T13:00+00:00	144
2020-07-18T13:15+00:00	144
2020-07-18T13:30+00:00	144
2020-07-18T13:45+00:00	145
2020-07-18T14:00+00:00	145
2020-07-18T14:15+00:00	145
2020-07-18T14:30+00:00	145
2020-07-18T14:45+00:00	145
2020-07-18T15:00+00:00	145
2020-07-18T15:15+00:00	145
2020-07-18T15:30+00:00	145
2020-07-18T15:45+00:00	145
2020-07-18T16:00+00:00	145
2020-07-18T16:15+00:00	145
2020-07-18T16:30+00:00	145
2020-07-18T16:45+00:00	146
2020-07-18T17:00+00:00	146
2020-07-18T17:15+00:00	146
2020-07-18T17:30+00:00	147
2020-07-18T17:45+00:00	147
2020-07-18T18:00+00:00	147
2020-07-18T18:15+00:00	147
2020-07-18T18:30+00:00	147
2020-07-18T18:45+00:00	147
2020-07-18T19:00+00:00	148
2020-07-18T19:15+00:00	148
2020-07-18T19:30+00:00	148
2020-07-18T19:45+00:00	148
2020-07-18T20:00+00:00	148
2020-07-18T20:15+00:00	148
2020-07-18T20:30+00:00	149
2020-07-18T20:45+00:00	149
2020-07-18T21:00+00:00	149
2020-07-18T21:15+00:00	149
2020-07-18T21:30+00:00	150
2020-07-18T21:45+00:00	150
2020-07-18T22:00+00:00	150
2020-07-18T22:15+00:00	150
2020-07-18T22:30+00:00	150
2020-07-18T22:45+00:00	150
2020-07-18T23:00+00:00	150
2020-07-18T23:15+00:00	150
2020-07-18T23:30+00:00	150
2020-07-18T23:45+00:00	150
2020-07-19T00:00+00:00	151
2020-07-19T00:15+00:00	151
2020-07-19T00:30+00:00	151
2020-07-19T00:45+00:00	151
2020-07-19T01:00+00:00	151
2020-07-19T01:15+00:00	151
2020-07-19T01:30+00:00	151
2020-07-19T01:45+00:00	151
2020-07-19T02:00+00:00	151
2020-07-19T02:15+00:00	151
2020-07-19T02:30+00:00	151
2020-07-19T02:45+00:00	151
2020-07-19T03:00+00:00	151
2020-07-19T03:15+00:00	151
2020-07-19T03:30+00:00	151
2020-07-19T03:45+00:00	151
2020-07-19T04:00+00:00	151
2020-07-19T04:15+00:00	151
2020-07-19T04:30+00:00	151
2020-07-19T04:45+00:00	151
2020-07-19T05:00+00:00	151
2020-07-19T05:15+00:00	151
2020-07-19T05:30+00:00	151
2020-07-19T05:45+00:00	151
2020-07-19T06:00+00:00	151
2020-07-19T06:15+00:00	151
2020-07-19T06:30+00:00	152
2020-07-19T06:45+00:00	152
2020-07-19T07:00+00:00	152
2020-07-19T07:15+00:00	152
2020-07-19T07:30+00:00	152
2020-07-19T07:45+00:00	152
2020-07-19T08:00+00:00	152
2020-07-19T08:15+00:00	152
2020-07-19T08:30+00:00	152
2020-07-19T08:45+00:00	152
2020-07-19T09:00+00:00	153
2020-07-19T09:15+00:00	154
2020-07-19T09:30+00:00	154
2020-07-19T09:45+00:00	154
2020-07-19T10:00+00:00	154
2020-07-19T10:15+00:00	154
2020-07-19T10:30+00:00	154
2020-07-19T10:45+00:00	154
2020-07-19T11:00+00:00	154
2020-07-19T11:15+00:00	154
2020-07-19T11:30+00:00	154
2020-07-19T11:45+00:00	154
2020-07-19T12:00+00:00	155
2020-07-19T12:15+00:00	155
2020-07-19T12:30+00:00	155
2020-07-19T12:45+00:00	155
2020-07-19T13:00+00:00	155
2020-07-19T13:15+00:00	155
2020-07-19T13:30+00:00	155
2020-07-19T13:45+00:00	155
2020-07-19T14:00+00:00	155
2020-07-19T14:15+00:00	155
2020-07-19T14:30+00:00	155
2020-07-19T14:45+00:00	155
2020-07-19T15:00+00:00	156
2020-07-19T15:15+00:00	156
2020-07-19T15:30+00:00	156
2020-07-19T15:45+00:00	156
2020-07-19T16:00+00:00	156
2020-07-19T16:15+00:00	156
2020-07-19T16:30+00:00	156
2020-07-19T16:45+00:00	156
2020-07-19T17:00+00:00	156
2020-07-19T17:15+00:00	156
2020-07-19T17:30+00:00	156
2020-07-19T17:45+00:00	156
2020-07-19T18:00+00:00	156
2020-07-19T18:15+00:00	156
2020-07-19T18:30+00:00	156
2020-07-19T18:45+00:00	156
2020-07-19T19:00+00:00	156
2020-07-19T19:15+00:00	156
2020-07-19T19:30+00:00	156
2020-07-19T19:45+00:00	156
2020-07-19T20:00+00:00	156
2020-07-19T20:15+00:00	156
2020-07-19T20:30+00:00	157
2020-07-19T20:45+00:00	158
2020-07-19T21:00+00:00	158
2020-07-19T21:15+00:00	158
2020-07-19T21:30+00:00	158
2020-07-19T21:45+00:00	158
2020-07-19T22:00+00:00	158
2020-07-19T22:15+00:00	158
2020-07-19T22:30+00:00	158
2020-07-19T22:45+00:00	158
2020-07-19T23:00+00:00	158
2020-07-19T23:15+00:00	158
2020-07-19T23:30+00:00	158
2020-07-19T23:45+00:00	158
2020-07-20T00:00+00:00	158
2020-07-20T00:15+00:00	158
2020-07-20T00:30+00:00	158
2020-07-20T00:45+00:00	158
2020-07-20T01:00+00:00	158
2020-07-20T01:15+00:00	158
2020-07-20T01:30+00:00	158
2020-07-20T01:45+00:00	158
2020-07-20T02:00+00:00	158
2020-07-20T02:15+00:00	158
2020-07-20T02:30+00:00	158
2020-07-20T02:45+00:00	158
2020-07-20T03:00+00:00	158
2020-07-20T03:15+00:00	158
2020-07-20T03:30+00:00	158
2020-07-20T03:45+00:00	158
2020-07-20T04:00+00:00	158
2020-07-20T04:15+00:00	158
2020-07-20T04:30+00:00	158
2020-07-20T04:45+00:00	158
2020-07-20T05:00+00:00	158
2020-07-20T05:15+00:00	158
2020-07-20T05:30+00:00	158
2020-07-20T05:45+00:00	158
2020-07-20T06:00+00:00	158
2020-07-20T06:15+00:00	158
2020-07-20T06:30+00:00	158
2020-07-20T06:45+00:00	158
2020-07-20T07:00+00:00	158
2020-07-20T07:15+00:00	158
2020-07-20T07:30+00:00	158
2020-07-20T07:45+00:00	158
2020-07-20T08:00+00:00	158
2020-07-20T08:15+00:00	158
2020-07-20T08:30+00:00	158
2020-07-20T08:45+00:00	158
2020-07-20T09:00+00:00	158
2020-07-20T09:15+00:00	158
2020-07-20T09:30+00:00	158
