290	Bessere Unterstützung von Geoinformationen
233	Fehler bei der Arbeit mit Belegen reduzieren
230	Einfach einheitliche Typografie in Artikeln erzeugen
185	Tools leichter entwickeln und finden
158	Vandalismus und destruktive Handlungen besser bekämpfen
152	Von Inhaltsänderungen erfahren, die mich interessieren
147	Bessere Unterstützung von Grafik, Audio, Video & Co
144	Hilfestellung beim Bearbeiten von Artikeln
103	Zusammenarbeit on-Wiki leichter machen
1	Test
Total number of votes: 1643
Total number of voters: 1018

Mon Jul 20 09:30:30 UTC 2020
