<?xml version='1.0' encoding='UTF-8'?>
<osm version='0.6' generator='JOSM'>
  <node id='-140724' action='modify' visible='true' lat='53.0019588' lon='9.8601067' />
  <node id='-140725' action='modify' visible='true' lat='53.00194623551' lon='9.86020736363' />
  <node id='-140726' action='modify' visible='true' lat='53.0018754159' lon='9.86018188264' />
  <node id='-140727' action='modify' visible='true' lat='53.0018882' lon='9.8600784' />
  <node id='-140728' action='modify' visible='true' lat='53.0019320388' lon='9.86028517536' />
  <node id='-140729' action='modify' visible='true' lat='53.00192131541' lon='9.86038433025' />
  <node id='-140730' action='modify' visible='true' lat='53.00185006701' lon='9.86036295639' />
  <node id='-140731' action='modify' visible='true' lat='53.00186184229' lon='9.86026089868' />
  <node id='-140732' action='modify' visible='true' lat='53.00188523106' lon='9.86010243248' />
  <node id='-140733' action='modify' visible='true' lat='53.00182436941' lon='9.86008197002' />
  <node id='-140734' action='modify' visible='true' lat='53.00181465488' lon='9.86016155789' />
  <node id='-140735' action='modify' visible='true' lat='53.0017826039' lon='9.85975742273' />
  <node id='-140736' action='modify' visible='true' lat='53.0017630326' lon='9.85992371969' />
  <node id='-140737' action='modify' visible='true' lat='53.00161271669' lon='9.85986806385' />
  <node id='-140738' action='modify' visible='true' lat='53.00162865626' lon='9.85970880769' />
  <node id='-140739' action='modify' visible='true' lat='53.0011212' lon='9.8593392'>
    <tag k='addr:city' v='Soltau' />
    <tag k='addr:housenumber' v='111' />
    <tag k='addr:postcode' v='29614' />
    <tag k='addr:street' v='Winsener Straße' />
    <tag k='amenity' v='bar' />
    <tag k='bar' v='no' />
    <tag k='brewery' v='various' />
    <tag k='capacity' v='260' />
    <tag k='cuisine' v='german;italian;various' />
    <tag k='delivery' v='no' />
    <tag k='description' v='The downstairs bar at the main entrance. Can be closed throughout the conference. If open, has a pool area with music.' />
    <tag k='diet:gluten_free' v='yes' />
    <tag k='diet:halal' v='yes' />
    <tag k='diet:kosher' v='no' />
    <tag k='diet:lactose_free' v='yes' />
    <tag k='diet:pescetarian' v='yes' />
    <tag k='diet:vegan' v='yes' />
    <tag k='diet:vegetarian' v='yes' />
    <tag k='email' v='info@hotel-park-soltau.de' />
    <tag k='fax' v='+49 5191 605 185' />
    <tag k='internet_access' v='wlan' />
    <tag k='internet_access:fee' v='no' />
    <tag k='internet_access:ssid' v='HPS-Gast' />
    <tag k='level' v='-1' />
    <tag k='microbrewery' v='no' />
    <tag k='name' v='Jim-Kimm-Deck Bar' />
    <tag k='opening_hours' v='18:00 - 22:00' />
    <tag k='opening_hours:covid19' v='closed' />
    <tag k='outdoor_seating' v='no' />
    <tag k='payment:american_express' v='yes' />
    <tag k='payment:coins' v='yes' />
    <tag k='payment:contactless' v='yes' />
    <tag k='payment:credit_cards' v='yes' />
    <tag k='payment:debit_cards' v='yes' />
    <tag k='payment:maestro' v='yes' />
    <tag k='payment:mastercard' v='yes' />
    <tag k='payment:notes' v='yes' />
    <tag k='payment:visa' v='yes' />
    <tag k='phone' v='+49 5191 605 0' />
    <tag k='reservation' v='yes' />
    <tag k='smoking' v='no' />
    <tag k='takeaway' v='no' />
    <tag k='website' v='https://www.hotel-park-soltau.de/' />
    <tag k='wheelchair' v='yes' />
  </node>
  <node id='-140740' action='modify' visible='true' lat='53.0022135' lon='9.8601859' />
  <node id='-140741' action='modify' visible='true' lat='53.0020119306' lon='9.86012513497' />
  <node id='-140742' action='modify' visible='true' lat='53.00197763238' lon='9.86040705859' />
  <node id='-140743' action='modify' visible='true' lat='53.002181' lon='9.8604686' />
  <node id='-140744' action='modify' visible='true' lat='53.0020556' lon='9.859368' />
  <node id='-140745' action='modify' visible='true' lat='53.0020223' lon='9.8595506' />
  <node id='-140746' action='modify' visible='true' lat='53.0020442' lon='9.8595696' />
  <node id='-140747' action='modify' visible='true' lat='53.0020641' lon='9.8595865' />
  <node id='-140748' action='modify' visible='true' lat='53.0020837' lon='9.8596183' />
  <node id='-140749' action='modify' visible='true' lat='53.0020899' lon='9.859659' />
  <node id='-140750' action='modify' visible='true' lat='53.0020908' lon='9.8596933' />
  <node id='-140751' action='modify' visible='true' lat='53.0020814' lon='9.8597451' />
  <node id='-140752' action='modify' visible='true' lat='53.0020596' lon='9.8597989' />
  <node id='-140753' action='modify' visible='true' lat='53.0020342' lon='9.8598254' />
  <node id='-140754' action='modify' visible='true' lat='53.0020104' lon='9.8598299' />
  <node id='-140755' action='modify' visible='true' lat='53.0019903' lon='9.8598322' />
  <node id='-140756' action='modify' visible='true' lat='53.0019651' lon='9.8600287' />
  <node id='-140757' action='modify' visible='true' lat='53.0019974' lon='9.8600322' />
  <node id='-140758' action='modify' visible='true' lat='53.002016' lon='9.8600346' />
  <node id='-140759' action='modify' visible='true' lat='53.002066' lon='9.8600257' />
  <node id='-140760' action='modify' visible='true' lat='53.0021314' lon='9.8599629' />
  <node id='-140761' action='modify' visible='true' lat='53.0021677' lon='9.8598999' />
  <node id='-140762' action='modify' visible='true' lat='53.0021971' lon='9.8598164' />
  <node id='-140763' action='modify' visible='true' lat='53.0022112' lon='9.8597003' />
  <node id='-140764' action='modify' visible='true' lat='53.0022037' lon='9.8596212' />
  <node id='-140765' action='modify' visible='true' lat='53.0021954' lon='9.8595691' />
  <node id='-140766' action='modify' visible='true' lat='53.0021866806' lon='9.85952997638' />
  <node id='-140767' action='modify' visible='true' lat='53.0021771' lon='9.8595062' />
  <node id='-140768' action='modify' visible='true' lat='53.0021407' lon='9.8594382' />
  <node id='-140769' action='modify' visible='true' lat='53.0021141' lon='9.8594087' />
  <node id='-140770' action='modify' visible='true' lat='53.0020957' lon='9.8593928' />
  <node id='-140771' action='modify' visible='true' lat='53.0011607' lon='9.8593185' />
  <node id='-140772' action='modify' visible='true' lat='53.0011503' lon='9.8594186' />
  <node id='-140773' action='modify' visible='true' lat='53.0011222' lon='9.8594942' />
  <node id='-140774' action='modify' visible='true' lat='53.0010945' lon='9.8595297' />
  <node id='-140775' action='modify' visible='true' lat='53.001064' lon='9.8595581' />
  <node id='-140776' action='modify' visible='true' lat='53.0010144' lon='9.8595669' />
  <node id='-140777' action='modify' visible='true' lat='53.0009834' lon='9.859558' />
  <node id='-140778' action='modify' visible='true' lat='53.0009877' lon='9.8594906' />
  <node id='-140779' action='modify' visible='true' lat='53.0010024' lon='9.8594245' />
  <node id='-140780' action='modify' visible='true' lat='53.0010229' lon='9.8593806' />
  <node id='-140781' action='modify' visible='true' lat='53.0010518' lon='9.8593398' />
  <node id='-140782' action='modify' visible='true' lat='53.0010784' lon='9.8593203' />
  <node id='-140783' action='modify' visible='true' lat='53.0010989' lon='9.8593141' />
  <node id='-140784' action='modify' visible='true' lat='53.0011212' lon='9.8593114' />
  <node id='-140785' action='modify' visible='true' lat='53.00185342366' lon='9.85992573135' />
  <node id='-140786' action='modify' visible='true' lat='53.00183617306' lon='9.86008679544' />
  <node id='-140787' action='modify' visible='true' lat='53.00174547896' lon='9.86005715959' />
  <node id='-140788' action='modify' visible='true' lat='53.00176652519' lon='9.85989631906' />
  <node id='-140789' action='modify' visible='true' lat='53.00174900658' lon='9.86002746967' />
  <node id='-140790' action='modify' visible='true' lat='53.00173498712' lon='9.86013360254' />
  <node id='-140791' action='modify' visible='true' lat='53.00166961486' lon='9.86011013322' />
  <node id='-140792' action='modify' visible='true' lat='53.00168151907' lon='9.86000519179' />
  <node id='-140793' action='modify' visible='true' lat='53.00160535997' lon='9.86008877871' />
  <node id='-140794' action='modify' visible='true' lat='53.00161791606' lon='9.85998445625' />
  <node id='-140795' action='modify' visible='true' lat='53.00177170854' lon='9.86057482593' />
  <node id='-140796' action='modify' visible='true' lat='53.00178058624' lon='9.86049033634' />
  <node id='-140797' action='modify' visible='true' lat='53.00168774695' lon='9.8604644187' />
  <node id='-140798' action='modify' visible='true' lat='53.00167927277' lon='9.86054823773' />
  <node id='-140799' action='modify' visible='true' lat='53.00151849135' lon='9.85983286019' />
  <node id='-140800' action='modify' visible='true' lat='53.00160585642' lon='9.85986135866' />
  <node id='-140801' action='modify' visible='true' lat='53.00159386792' lon='9.85997763048' />
  <node id='-140802' action='modify' visible='true' lat='53.00150650282' lon='9.85994913201' />
  <node id='-140803' action='modify' visible='true' lat='53.00150632678' lon='9.85994755879' />
  <node id='-140804' action='modify' visible='true' lat='53.00159369187' lon='9.85997605726' />
  <node id='-140805' action='modify' visible='true' lat='53.00157908039' lon='9.86010976344' />
  <node id='-140806' action='modify' visible='true' lat='53.00149171527' lon='9.86008126497' />
  <node id='-140807' action='modify' visible='true' lat='53.00155904672' lon='9.8604165756' />
  <node id='-140808' action='modify' visible='true' lat='53.001465225' lon='9.8603884124' />
  <node id='-140809' action='modify' visible='true' lat='53.00148044726' lon='9.86024118385' />
  <node id='-140810' action='modify' visible='true' lat='53.00157426895' lon='9.86026934704' />
  <node id='-140811' action='modify' visible='true' lat='53.00146528103' lon='9.86038826593' />
  <node id='-140812' action='modify' visible='true' lat='53.0013696432' lon='9.86036110856' />
  <node id='-140813' action='modify' visible='true' lat='53.00138486549' lon='9.86021388001' />
  <node id='-140814' action='modify' visible='true' lat='53.00148050329' lon='9.86024103738' />
  <node id='-140815' action='modify' visible='true' lat='53.00158204815' lon='9.86020065777' />
  <node id='-140816' action='modify' visible='true' lat='53.00139216543' lon='9.86014505038' />
  <node id='-140817' action='modify' visible='true' lat='53.00199163284' lon='9.86011817984' />
  <node id='-140818' action='modify' visible='true' lat='53.00195743368' lon='9.86040132053' />
  <node id='-140819' action='modify' visible='true' lat='53.00201618189' lon='9.86003384878' />
  <node id='-140820' action='modify' visible='true' lat='53.00200575996' lon='9.86012207347' />
  <node id='-140821' action='modify' visible='true' lat='53.00221430706' lon='9.86018522945' />
  <node id='-140822' action='modify' visible='true' lat='53.0022684538' lon='9.86004240677' />
  <node id='-140823' action='modify' visible='true' lat='53.00215984445' lon='9.85991426372' />
  <node id='-140824' action='modify' visible='true' lat='53.00213220706' lon='9.85996222945' />
  <node id='-140825' action='modify' visible='true' lat='53.00206680706' lon='9.86002502945' />
  <node id='-140826' action='modify' visible='true' lat='53.0019953334' lon='9.85954927526' />
  <node id='-140827' action='modify' visible='true' lat='53.00196944026' lon='9.85956186268' />
  <node id='-140828' action='modify' visible='true' lat='53.00194715521' lon='9.85958713012' />
  <node id='-140829' action='modify' visible='true' lat='53.00193065965' lon='9.85962260421' />
  <node id='-140830' action='modify' visible='true' lat='53.0019215683' lon='9.85966481252' />
  <node id='-140831' action='modify' visible='true' lat='53.00192077109' lon='9.8597096234' />
  <node id='-140832' action='modify' visible='true' lat='53.00192834605' lon='9.85975265044' />
  <node id='-140833' action='modify' visible='true' lat='53.00194355169' lon='9.85978968187' />
  <node id='-140834' action='modify' visible='true' lat='53.00196489957' lon='9.85981709278' />
  <node id='-140835' action='modify' visible='true' lat='53.00130966209' lon='9.85928066008' />
  <node id='-140836' action='modify' visible='true' lat='53.00125679881' lon='9.85926188461' />
  <node id='-140837' action='modify' visible='true' lat='53.00125751523' lon='9.85928510292' />
  <node id='-140838' action='modify' visible='true' lat='53.00126512202' lon='9.85930461533' />
  <node id='-140839' action='modify' visible='true' lat='53.00127758095' lon='9.85931519352' />
  <node id='-140840' action='modify' visible='true' lat='53.00129155366' lon='9.85931400306' />
  <node id='-140841' action='modify' visible='true' lat='53.00130329617' lon='9.85930136295' />
  <node id='-140842' action='modify' visible='true' lat='53.00130894567' lon='9.85925744177' />
  <node id='-140843' action='modify' visible='true' lat='53.00130133889' lon='9.85923792936' />
  <node id='-140844' action='modify' visible='true' lat='53.00128887997' lon='9.85922735117' />
  <node id='-140845' action='modify' visible='true' lat='53.00127490726' lon='9.85922854163' />
  <node id='-140846' action='modify' visible='true' lat='53.00126316474' lon='9.85924118175' />
  <node id='-140847' action='modify' visible='true' lat='53.00097835761' lon='9.85946640305'>
    <tag k='amenity' v='bench' />
    <tag k='backrest' v='yes' />
    <tag k='material' v='wood' />
    <tag k='name' v='Entrance Benches' />
    <tag k='seats' v='4' />
  </node>
  <node id='-140848' action='modify' visible='true' lat='53.00114138717' lon='9.86004844241' />
  <node id='-140849' action='modify' visible='true' lat='53.00113129873' lon='9.86013829641' />
  <node id='-140850' action='modify' visible='true' lat='53.00117423551' lon='9.86015160749' />
  <node id='-140851' action='modify' visible='true' lat='53.00115503248' lon='9.86032264186' />
  <node id='-140852' action='modify' visible='true' lat='53.00108892693' lon='9.86030023528' />
  <node id='-140853' action='modify' visible='true' lat='53.00108358005' lon='9.86033694802' />
  <node id='-140854' action='modify' visible='true' lat='53.00105755182' lon='9.86032621918' />
  <node id='-140855' action='modify' visible='true' lat='53.0010557359' lon='9.86034315063' />
  <node id='-140856' action='modify' visible='true' lat='53.00095353964' lon='9.86031431688' />
  <node id='-140857' action='modify' visible='true' lat='53.00096039981' lon='9.86025530828' />
  <node id='-140858' action='modify' visible='true' lat='53.00093013434' lon='9.86024793221' />
  <node id='-140859' action='modify' visible='true' lat='53.00094683074' lon='9.86010225481' />
  <node id='-140860' action='modify' visible='true' lat='53.00096705816' lon='9.8601101338' />
  <node id='-140861' action='modify' visible='true' lat='53.00097472556' lon='9.86003603753' />
  <node id='-140862' action='modify' visible='true' lat='53.00102254494' lon='9.86005146023' />
  <node id='-140863' action='modify' visible='true' lat='53.00105129697' lon='9.85978139548' />
  <node id='-140864' action='modify' visible='true' lat='53.00116802065' lon='9.85982112519' />
  <node id='-140866' action='modify' visible='true' lat='53.00125397406' lon='9.85944695704' />
  <node id='-140867' action='modify' visible='true' lat='53.00131329391' lon='9.85946774416' />
  <node id='-140868' action='modify' visible='true' lat='53.00130320551' lon='9.85954083435' />
  <node id='-140869' action='modify' visible='true' lat='53.00124428918' lon='9.85952138834' />
  <node id='-140875' action='modify' visible='true' lat='53.00219835299' lon='9.85958674723' />
  <node id='-140904' action='modify' visible='true' lat='53.00184938835' lon='9.86036402106' />
  <node id='-140905' action='modify' visible='true' lat='53.00186179693' lon='9.86026033692' />
  <node id='-140906' action='modify' visible='true' lat='53.00183264181' lon='9.86025296085' />
  <node id='-140907' action='modify' visible='true' lat='53.0018209394' lon='9.8603589081' />
  <node id='-140935' action='modify' visible='true' lat='53.00182008169' lon='9.86035677105' />
  <node id='-140936' action='modify' visible='true' lat='53.00183249028' lon='9.86025308691' />
  <node id='-140937' action='modify' visible='true' lat='53.00180333513' lon='9.86024571083' />
  <node id='-140938' action='modify' visible='true' lat='53.00179163272' lon='9.86035165809' />
  <node id='-140959' action='modify' visible='true' lat='53.00216050943' lon='9.85948165862' />
  <node id='-140960' action='modify' visible='true' lat='53.00221034514' lon='9.859375879' />
  <node id='-140962' action='modify' visible='true' lat='53.00223213573' lon='9.85942214694' />
  <node id='-140963' action='modify' visible='true' lat='53.00218492298' lon='9.8595153537' />
  <node id='-140964' action='modify' visible='true' lat='53.00225110153' lon='9.8594774675' />
  <node id='-140965' action='modify' visible='true' lat='53.00226320734' lon='9.85953111168' />
  <node id='-140966' action='modify' visible='true' lat='53.00220449399' lon='9.85961744545' />
  <node id='-140967' action='modify' visible='true' lat='53.00219662519' lon='9.8595683275' />
  <node id='-141045' action='modify' visible='true' lat='53.00114129777' lon='9.85948130778' />
  <node id='-141046' action='modify' visible='true' lat='53.00115495156' lon='9.85944677817' />
  <node id='-141047' action='modify' visible='true' lat='53.00114504245' lon='9.85943699495' />
  <node id='-141048' action='modify' visible='true' lat='53.00113144454' lon='9.85947251654' />
  <node id='-141049' action='modify' visible='true' lat='53.00115127291' lon='9.8594910823' />
  <node id='-141050' action='modify' visible='true' lat='53.00116492669' lon='9.85945655269' />
  <node id='-141051' action='modify' visible='true' lat='53.00115501759' lon='9.85944676947' />
  <node id='-141052' action='modify' visible='true' lat='53.00114141967' lon='9.85948229107' />
  <node id='-141083' action='modify' visible='true' lat='53.00157812982' lon='9.86023523273' />
  <node id='-141084' action='modify' visible='true' lat='53.00157444209' lon='9.86026959942' />
  <node id='-141085' action='modify' visible='true' lat='53.00160174379' lon='9.86024577566' />
  <node id='-141086' action='modify' visible='true' lat='53.00159685935' lon='9.86027963667' />
  <node id='-141087' action='modify' visible='true' lat='53.0016129595' lon='9.86019677949' />
  <node id='-141088' action='modify' visible='true' lat='53.00162076955' lon='9.86015034562' />
  <node id='-141089' action='modify' visible='true' lat='53.00159523881' lon='9.86014282018' />
  <node id='-141090' action='modify' visible='true' lat='53.00158802015' lon='9.86019126847' />
  <node id='-141110' action='modify' visible='true' lat='53.00160040872' lon='9.86019261148' />
  <node id='-141116' action='modify' visible='true' lat='53.0022' lon='9.85974'>
    <tag k='defibrillator:location' v='Right next to the kitchen door between door and window' />
    <tag k='emergency' v='defibrillator' />
    <tag k='name' v='Defbrilator' />
  </node>
  <node id='-141245' action='modify' visible='true' lat='53.00106' lon='9.85952'>
    <tag k='defibrillator:location' v='Next to the reception' />
    <tag k='emergency' v='defibrillator' />
    <tag k='name' v='Defbrilator' />
  </node>
  <node id='-141329' action='modify' visible='true' lat='53.00213740769' lon='9.85943807231' />
  <node id='-141330' action='modify' visible='true' lat='53.00218724343' lon='9.85933229269' />
  <node id='-141331' action='modify' visible='true' lat='53.00220903403' lon='9.85937856063' />
  <node id='-141332' action='modify' visible='true' lat='53.00216182125' lon='9.85947176739' />
  <way id='-112912' action='modify' visible='true'>
    <nd ref='-140724' />
    <nd ref='-140725' />
    <nd ref='-140726' />
    <nd ref='-140732' />
    <nd ref='-140727' />
    <nd ref='-140724' />
    <tag k='area' v='yes' />
    <tag k='indoor' v='room' />
    <tag k='level' v='0' />
    <tag k='name' v='Berlin' />
    <tag k='room' v='conference' />
  </way>
  <way id='-112913' action='modify' visible='true'>
    <nd ref='-140728' />
    <nd ref='-140729' />
    <nd ref='-140730' />
    <nd ref='-140731' />
    <nd ref='-140728' />
    <tag k='area' v='yes' />
    <tag k='indoor' v='room' />
    <tag k='level' v='0' />
    <tag k='name' v='Potsdam' />
    <tag k='room' v='conference' />
  </way>
  <way id='-112914' action='modify' visible='true'>
    <nd ref='-140732' />
    <nd ref='-140786' />
    <nd ref='-140733' />
    <nd ref='-140734' />
    <nd ref='-140726' />
    <nd ref='-140732' />
    <tag k='amenity' v='cafe' />
    <tag k='area' v='yes' />
    <tag k='description' v='Speciality coffee corner at SoCraTes. All beans on display are free to have, some assembly required. We usually bring whole beans, aeropresses, grinders and other equipment. The equipment can stay in that corner for the duration of the conference.' />
    <tag k='indoor' v='room' />
    <tag k='level' v='0' />
    <tag k='name' v='Pietzmoor Lounge' />
    <tag k='room' v='lounge' />
  </way>
  <way id='-112915' action='modify' visible='true'>
    <nd ref='-140735' />
    <nd ref='-140788' />
    <nd ref='-140736' />
    <nd ref='-140737' />
    <nd ref='-140738' />
    <nd ref='-140735' />
    <tag k='area' v='yes' />
    <tag k='indoor' v='room' />
    <tag k='level' v='0' />
    <tag k='name' v='Wiesbaden' />
    <tag k='room' v='conference' />
  </way>
  <way id='-112916' action='modify' visible='true'>
    <nd ref='-140740' />
    <nd ref='-140741' />
    <nd ref='-140742' />
    <nd ref='-140743' />
    <nd ref='-140740' />
    <tag k='area' v='yes' />
    <tag k='indoor' v='room' />
    <tag k='level' v='0' />
    <tag k='name' v='Böhmesaal' />
    <tag k='room' v='conference' />
  </way>
  <way id='-112917' action='modify' visible='true'>
    <nd ref='-140744' />
    <nd ref='-140745' />
    <nd ref='-140746' />
    <nd ref='-140747' />
    <nd ref='-140748' />
    <nd ref='-140749' />
    <nd ref='-140750' />
    <nd ref='-140751' />
    <nd ref='-140752' />
    <nd ref='-140753' />
    <nd ref='-140754' />
    <nd ref='-140755' />
    <nd ref='-140756' />
    <nd ref='-140757' />
    <nd ref='-140758' />
    <nd ref='-140759' />
    <nd ref='-140760' />
    <nd ref='-140761' />
    <nd ref='-140762' />
    <nd ref='-140763' />
    <nd ref='-140764' />
    <nd ref='-140875' />
    <nd ref='-140765' />
    <nd ref='-140766' />
    <nd ref='-140767' />
    <nd ref='-140768' />
    <nd ref='-140769' />
    <nd ref='-140770' />
    <nd ref='-140744' />
    <tag k='amenity' v='restaurant' />
    <tag k='area' v='yes' />
    <tag k='indoor' v='room' />
    <tag k='level' v='0' />
    <tag k='name' v='Restaurant' />
    <tag k='room' v='restaurant' />
  </way>
  <way id='-112918' action='modify' visible='true'>
    <nd ref='-140771' />
    <nd ref='-140772' />
    <nd ref='-140773' />
    <nd ref='-140774' />
    <nd ref='-140775' />
    <nd ref='-140776' />
    <nd ref='-140777' />
    <nd ref='-140778' />
    <nd ref='-140779' />
    <nd ref='-140780' />
    <nd ref='-140781' />
    <nd ref='-140782' />
    <nd ref='-140783' />
    <nd ref='-140784' />
    <nd ref='-140771' />
    <tag k='building' v='hotel' />
    <tag k='layer' v='1' />
    <tag k='name' v='Reception' />
  </way>
  <way id='-112919' action='modify' visible='true'>
    <nd ref='-140785' />
    <nd ref='-140786' />
    <nd ref='-140787' />
    <nd ref='-140789' />
    <nd ref='-140788' />
    <nd ref='-140785' />
    <tag k='area' v='yes' />
    <tag k='indoor' v='room' />
    <tag k='level' v='0' />
    <tag k='name' v='Köln' />
    <tag k='room' v='conference' />
  </way>
  <way id='-112920' action='modify' visible='true'>
    <nd ref='-140789' />
    <nd ref='-140790' />
    <nd ref='-140791' />
    <nd ref='-140792' />
    <nd ref='-140789' />
    <tag k='area' v='yes' />
    <tag k='indoor' v='room' />
    <tag k='level' v='0' />
    <tag k='name' v='Düsseldorf' />
    <tag k='room' v='conference' />
  </way>
  <way id='-112921' action='modify' visible='true'>
    <nd ref='-140792' />
    <nd ref='-140791' />
    <nd ref='-140793' />
    <nd ref='-140794' />
    <nd ref='-140792' />
    <tag k='area' v='yes' />
    <tag k='indoor' v='room' />
    <tag k='level' v='0' />
    <tag k='name' v='Stuttgart' />
    <tag k='room' v='conference' />
  </way>
  <way id='-112922' action='modify' visible='true'>
    <nd ref='-140795' />
    <nd ref='-140796' />
    <nd ref='-140797' />
    <nd ref='-140798' />
    <nd ref='-140795' />
    <tag k='area' v='yes' />
    <tag k='indoor' v='room' />
    <tag k='level' v='0' />
    <tag k='name' v='Dortmund' />
    <tag k='room' v='conference' />
  </way>
  <way id='-112923' action='modify' visible='true'>
    <nd ref='-140799' />
    <nd ref='-140800' />
    <nd ref='-140801' />
    <nd ref='-140802' />
    <nd ref='-140799' />
    <tag k='area' v='yes' />
    <tag k='indoor' v='room' />
    <tag k='level' v='0' />
    <tag k='name' v='Dresden' />
    <tag k='room' v='conference' />
  </way>
  <way id='-112924' action='modify' visible='true'>
    <nd ref='-140803' />
    <nd ref='-140804' />
    <nd ref='-140805' />
    <nd ref='-140806' />
    <nd ref='-140803' />
    <tag k='area' v='yes' />
    <tag k='indoor' v='room' />
    <tag k='level' v='0' />
    <tag k='name' v='Erfurt' />
    <tag k='room' v='conference' />
  </way>
  <way id='-112925' action='modify' visible='true'>
    <nd ref='-140807' />
    <nd ref='-140808' />
    <nd ref='-140809' />
    <nd ref='-140810' />
    <nd ref='-140807' />
    <tag k='area' v='yes' />
    <tag k='indoor' v='room' />
    <tag k='level' v='0' />
    <tag k='name' v='Hannover' />
    <tag k='room' v='conference' />
  </way>
  <way id='-112926' action='modify' visible='true'>
    <nd ref='-140811' />
    <nd ref='-140812' />
    <nd ref='-140813' />
    <nd ref='-140814' />
    <nd ref='-140811' />
    <tag k='area' v='yes' />
    <tag k='indoor' v='room' />
    <tag k='level' v='0' />
    <tag k='name' v='Hamburg' />
    <tag k='room' v='conference' />
  </way>
  <way id='-112927' action='modify' visible='true'>
    <nd ref='-140815' />
    <nd ref='-140810' />
    <nd ref='-140813' />
    <nd ref='-140816' />
    <nd ref='-140815' />
    <tag k='amenity' v='cafe' />
    <tag k='area' v='yes' />
    <tag k='indoor' v='room' />
    <tag k='level' v='0' />
    <tag k='name' v='Lüneburger Heide Lounge' />
    <tag k='room' v='lounge' />
  </way>
  <way id='-112928' action='modify' visible='true'>
    <nd ref='-140741' />
    <nd ref='-140817' />
    <nd ref='-140818' />
    <nd ref='-140742' />
    <nd ref='-140741' />
    <tag k='amenity' v='cafe' />
    <tag k='area' v='yes' />
    <tag k='indoor' v='room' />
    <tag k='level' v='0' />
    <tag k='name' v='Böhme Lounge' />
    <tag k='room' v='lounge' />
  </way>
  <way id='-112929' action='modify' visible='true'>
    <nd ref='-140819' />
    <nd ref='-140820' />
    <nd ref='-140821' />
    <nd ref='-140822' />
    <nd ref='-140823' />
    <nd ref='-140824' />
    <nd ref='-140825' />
    <nd ref='-140819' />
    <tag k='area' v='yes' />
    <tag k='description' v='A sheltered outdoor space, previously with several sheltered spaces with seating for 8+ people.' />
    <tag k='leisure' v='outdoor_seating' />
    <tag k='level' v='0' />
    <tag k='name' v='Tent Lounge' />
    <tag k='outdoor' v='yes' />
  </way>
  <way id='-112930' action='modify' visible='true'>
    <nd ref='-140755' />
    <nd ref='-140834' />
    <nd ref='-140833' />
    <nd ref='-140832' />
    <nd ref='-140831' />
    <nd ref='-140830' />
    <nd ref='-140829' />
    <nd ref='-140828' />
    <nd ref='-140827' />
    <nd ref='-140826' />
    <nd ref='-140745' />
    <nd ref='-140747' />
    <nd ref='-140748' />
    <nd ref='-140749' />
    <nd ref='-140750' />
    <nd ref='-140751' />
    <nd ref='-140752' />
    <nd ref='-140753' />
    <nd ref='-140755' />
    <tag k='amenity' v='restaurant' />
    <tag k='area' v='yes' />
    <tag k='leisure' v='outdoor_seating' />
    <tag k='level' v='0' />
    <tag k='name' v='Restaurant Outdoor Space' />
    <tag k='outdoor' v='yes' />
  </way>
  <way id='-112931' action='modify' visible='true'>
    <nd ref='-140836' />
    <nd ref='-140837' />
    <nd ref='-140838' />
    <nd ref='-140839' />
    <nd ref='-140840' />
    <nd ref='-140841' />
    <nd ref='-140835' />
    <nd ref='-140842' />
    <nd ref='-140843' />
    <nd ref='-140844' />
    <nd ref='-140845' />
    <nd ref='-140846' />
    <nd ref='-140836' />
    <tag k='leisure' v='outdoor_seating' />
    <tag k='name' v='Outdoor Circle' />
    <tag k='outdoor' v='yes' />
  </way>
  <way id='-112932' action='modify' visible='true'>
    <nd ref='-140848' />
    <nd ref='-140849' />
    <nd ref='-140850' />
    <nd ref='-140851' />
    <nd ref='-140852' />
    <nd ref='-140853' />
    <nd ref='-140854' />
    <nd ref='-140855' />
    <nd ref='-140856' />
    <nd ref='-140857' />
    <nd ref='-140858' />
    <nd ref='-140859' />
    <nd ref='-140860' />
    <nd ref='-140861' />
    <nd ref='-140862' />
    <nd ref='-140863' />
    <nd ref='-140864' />
    <nd ref='-140848' />
    <tag k='area' v='yes' />
    <tag k='indoor' v='room' />
    <tag k='level' v='0' />
    <tag k='name' v='Sports Area' />
  </way>
  <way id='-112953' action='modify' visible='true'>
    <nd ref='-140866' />
    <nd ref='-140867' />
    <nd ref='-140868' />
    <nd ref='-140869' />
    <nd ref='-140866' />
    <tag k='area' v='yes' />
    <tag k='description' v='The location of this room is guessed from photos from the Hotel. We will validate it asap!' />
    <tag k='indoor' v='room' />
    <tag k='level' v='0' />
    <tag k='name' v='Childcare' />
  </way>
  <way id='-113370' action='modify' visible='true'>
    <nd ref='-140904' />
    <nd ref='-140905' />
    <nd ref='-140906' />
    <nd ref='-140907' />
    <nd ref='-140904' />
    <tag k='access' v='customers' />
    <tag k='amenity' v='toilets' />
    <tag k='indoor' v='yes' />
    <tag k='name' v='Toilet (unisex, urinals, no sanitary bins)' />
    <tag k='toilets:menstrual_products' v='no' />
  </way>
  <way id='-113524' action='modify' visible='true'>
    <nd ref='-140935' />
    <nd ref='-140936' />
    <nd ref='-140937' />
    <nd ref='-140938' />
    <nd ref='-140935' />
    <tag k='access' v='customers' />
    <tag k='amenity' v='toilets' />
    <tag k='indoor' v='yes' />
    <tag k='name' v='Toilet (unisex, hygiene products, sanitary bins, no urinal)' />
    <tag k='toilets:menstrual_products' v='yes' />
  </way>
  <way id='-114070' action='modify' visible='true'>
    <nd ref='-140959' />
    <nd ref='-140960' />
    <nd ref='-140962' />
    <nd ref='-140963' />
    <nd ref='-140959' />
    <tag k='access' v='customers' />
    <tag k='amenity' v='toilets' />
    <tag k='indoor' v='yes' />
    <tag k='name' v='Toilet (Women)' />
    <tag k='toilets:menstrual_products' v='?' />
  </way>
  <way id='-114075' action='modify' visible='true'>
    <nd ref='-140962' />
    <nd ref='-140964' />
    <nd ref='-140965' />
    <nd ref='-140966' />
    <nd ref='-140967' />
    <nd ref='-140963' />
    <nd ref='-140962' />
    <tag k='access' v='customers' />
    <tag k='amenity' v='toilets' />
    <tag k='indoor' v='yes' />
    <tag k='name' v='Toilet (wheelchair accessible)' />
    <tag k='wheelchair' v='yes' />
  </way>
  <way id='-114205' action='modify' visible='true'>
    <nd ref='-141045' />
    <nd ref='-141046' />
    <nd ref='-141047' />
    <nd ref='-141048' />
    <nd ref='-141045' />
    <tag k='access' v='customers' />
    <tag k='amenity' v='toilets' />
    <tag k='indoor' v='yes' />
    <tag k='name' v='Toilet (unisex, sanitary bins, no urinal, no hygiene products)' />
    <tag k='toilets:menstrual_products' v='no' />
  </way>
  <way id='-114206' action='modify' visible='true'>
    <nd ref='-141049' />
    <nd ref='-141050' />
    <nd ref='-141051' />
    <nd ref='-141052' />
    <nd ref='-141049' />
    <tag k='access' v='customers' />
    <tag k='amenity' v='toilets' />
    <tag k='indoor' v='yes' />
    <tag k='name' v='Toilet (unisex, urinals, no sanitary bins)' />
    <tag k='toilets:menstrual_products' v='no' />
  </way>
  <way id='-114758' action='modify' visible='true'>
    <nd ref='-141086' />
    <nd ref='-141085' />
    <nd ref='-141083' />
    <nd ref='-141084' />
    <nd ref='-141086' />
    <tag k='access' v='customers' />
    <tag k='amenity' v='toilets' />
    <tag k='indoor' v='yes' />
    <tag k='name' v='Toilet (unisex, hygiene products, sanitary bins, no urinal)' />
    <tag k='toilets:menstrual_products' v='yes' />
  </way>
  <way id='-114759' action='modify' visible='true'>
    <nd ref='-141087' />
    <nd ref='-141088' />
    <nd ref='-141089' />
    <nd ref='-141090' />
    <nd ref='-141110' />
    <nd ref='-141087' />
    <tag k='access' v='customers' />
    <tag k='amenity' v='toilets' />
    <tag k='indoor' v='yes' />
    <tag k='name' v='Toilet (unisex, urinals, no sanitary bins)' />
    <tag k='toilets:menstrual_products' v='no' />
  </way>
  <way id='-115037' action='modify' visible='true'>
    <nd ref='-141329' />
    <nd ref='-141330' />
    <nd ref='-141331' />
    <nd ref='-141332' />
    <nd ref='-141329' />
    <tag k='access' v='customers' />
    <tag k='amenity' v='toilets' />
    <tag k='indoor' v='yes' />
    <tag k='name' v='Toilet (Men)' />
    <tag k='toilets:menstrual_products' v='no' />
  </way>
</osm>
