{
  "$schema": "https://docs.renovatebot.com/renovate-schema.json",
  "extends": ["config:base"],
  "automerge": true,
  "automergeType": "branch",
  "prConcurrentLimit": 2,
  "branchConcurrentLimit": 2,
  "regexManagers": [
    {
      "fileMatch": ["(^|/|\\.)Dockerfile$", "(^|/)Dockerfile[^/]*$"],
      "matchStrings": [
        "renovate: datasource=(?<datasource>.*?) depName=(?<depName>\\S*)( packageName=(?<packageName>\\S*))?( versioning=(?<versioning>\\S*))?( extractVersion=(?<extractVersion>\\S*))?\\s+(ARG|ENV) .*?_VERSION=(?<currentValue>.*)\\s"
      ],
      "versioningTemplate": "{{#if versioning}}{{{versioning}}}{{else}}semver{{/if}}"
    },
    {
      "fileMatch": ["(^|/)Vagrantfile[^/]*$", ".sh$"],
      "matchStrings": [
        "renovate: datasource=(?<datasource>.*?) depName=(?<depName>.*?)( versioning=(?<versioning>.*?))?\\s+(export )?.*?_VERSION=(?<currentValue>.*)\\s"
      ],
      "versioningTemplate": "{{#if versioning}}{{{versioning}}}{{else}}semver{{/if}}"
    }
  ],
  "flux": {
    "fileMatch": ["^apps/.+\\.yaml$"]
  }
}
