{
  "$schema": "https://docs.renovatebot.com/renovate-schema.json",
  "extends": ["config:base", "docker:enableMajor"],
  "automerge": true,
  "ignorePresets": ["workarounds:javaLTSVersions"],

  "automergeType": "branch",
  "prConcurrentLimit": 1,
  "separateMajorMinor": false,

  "branchConcurrentLimit": 1,
  "packageRules": [
    {
      "matchDatasources": ["docker"],
      "defaultRegistryUrls": ["https://index.docker.io"]
    },

    {
      "matchPackageNames": ["docker.io/eclipse-temurin", "eclipse-temurin"],
      "versioning": "regex:^(?<major>\\d+)(\\.(?<minor>\\d+))?(\\.(?<patch>\\d+))?(_(?<build>\\d+))?(-(?<compatibility>.*))?$"
    },
    {
      "matchPackageNames": ["docker.io/maven", "maven"],
      "versioning": "regex:^(?<minor>\\d+)(\\.(?<patch>\\d+))?(\\.(?<build>\\d+))?-eclipse-temurin-(?<major>\\d+)"
    },
    {
      "matchFiles": ["(^|/|\\.)pom\\.xml$"],
      "matchDepNames": ["eclipse-temurin"],
      "matchDatasources": ["docker"],
      "allowedVersions": "/^[0-9]+$/"
    }
  ],
  "regexManagers": [
    {
      "fileMatch": ["(^|/|\\.)pom\\.xml$"],
      "matchStrings": [
        "<java\\.version>(?<currentValue>.*?)<\\/java\\.version>"
      ],
      "depNameTemplate": "eclipse-temurin",
      "datasourceTemplate": "docker",
      "versioningTemplate": "regex:(?<major>\\d+).*"
    }
  ]
}
