module gitlab.com/witchbrew/go/chiutils

go 1.15

require (
	github.com/go-chi/chi v4.1.2+incompatible
	github.com/google/uuid v1.1.2
	github.com/rs/zerolog v1.20.0
	github.com/stretchr/testify v1.6.1
)
