%TF.GenerationSoftware,KiCad,Pcbnew,8.0.5-8.0.5-0~ubuntu22.04.1*%
%TF.CreationDate,2024-09-21T22:00:18-05:00*%
%TF.ProjectId,Valpo Shield,56616c70-6f20-4536-9869-656c642e6b69,rev?*%
%TF.SameCoordinates,Original*%
%TF.FileFunction,Paste,Top*%
%TF.FilePolarity,Positive*%
%FSLAX46Y46*%
G04 Gerber Fmt 4.6, Leading zero omitted, Abs format (unit mm)*
G04 Created by KiCad (PCBNEW 8.0.5-8.0.5-0~ubuntu22.04.1) date 2024-09-21 22:00:18*
%MOMM*%
%LPD*%
G01*
G04 APERTURE LIST*
G04 Aperture macros list*
%AMRoundRect*
0 Rectangle with rounded corners*
0 $1 Rounding radius*
0 $2 $3 $4 $5 $6 $7 $8 $9 X,Y pos of 4 corners*
0 Add a 4 corners polygon primitive as box body*
4,1,4,$2,$3,$4,$5,$6,$7,$8,$9,$2,$3,0*
0 Add four circle primitives for the rounded corners*
1,1,$1+$1,$2,$3*
1,1,$1+$1,$4,$5*
1,1,$1+$1,$6,$7*
1,1,$1+$1,$8,$9*
0 Add four rect primitives between the rounded corners*
20,1,$1+$1,$2,$3,$4,$5,0*
20,1,$1+$1,$4,$5,$6,$7,0*
20,1,$1+$1,$6,$7,$8,$9,0*
20,1,$1+$1,$8,$9,$2,$3,0*%
G04 Aperture macros list end*
%ADD10RoundRect,0.200000X-0.275000X0.200000X-0.275000X-0.200000X0.275000X-0.200000X0.275000X0.200000X0*%
%ADD11RoundRect,0.150000X-0.587500X-0.150000X0.587500X-0.150000X0.587500X0.150000X-0.587500X0.150000X0*%
%ADD12RoundRect,0.250000X-0.375000X-0.625000X0.375000X-0.625000X0.375000X0.625000X-0.375000X0.625000X0*%
%ADD13R,1.700000X1.000000*%
%ADD14RoundRect,0.250000X-0.625000X0.375000X-0.625000X-0.375000X0.625000X-0.375000X0.625000X0.375000X0*%
%ADD15RoundRect,0.225000X-0.250000X0.225000X-0.250000X-0.225000X0.250000X-0.225000X0.250000X0.225000X0*%
%ADD16RoundRect,0.250000X-0.707107X-0.176777X-0.176777X-0.707107X0.707107X0.176777X0.176777X0.707107X0*%
%ADD17RoundRect,0.250000X0.176777X-0.707107X0.707107X-0.176777X-0.176777X0.707107X-0.707107X0.176777X0*%
%ADD18RoundRect,0.250000X-0.176777X0.707107X-0.707107X0.176777X0.176777X-0.707107X0.707107X-0.176777X0*%
%ADD19R,3.500000X4.500000*%
%ADD20RoundRect,0.250000X0.375000X0.625000X-0.375000X0.625000X-0.375000X-0.625000X0.375000X-0.625000X0*%
%ADD21RoundRect,0.250000X0.707107X0.176777X0.176777X0.707107X-0.707107X-0.176777X-0.176777X-0.707107X0*%
%ADD22RoundRect,0.250000X0.625000X-0.375000X0.625000X0.375000X-0.625000X0.375000X-0.625000X-0.375000X0*%
G04 APERTURE END LIST*
D10*
%TO.C,R1*%
X114414797Y-119952000D03*
X114414797Y-121602000D03*
%TD*%
D11*
%TO.C,Q4*%
X132527297Y-123637000D03*
X132527297Y-125537000D03*
X134402297Y-124587000D03*
%TD*%
D12*
%TO.C,D1*%
X132699797Y-85852000D03*
X135499797Y-85852000D03*
%TD*%
D10*
%TO.C,R6*%
X127749797Y-119952000D03*
X127749797Y-121602000D03*
%TD*%
%TO.C,R9*%
X114414797Y-128982000D03*
X114414797Y-130632000D03*
%TD*%
%TO.C,R4*%
X122034797Y-119952000D03*
X122034797Y-121602000D03*
%TD*%
%TO.C,R2*%
X116319797Y-119952000D03*
X116319797Y-121602000D03*
%TD*%
D11*
%TO.C,Q1*%
X115382297Y-123637000D03*
X115382297Y-125537000D03*
X117257297Y-124587000D03*
%TD*%
D13*
%TO.C,SW1*%
X85329797Y-116277000D03*
X78729797Y-116277000D03*
X85329797Y-112577000D03*
X78729797Y-112577000D03*
%TD*%
D14*
%TO.C,D7*%
X107429797Y-111122000D03*
X107429797Y-113922000D03*
%TD*%
D10*
%TO.C,R13*%
X125844797Y-128982000D03*
X125844797Y-130632000D03*
%TD*%
D11*
%TO.C,Q8*%
X132527297Y-132667000D03*
X132527297Y-134567000D03*
X134402297Y-133617000D03*
%TD*%
%TO.C,Q6*%
X121097297Y-132667000D03*
X121097297Y-134567000D03*
X122972297Y-133617000D03*
%TD*%
D15*
%TO.C,C5*%
X118224797Y-129032000D03*
X118224797Y-130582000D03*
%TD*%
D11*
%TO.C,Q7*%
X126812297Y-132667000D03*
X126812297Y-134567000D03*
X128687297Y-133617000D03*
%TD*%
D10*
%TO.C,R12*%
X122034797Y-128982000D03*
X122034797Y-130632000D03*
%TD*%
D16*
%TO.C,D8*%
X125298386Y-103720589D03*
X127278284Y-105700487D03*
%TD*%
D17*
%TO.C,D2*%
X125298386Y-67983411D03*
X127278284Y-66003513D03*
%TD*%
D10*
%TO.C,R16*%
X133464797Y-128982000D03*
X133464797Y-130632000D03*
%TD*%
D15*
%TO.C,C8*%
X135369797Y-129032000D03*
X135369797Y-130582000D03*
%TD*%
D10*
%TO.C,R15*%
X131559797Y-128982000D03*
X131559797Y-130632000D03*
%TD*%
D11*
%TO.C,Q5*%
X115382297Y-132667000D03*
X115382297Y-134567000D03*
X117257297Y-133617000D03*
%TD*%
D10*
%TO.C,R3*%
X120129797Y-119952000D03*
X120129797Y-121602000D03*
%TD*%
D15*
%TO.C,C2*%
X123939797Y-120002000D03*
X123939797Y-121552000D03*
%TD*%
D18*
%TO.C,D6*%
X89561208Y-103720589D03*
X87581310Y-105700487D03*
%TD*%
D10*
%TO.C,R5*%
X125844797Y-119952000D03*
X125844797Y-121602000D03*
%TD*%
D11*
%TO.C,Q2*%
X121097297Y-123637000D03*
X121097297Y-125537000D03*
X122972297Y-124587000D03*
%TD*%
D19*
%TO.C,BT1*%
X79929797Y-129062000D03*
X109529797Y-129002000D03*
%TD*%
D10*
%TO.C,R8*%
X133464797Y-119952000D03*
X133464797Y-121602000D03*
%TD*%
D20*
%TO.C,D5*%
X82159797Y-85852000D03*
X79359797Y-85852000D03*
%TD*%
D15*
%TO.C,C6*%
X123939797Y-129032000D03*
X123939797Y-130582000D03*
%TD*%
D10*
%TO.C,R14*%
X127749797Y-128982000D03*
X127749797Y-130632000D03*
%TD*%
D15*
%TO.C,C3*%
X129654797Y-120002000D03*
X129654797Y-121552000D03*
%TD*%
D10*
%TO.C,R10*%
X116319797Y-128982000D03*
X116319797Y-130632000D03*
%TD*%
D15*
%TO.C,C7*%
X129654797Y-129032000D03*
X129654797Y-130582000D03*
%TD*%
D10*
%TO.C,R7*%
X131559797Y-119952000D03*
X131559797Y-121602000D03*
%TD*%
D11*
%TO.C,Q3*%
X126812297Y-123637000D03*
X126812297Y-125537000D03*
X128687297Y-124587000D03*
%TD*%
D21*
%TO.C,D4*%
X89561208Y-67983411D03*
X87581310Y-66003513D03*
%TD*%
D22*
%TO.C,D3*%
X107429797Y-60582000D03*
X107429797Y-57782000D03*
%TD*%
D10*
%TO.C,R11*%
X120129797Y-128982000D03*
X120129797Y-130632000D03*
%TD*%
D15*
%TO.C,C4*%
X135369797Y-120002000D03*
X135369797Y-121552000D03*
%TD*%
%TO.C,C1*%
X118224797Y-120002000D03*
X118224797Y-121552000D03*
%TD*%
M02*
