%TF.GenerationSoftware,KiCad,Pcbnew,8.0.5-8.0.5-0~ubuntu22.04.1*%
%TF.CreationDate,2024-09-21T22:00:18-05:00*%
%TF.ProjectId,Valpo Shield,56616c70-6f20-4536-9869-656c642e6b69,rev?*%
%TF.SameCoordinates,Original*%
%TF.FileFunction,Legend,Bot*%
%TF.FilePolarity,Positive*%
%FSLAX46Y46*%
G04 Gerber Fmt 4.6, Leading zero omitted, Abs format (unit mm)*
G04 Created by KiCad (PCBNEW 8.0.5-8.0.5-0~ubuntu22.04.1) date 2024-09-21 22:00:18*
%MOMM*%
%LPD*%
G01*
G04 APERTURE LIST*
%ADD10C,0.150000*%
%ADD11C,0.203200*%
%ADD12C,0.456000*%
%ADD13C,0.152400*%
G04 APERTURE END LIST*
D10*
X120129797Y-109982000D02*
X120129797Y-108712000D01*
D11*
X111209365Y-96920364D02*
X111481638Y-96824430D01*
X100841111Y-95527075D02*
X101078195Y-95683064D01*
D10*
X107429797Y-111252000D02*
X107429797Y-112204500D01*
D11*
X123694972Y-69490172D02*
X125771067Y-67414072D01*
X83921740Y-74793474D02*
X86582390Y-76034193D01*
X110091171Y-97237790D02*
X110374886Y-97168554D01*
X117039921Y-92577012D02*
X117201533Y-92343962D01*
X116872910Y-92805940D02*
X117039921Y-92577012D01*
X117791598Y-91372366D02*
X117924676Y-91120093D01*
X106225030Y-97478597D02*
X106523232Y-97505033D01*
X110374886Y-97168554D02*
X110655890Y-97092513D01*
X118051788Y-90864261D02*
X118172841Y-90604964D01*
X81590235Y-83494740D02*
X84514764Y-83750504D01*
X102064978Y-75260414D02*
X101812705Y-75393518D01*
X115960049Y-77625132D02*
X115762553Y-77422873D01*
X84966672Y-72786169D02*
X87509141Y-74254080D01*
X112016759Y-74897335D02*
X111750802Y-74788689D01*
X128277198Y-95476835D02*
X130937846Y-96717554D01*
X100608062Y-76145504D02*
X100379138Y-76312515D01*
X101078195Y-95683064D02*
X101319219Y-95833467D01*
X129648448Y-79801863D02*
X132484423Y-79041979D01*
X90757170Y-105625200D02*
X92644178Y-103376242D01*
X112794553Y-96250217D02*
X113046826Y-96117139D01*
X104484843Y-97168554D02*
X104768611Y-97237790D01*
X102925530Y-60211054D02*
X103435294Y-63102419D01*
D10*
X89649797Y-120142000D02*
X88379797Y-121412000D01*
D11*
X109224462Y-97403736D02*
X109515866Y-97355485D01*
X106523232Y-97505033D02*
X106823517Y-97524024D01*
D10*
X89014797Y-111252000D02*
X87744797Y-111252000D01*
D11*
X89088530Y-104096613D02*
X91164626Y-102020514D01*
D10*
X111239797Y-110617000D02*
X112509797Y-110617000D01*
X112509797Y-113792000D01*
X111239797Y-113792000D01*
X111239797Y-110617000D01*
D11*
X97206967Y-91620983D02*
X97351754Y-91865851D01*
X127350451Y-74254080D02*
X129892924Y-72786173D01*
X101078195Y-75827787D02*
X100841111Y-75983893D01*
X108336560Y-97505033D02*
X108634723Y-97478597D01*
X112538721Y-96377329D02*
X112794553Y-96250217D01*
D10*
X116954797Y-115697000D02*
X116954797Y-118237000D01*
D11*
X99718031Y-76845033D02*
X99506520Y-77032731D01*
X81885512Y-81251425D02*
X84776879Y-81761189D01*
D10*
X121399797Y-118237000D02*
X121399797Y-120777000D01*
X108699797Y-120142000D02*
X107429797Y-121412000D01*
X118224797Y-116967000D02*
X116954797Y-116967000D01*
D11*
X126272364Y-98949228D02*
X128677249Y-100633036D01*
D10*
X125844797Y-122682000D02*
X120129797Y-122682000D01*
X120764797Y-111252000D02*
X119494797Y-111252000D01*
D11*
X96571795Y-90342299D02*
X96686692Y-90604964D01*
D10*
X92189797Y-110617000D02*
X93459797Y-110617000D01*
X93459797Y-113792000D01*
X92189797Y-113792000D01*
X92189797Y-110617000D01*
X111874797Y-119507000D02*
X109334797Y-119507000D01*
D11*
X105343916Y-74155466D02*
X105055041Y-74210831D01*
X115141585Y-94665932D02*
X115353159Y-94478234D01*
D10*
X124574797Y-119507000D02*
X122034797Y-119507000D01*
D11*
X111424300Y-63102419D02*
X111934064Y-60211054D01*
D12*
X88607797Y-116967000D02*
G75*
G02*
X88151797Y-116967000I-228000J0D01*
G01*
X88151797Y-116967000D02*
G75*
G02*
X88607797Y-116967000I228000J0D01*
G01*
D11*
X89088526Y-67414068D02*
X91164624Y-69490164D01*
X125050696Y-70969721D02*
X127299655Y-69082712D01*
D12*
X112102797Y-116967000D02*
G75*
G02*
X111646797Y-116967000I-228000J0D01*
G01*
X111646797Y-116967000D02*
G75*
G02*
X112102797Y-116967000I228000J0D01*
G01*
D10*
X108699797Y-118872000D02*
X107429797Y-117602000D01*
D11*
X107429942Y-97539320D02*
X107734083Y-97535482D01*
X115353159Y-94478234D02*
X115560177Y-94285591D01*
X128277201Y-76034197D02*
X130937854Y-74793478D01*
X98519246Y-93467127D02*
X98706994Y-93678701D01*
X99299589Y-77225373D02*
X99097331Y-77422869D01*
X105929011Y-97444803D02*
X106225030Y-97478597D01*
X96807749Y-90864261D02*
X96934874Y-91120093D01*
X113781336Y-75827787D02*
X113540312Y-75677295D01*
X122215422Y-68134443D02*
X124102782Y-65885485D01*
X97067977Y-91372365D02*
X97206967Y-91620983D01*
X127350451Y-97256602D02*
X129892924Y-98724508D01*
X117924676Y-91120093D02*
X118051788Y-90864261D01*
X106823516Y-73986646D02*
X106523230Y-74005693D01*
X114705118Y-76484835D02*
X114480398Y-76312515D01*
D10*
X118224797Y-116967000D02*
X120129797Y-116967000D01*
D11*
X108036318Y-97524024D02*
X108336560Y-97505033D01*
X111481638Y-96824430D02*
X111750802Y-96722038D01*
X99506520Y-77032731D02*
X99299589Y-77225373D01*
X101564087Y-95978191D02*
X101812705Y-96117139D01*
D10*
X107429797Y-111252000D02*
X108064797Y-109982000D01*
D11*
X116700591Y-93030660D02*
X116872910Y-92805940D01*
X107125786Y-73975148D02*
X106823516Y-73986646D01*
X97819847Y-92577009D02*
X97986776Y-92805938D01*
X83921746Y-96717558D02*
X86582396Y-95476839D01*
D10*
X126479797Y-108712000D02*
X124574797Y-108712000D01*
D11*
X98336566Y-93251084D02*
X98519246Y-93467127D01*
X98706994Y-93678701D02*
X98899719Y-93885719D01*
X130432322Y-85755339D02*
X133368136Y-85755339D01*
X100154431Y-95026132D02*
X100379138Y-95198451D01*
X97658351Y-92343958D02*
X97819847Y-92577009D01*
X83055674Y-76884039D02*
X85814397Y-77888045D01*
X115560177Y-94285591D02*
X115762553Y-94088095D01*
X112016759Y-96613276D02*
X112279425Y-96498380D01*
D10*
X119494797Y-112204500D02*
X120764797Y-112204500D01*
X120764797Y-115379500D01*
X119494797Y-115379500D01*
X119494797Y-112204500D01*
D11*
X103925624Y-97009754D02*
X104203820Y-97092513D01*
X111750802Y-74788689D02*
X111481638Y-74686385D01*
D10*
X89014797Y-109982000D02*
X87744797Y-109982000D01*
D11*
X103378047Y-96824430D02*
X103650339Y-96920364D01*
X107429942Y-73971295D02*
X107125786Y-73975148D01*
D10*
X89014797Y-121412000D02*
X88379797Y-121412000D01*
D11*
X103925623Y-74501167D02*
X103650338Y-74590514D01*
D10*
X120129797Y-111252000D02*
X120764797Y-109982000D01*
X120129797Y-120777000D02*
X120129797Y-121412000D01*
D11*
X109224462Y-74107175D02*
X108930719Y-74066052D01*
X114251470Y-95365463D02*
X114480398Y-95198451D01*
X113540312Y-95833467D02*
X113781336Y-95683064D01*
X109804843Y-97300135D02*
X110091171Y-97237790D01*
D10*
X92824797Y-119507000D02*
X90284797Y-119507000D01*
D11*
X112538721Y-75133289D02*
X112279425Y-75012232D01*
X102580107Y-96498380D02*
X102842772Y-96613276D01*
X99299589Y-94285591D02*
X99506520Y-94478234D01*
X115560177Y-77225376D02*
X115353159Y-77032733D01*
D10*
X121399797Y-119507000D02*
X122034797Y-119507000D01*
D11*
X109515866Y-74155466D02*
X109224462Y-74107175D01*
D10*
X88379797Y-111252000D02*
X88379797Y-112204500D01*
D11*
X107125787Y-97535482D02*
X107429942Y-97539320D01*
D10*
X88379797Y-108712000D02*
X124574797Y-108712000D01*
D11*
X115762553Y-94088095D02*
X115960050Y-93885719D01*
X123694968Y-102020514D02*
X125771067Y-104096609D01*
X97502245Y-92106875D02*
X97658351Y-92343958D01*
D10*
X105524797Y-116967000D02*
X107429797Y-116967000D01*
X130924797Y-108712000D02*
X127749797Y-108712000D01*
D11*
X113781336Y-95683064D02*
X114018420Y-95527075D01*
D10*
X85204797Y-115697000D02*
X85204797Y-118237000D01*
D11*
X102842772Y-96613276D02*
X103108830Y-96722038D01*
X101319219Y-95833467D02*
X101564087Y-95978191D01*
X116340390Y-78043591D02*
X116152692Y-77832067D01*
D10*
X127749797Y-107442000D02*
X127749797Y-108077000D01*
X124574797Y-113792000D02*
X124574797Y-119507000D01*
D11*
X96686692Y-90604964D02*
X96807749Y-90864261D01*
X114480398Y-76312515D02*
X114251470Y-76145504D01*
X98336566Y-78259616D02*
X98159046Y-78480057D01*
X114925543Y-94848595D02*
X115141585Y-94665932D01*
X115141585Y-76845034D02*
X114925543Y-76662371D01*
D10*
X88379797Y-111252000D02*
X89014797Y-109982000D01*
X137909797Y-139192000D02*
X76949797Y-139192000D01*
D11*
X86182343Y-70877997D02*
X88587231Y-72561804D01*
X116872909Y-78704827D02*
X116700590Y-78480058D01*
D10*
X126479797Y-107442000D02*
X126479797Y-108077000D01*
D11*
X116700590Y-78480058D02*
X116523053Y-78259616D01*
D10*
X124574797Y-124587000D02*
X124574797Y-119507000D01*
X88379797Y-122682000D02*
X88379797Y-121412000D01*
D11*
X94460628Y-63292212D02*
X95928537Y-65834681D01*
X100841111Y-75983893D02*
X100608062Y-76145504D01*
D10*
X92824797Y-110617000D02*
X92824797Y-108712000D01*
D11*
X130344836Y-83750506D02*
X133269362Y-83494742D01*
X98159046Y-78480057D02*
X97986776Y-78704827D01*
D12*
X120357797Y-122682000D02*
G75*
G02*
X119901797Y-122682000I-228000J0D01*
G01*
X119901797Y-122682000D02*
G75*
G02*
X120357797Y-122682000I228000J0D01*
G01*
D11*
X111481638Y-74686385D02*
X111209365Y-74590514D01*
X113046826Y-75393518D02*
X112794553Y-75260414D01*
D10*
X102984797Y-116967000D02*
X101714797Y-116967000D01*
D12*
X107657797Y-108712000D02*
G75*
G02*
X107201797Y-108712000I-228000J0D01*
G01*
X107201797Y-108712000D02*
G75*
G02*
X107657797Y-108712000I228000J0D01*
G01*
D10*
X120129797Y-121412000D02*
X120129797Y-122682000D01*
D11*
X99506520Y-94478234D02*
X99718031Y-94665932D01*
X83055676Y-94626997D02*
X85814398Y-93622641D01*
X98558493Y-61381212D02*
X99562499Y-64139937D01*
X107734083Y-73975148D02*
X107429942Y-73971295D01*
X104768611Y-97237790D02*
X105055041Y-97300135D01*
X103650339Y-96920364D02*
X103925624Y-97009754D01*
X99097331Y-94088095D02*
X99299589Y-94285591D01*
D10*
X130924797Y-115697000D02*
X130924797Y-122682000D01*
D11*
X90757167Y-65885481D02*
X92644175Y-68134440D01*
X105055041Y-74210831D02*
X104768610Y-74273174D01*
X102320810Y-75133289D02*
X102064978Y-75260414D01*
X117357522Y-92106877D02*
X117507925Y-91865853D01*
D10*
X115684797Y-115697000D02*
X115684797Y-118237000D01*
X121399797Y-118872000D02*
X120129797Y-117602000D01*
D11*
X125050692Y-100540961D02*
X127299655Y-102428320D01*
X98159046Y-93030659D02*
X98336566Y-93251084D01*
X103378046Y-74686386D02*
X103108830Y-74788690D01*
X112794553Y-75260414D02*
X112538721Y-75133289D01*
X82375165Y-92468703D02*
X85211146Y-91708819D01*
X101812705Y-75393518D02*
X101564087Y-75532508D01*
D10*
X114414797Y-116967000D02*
X111874797Y-116967000D01*
X76949797Y-85852000D02*
G75*
G02*
X137909797Y-85852000I30480000J0D01*
G01*
D11*
X97986776Y-78704827D02*
X97819847Y-78933839D01*
D10*
X83934797Y-116967000D02*
X82664797Y-116967000D01*
X107429797Y-120777000D02*
X107429797Y-121412000D01*
D11*
X109515866Y-97355485D02*
X109804843Y-97300135D01*
X117039921Y-78933839D02*
X116872909Y-78704827D01*
X113046826Y-96117139D02*
X113295444Y-95978191D01*
X100154431Y-76484834D02*
X99934032Y-76662370D01*
X97351754Y-91865851D02*
X97502245Y-92106875D01*
X105169196Y-59915777D02*
X105424960Y-62840304D01*
D10*
X88379797Y-120777000D02*
X88379797Y-121412000D01*
D11*
X108634723Y-97478597D02*
X108930719Y-97444803D01*
X115353159Y-77032733D02*
X115141585Y-76845034D01*
D10*
X137909797Y-85852000D02*
X137909797Y-139192000D01*
D11*
X115762553Y-77422873D02*
X115560177Y-77225376D01*
X98706994Y-77832065D02*
X98519246Y-78043590D01*
D10*
X106794797Y-112204500D02*
X108064797Y-112204500D01*
X108064797Y-115379500D01*
X106794797Y-115379500D01*
X106794797Y-112204500D01*
D11*
X97986776Y-92805938D02*
X98159046Y-93030659D01*
D10*
X107429797Y-115379500D02*
X107429797Y-117602000D01*
D12*
X107657797Y-122682000D02*
G75*
G02*
X107201797Y-122682000I-228000J0D01*
G01*
X107201797Y-122682000D02*
G75*
G02*
X107657797Y-122682000I228000J0D01*
G01*
D11*
X108634723Y-74032193D02*
X108336560Y-74005693D01*
D10*
X81394797Y-116967000D02*
X81394797Y-124587000D01*
D11*
X114480398Y-95198451D02*
X114705118Y-95026132D01*
D10*
X86474797Y-116967000D02*
X85204797Y-116967000D01*
D11*
X129045199Y-77888045D02*
X131803919Y-76884039D01*
D10*
X108699797Y-118237000D02*
X108699797Y-120777000D01*
D12*
X112102797Y-108712000D02*
G75*
G02*
X111646797Y-108712000I-228000J0D01*
G01*
X111646797Y-108712000D02*
G75*
G02*
X112102797Y-108712000I228000J0D01*
G01*
D10*
X89649797Y-119507000D02*
X90284797Y-119507000D01*
X120129797Y-122682000D02*
X88379797Y-122682000D01*
D11*
X117507925Y-91865853D02*
X117652649Y-91620984D01*
X104484842Y-74342406D02*
X104203818Y-74418433D01*
D10*
X127749797Y-107442000D02*
X126479797Y-107442000D01*
D11*
X98899719Y-93885719D02*
X99097331Y-94088095D01*
X103650338Y-74590514D02*
X103378046Y-74686386D01*
X116523054Y-93251085D02*
X116700591Y-93030660D01*
D10*
X130924797Y-115062000D02*
X130924797Y-108712000D01*
X82664797Y-116967000D02*
X81394797Y-116967000D01*
D11*
X112279425Y-75012232D02*
X112016759Y-74897335D01*
X81885512Y-90259609D02*
X84776879Y-89749846D01*
D10*
X81394797Y-124587000D02*
X124574797Y-124587000D01*
D11*
X110091171Y-74273174D02*
X109804843Y-74210831D01*
D10*
X88379797Y-109982000D02*
X88379797Y-108712000D01*
D11*
X105343917Y-97355485D02*
X105635273Y-97403736D01*
X84966674Y-98724512D02*
X87509143Y-97256605D01*
X92552100Y-64507883D02*
X94236260Y-66912771D01*
X114018420Y-95527075D02*
X114251470Y-95365463D01*
X106523230Y-74005693D02*
X106225028Y-74032193D01*
X81491458Y-85755339D02*
X84427273Y-85755339D01*
D10*
X131559797Y-115697000D02*
X130289797Y-115697000D01*
D11*
X104768610Y-74273174D02*
X104484842Y-74342406D01*
X117652649Y-91620984D02*
X117791598Y-91372366D01*
X86182345Y-100633040D02*
X88587231Y-98949232D01*
X114018420Y-75983893D02*
X113781336Y-75827787D01*
X109804843Y-74210831D02*
X109515866Y-74155466D01*
X100379138Y-76312515D02*
X100154431Y-76484834D01*
X114251470Y-76145504D02*
X114018420Y-75983893D01*
X87559941Y-69082709D02*
X89808900Y-70969717D01*
D10*
X123939797Y-110617000D02*
X125209797Y-110617000D01*
X125209797Y-113792000D01*
X123939797Y-113792000D01*
X123939797Y-110617000D01*
D11*
X106823517Y-97524024D02*
X107125787Y-97535482D01*
X99718031Y-94665932D02*
X99934032Y-94848595D01*
X126272364Y-72561808D02*
X128677249Y-70877997D01*
X100608062Y-95365463D02*
X100841111Y-95527075D01*
X117151293Y-64907934D02*
X118391661Y-62247290D01*
X130344828Y-87760174D02*
X133269358Y-88015938D01*
D10*
X132194797Y-115062000D02*
X129654797Y-115062000D01*
D11*
X104203818Y-74418433D02*
X103925623Y-74501167D01*
D12*
X124802797Y-119507000D02*
G75*
G02*
X124346797Y-119507000I-228000J0D01*
G01*
X124346797Y-119507000D02*
G75*
G02*
X124802797Y-119507000I228000J0D01*
G01*
D10*
X104254797Y-115697000D02*
X104254797Y-118237000D01*
D11*
X108036318Y-73986646D02*
X107734083Y-73975148D01*
X113295444Y-75532508D02*
X113046826Y-75393518D01*
D10*
X108064797Y-109982000D02*
X106794797Y-109982000D01*
X88379797Y-115379500D02*
X88379797Y-117602000D01*
D11*
X99097331Y-77422869D02*
X98899719Y-77625129D01*
X129045195Y-93622641D02*
X131803919Y-94626997D01*
D10*
X130924797Y-122682000D02*
X125844797Y-122682000D01*
D11*
X130083071Y-81761193D02*
X132974085Y-81251429D01*
X110934083Y-97009754D02*
X111209365Y-96920364D01*
D10*
X83934797Y-115697000D02*
X83934797Y-118237000D01*
D11*
X108930719Y-74066052D02*
X108634723Y-74032193D01*
X105635272Y-74107175D02*
X105343916Y-74155466D01*
X115960050Y-93885719D02*
X116152693Y-93678701D01*
X109434634Y-62840307D02*
X109690398Y-59915781D01*
X116152692Y-77832067D02*
X115960049Y-77625132D01*
D10*
X105524797Y-116967000D02*
X104254797Y-116967000D01*
X108699797Y-119507000D02*
X109334797Y-119507000D01*
D11*
X87559943Y-102428324D02*
X89808900Y-100540964D01*
X118172841Y-90604964D02*
X118287738Y-90342299D01*
X114705118Y-95026132D02*
X114925543Y-94848595D01*
X99934032Y-76662370D02*
X99718031Y-76845033D01*
X101319219Y-75677295D02*
X101078195Y-75827787D01*
D10*
X86474797Y-116967000D02*
X88379797Y-116967000D01*
D11*
X113540312Y-75677295D02*
X113295444Y-75532508D01*
X110655890Y-74418433D02*
X110374886Y-74342405D01*
X110655890Y-97092513D02*
X110934083Y-97009754D01*
X98519246Y-78043590D02*
X98336566Y-78259616D01*
X107734083Y-97535482D02*
X108036318Y-97524024D01*
D12*
X120357797Y-116967000D02*
G75*
G02*
X119901797Y-116967000I-228000J0D01*
G01*
X119901797Y-116967000D02*
G75*
G02*
X120357797Y-116967000I228000J0D01*
G01*
D10*
X121399797Y-120142000D02*
X120129797Y-121412000D01*
D11*
X117201533Y-92343962D02*
X117357522Y-92106877D01*
X120623690Y-66912775D02*
X122307498Y-64507891D01*
X102580107Y-75012232D02*
X102320810Y-75133289D01*
X103108830Y-74788690D02*
X102842772Y-74897335D01*
X129648448Y-91708817D02*
X132484431Y-92468703D01*
D10*
X107429797Y-109982000D02*
X107429797Y-108712000D01*
X78219797Y-126492000D02*
X136639797Y-126492000D01*
X136639797Y-137922000D01*
X78219797Y-137922000D01*
X78219797Y-126492000D01*
G36*
X78219797Y-126492000D02*
G01*
X136639797Y-126492000D01*
X136639797Y-137922000D01*
X78219797Y-137922000D01*
X78219797Y-126492000D01*
G37*
D11*
X106225028Y-74032193D02*
X105929009Y-74066052D01*
X103108830Y-96722038D02*
X103378047Y-96824430D01*
X112279425Y-96498380D02*
X112538721Y-96377329D01*
X130083068Y-89749842D02*
X132974082Y-90259606D01*
D10*
X102984797Y-115697000D02*
X102984797Y-118237000D01*
X107429797Y-122682000D02*
X107429797Y-121412000D01*
D11*
X122215419Y-103376234D02*
X124102778Y-105625193D01*
D10*
X111874797Y-110617000D02*
X111874797Y-108712000D01*
D11*
X102842772Y-74897335D02*
X102580107Y-75012232D01*
D12*
X120357797Y-108712000D02*
G75*
G02*
X119901797Y-108712000I-228000J0D01*
G01*
X119901797Y-108712000D02*
G75*
G02*
X120357797Y-108712000I228000J0D01*
G01*
D11*
X116340392Y-93467127D02*
X116523054Y-93251085D01*
X105055041Y-97300135D02*
X105343917Y-97355485D01*
X100379138Y-95198451D02*
X100608062Y-95365463D01*
D10*
X115684797Y-116967000D02*
X114414797Y-116967000D01*
D11*
X102064978Y-96250217D02*
X102320810Y-96377329D01*
X116152693Y-93678701D02*
X116340392Y-93467127D01*
X115297095Y-64139937D02*
X116301100Y-61381212D01*
X98899719Y-77625129D02*
X98706994Y-77832065D01*
D10*
X87744797Y-112204500D02*
X89014797Y-112204500D01*
X89014797Y-115379500D01*
X87744797Y-115379500D01*
X87744797Y-112204500D01*
D11*
X101812705Y-96117139D02*
X102064978Y-96250217D01*
D10*
X106794797Y-109982000D02*
X107429797Y-111252000D01*
D11*
X113295444Y-95978191D02*
X113540312Y-95833467D01*
X81590237Y-88015940D02*
X84514765Y-87760178D01*
X104203820Y-97092513D02*
X104484843Y-97168554D01*
D12*
X93052797Y-108712000D02*
G75*
G02*
X92596797Y-108712000I-228000J0D01*
G01*
X92596797Y-108712000D02*
G75*
G02*
X93052797Y-108712000I228000J0D01*
G01*
D10*
X120129797Y-111252000D02*
X120129797Y-112204500D01*
D11*
X101564087Y-75532508D02*
X101319219Y-75677295D01*
X110374886Y-74342405D02*
X110091171Y-74273174D01*
X99934032Y-94848595D02*
X100154431Y-95026132D01*
X110934083Y-74501166D02*
X110655890Y-74418433D01*
D10*
X89649797Y-118237000D02*
X89649797Y-120777000D01*
D11*
X82375168Y-79041979D02*
X85211148Y-79801861D01*
X108930719Y-97444803D02*
X109224462Y-97403736D01*
D10*
X87744797Y-109982000D02*
X88379797Y-111252000D01*
D11*
X105929009Y-74066052D02*
X105635272Y-74107175D01*
X100716437Y-60701060D02*
X101476319Y-63536684D01*
D10*
X119494797Y-109982000D02*
X120129797Y-111252000D01*
D11*
X111209365Y-74590514D02*
X110934083Y-74501166D01*
D10*
X108064797Y-111252000D02*
X106794797Y-111252000D01*
D11*
X96467933Y-62247290D02*
X97708653Y-64907934D01*
X111750802Y-96722038D02*
X112016759Y-96613276D01*
X96934874Y-91120093D02*
X97067977Y-91372365D01*
X105635273Y-97403736D02*
X105929011Y-97444803D01*
D10*
X128384797Y-108077000D02*
X125844797Y-108077000D01*
D11*
X116523053Y-78259616D02*
X116340390Y-78043591D01*
D10*
X111874797Y-113792000D02*
X111874797Y-119507000D01*
D11*
X118931060Y-65834688D02*
X120398966Y-63292219D01*
X114925543Y-76662371D02*
X114705118Y-76484835D01*
X108336560Y-74005693D02*
X108036318Y-73986646D01*
D10*
X120764797Y-121412000D02*
X120129797Y-121412000D01*
D11*
X107429797Y-62752817D02*
X107429797Y-59817000D01*
D10*
X120764797Y-109982000D02*
X119494797Y-109982000D01*
X124574797Y-110617000D02*
X124574797Y-108712000D01*
D11*
X102320810Y-96377329D02*
X102580107Y-96498380D01*
D10*
X120129797Y-115379500D02*
X120129797Y-117602000D01*
D11*
X113383273Y-63536692D02*
X114143157Y-60701063D01*
D10*
X76949797Y-139192000D02*
X76949797Y-85852000D01*
D12*
X124802797Y-108712000D02*
G75*
G02*
X124346797Y-108712000I-228000J0D01*
G01*
X124346797Y-108712000D02*
G75*
G02*
X124802797Y-108712000I228000J0D01*
G01*
D10*
X89649797Y-118872000D02*
X88379797Y-117602000D01*
X108064797Y-121412000D02*
X107429797Y-121412000D01*
X92824797Y-113792000D02*
X92824797Y-119507000D01*
D13*
X123115474Y-111908166D02*
X123708141Y-111908166D01*
X122776808Y-111696500D02*
X123411808Y-111484833D01*
X123411808Y-111484833D02*
X123411808Y-112035166D01*
X122819141Y-112289167D02*
X122819141Y-112881833D01*
X122819141Y-112881833D02*
X123708141Y-112500833D01*
X123708141Y-113220500D02*
X122819141Y-113220500D01*
X123369474Y-113305167D02*
X123708141Y-113559167D01*
X123115474Y-113559167D02*
X123454141Y-113220500D01*
D10*
X85307892Y-119345152D02*
X85307892Y-120011819D01*
X85545987Y-118964200D02*
X85784082Y-119678485D01*
X85784082Y-119678485D02*
X85165035Y-119678485D01*
X84355511Y-119345152D02*
X84355511Y-120011819D01*
X84784082Y-119345152D02*
X84784082Y-119868961D01*
X84784082Y-119868961D02*
X84736463Y-119964200D01*
X84736463Y-119964200D02*
X84641225Y-120011819D01*
X84641225Y-120011819D02*
X84498368Y-120011819D01*
X84498368Y-120011819D02*
X84403130Y-119964200D01*
X84403130Y-119964200D02*
X84355511Y-119916580D01*
X83974558Y-119011819D02*
X83307892Y-119011819D01*
X83307892Y-119011819D02*
X83736463Y-120011819D01*
D13*
X119263141Y-113516833D02*
X119263141Y-113008833D01*
X119263141Y-113262833D02*
X118374141Y-113262833D01*
X118374141Y-113262833D02*
X118501141Y-113178166D01*
X118501141Y-113178166D02*
X118585808Y-113093500D01*
X118585808Y-113093500D02*
X118628141Y-113008833D01*
X118374141Y-114321167D02*
X118374141Y-113897833D01*
X118374141Y-113897833D02*
X118797474Y-113855500D01*
X118797474Y-113855500D02*
X118755141Y-113897833D01*
X118755141Y-113897833D02*
X118712808Y-113982500D01*
X118712808Y-113982500D02*
X118712808Y-114194167D01*
X118712808Y-114194167D02*
X118755141Y-114278833D01*
X118755141Y-114278833D02*
X118797474Y-114321167D01*
X118797474Y-114321167D02*
X118882141Y-114363500D01*
X118882141Y-114363500D02*
X119093808Y-114363500D01*
X119093808Y-114363500D02*
X119178474Y-114321167D01*
X119178474Y-114321167D02*
X119220808Y-114278833D01*
X119220808Y-114278833D02*
X119263141Y-114194167D01*
X119263141Y-114194167D02*
X119263141Y-113982500D01*
X119263141Y-113982500D02*
X119220808Y-113897833D01*
X119220808Y-113897833D02*
X119178474Y-113855500D01*
X118374141Y-114913834D02*
X118374141Y-114998500D01*
X118374141Y-114998500D02*
X118416474Y-115083167D01*
X118416474Y-115083167D02*
X118458808Y-115125500D01*
X118458808Y-115125500D02*
X118543474Y-115167834D01*
X118543474Y-115167834D02*
X118712808Y-115210167D01*
X118712808Y-115210167D02*
X118924474Y-115210167D01*
X118924474Y-115210167D02*
X119093808Y-115167834D01*
X119093808Y-115167834D02*
X119178474Y-115125500D01*
X119178474Y-115125500D02*
X119220808Y-115083167D01*
X119220808Y-115083167D02*
X119263141Y-114998500D01*
X119263141Y-114998500D02*
X119263141Y-114913834D01*
X119263141Y-114913834D02*
X119220808Y-114829167D01*
X119220808Y-114829167D02*
X119178474Y-114786834D01*
X119178474Y-114786834D02*
X119093808Y-114744500D01*
X119093808Y-114744500D02*
X118924474Y-114702167D01*
X118924474Y-114702167D02*
X118712808Y-114702167D01*
X118712808Y-114702167D02*
X118543474Y-114744500D01*
X118543474Y-114744500D02*
X118458808Y-114786834D01*
X118458808Y-114786834D02*
X118416474Y-114829167D01*
X118416474Y-114829167D02*
X118374141Y-114913834D01*
X110415474Y-111908166D02*
X111008141Y-111908166D01*
X110076808Y-111696500D02*
X110711808Y-111484833D01*
X110711808Y-111484833D02*
X110711808Y-112035166D01*
X110119141Y-112289167D02*
X110119141Y-112881833D01*
X110119141Y-112881833D02*
X111008141Y-112500833D01*
X111008141Y-113220500D02*
X110119141Y-113220500D01*
X110669474Y-113305167D02*
X111008141Y-113559167D01*
X110415474Y-113559167D02*
X110754141Y-113220500D01*
D10*
X117057892Y-119345152D02*
X117057892Y-120011819D01*
X117295987Y-118964200D02*
X117534082Y-119678485D01*
X117534082Y-119678485D02*
X116915035Y-119678485D01*
X116105511Y-119345152D02*
X116105511Y-120011819D01*
X116534082Y-119345152D02*
X116534082Y-119868961D01*
X116534082Y-119868961D02*
X116486463Y-119964200D01*
X116486463Y-119964200D02*
X116391225Y-120011819D01*
X116391225Y-120011819D02*
X116248368Y-120011819D01*
X116248368Y-120011819D02*
X116153130Y-119964200D01*
X116153130Y-119964200D02*
X116105511Y-119916580D01*
X115724558Y-119011819D02*
X115057892Y-119011819D01*
X115057892Y-119011819D02*
X115486463Y-120011819D01*
D13*
X88110200Y-119474946D02*
X88194867Y-119432612D01*
X88194867Y-119432612D02*
X88279534Y-119347946D01*
X88279534Y-119347946D02*
X88406534Y-119220946D01*
X88406534Y-119220946D02*
X88491200Y-119178612D01*
X88491200Y-119178612D02*
X88575867Y-119178612D01*
X88533534Y-119390279D02*
X88618200Y-119347946D01*
X88618200Y-119347946D02*
X88702867Y-119263279D01*
X88702867Y-119263279D02*
X88745200Y-119093946D01*
X88745200Y-119093946D02*
X88745200Y-118797612D01*
X88745200Y-118797612D02*
X88702867Y-118628279D01*
X88702867Y-118628279D02*
X88618200Y-118543612D01*
X88618200Y-118543612D02*
X88533534Y-118501279D01*
X88533534Y-118501279D02*
X88364200Y-118501279D01*
X88364200Y-118501279D02*
X88279534Y-118543612D01*
X88279534Y-118543612D02*
X88194867Y-118628279D01*
X88194867Y-118628279D02*
X88152534Y-118797612D01*
X88152534Y-118797612D02*
X88152534Y-119093946D01*
X88152534Y-119093946D02*
X88194867Y-119263279D01*
X88194867Y-119263279D02*
X88279534Y-119347946D01*
X88279534Y-119347946D02*
X88364200Y-119390279D01*
X88364200Y-119390279D02*
X88533534Y-119390279D01*
X87644534Y-118882279D02*
X87729201Y-118839946D01*
X87729201Y-118839946D02*
X87771534Y-118797612D01*
X87771534Y-118797612D02*
X87813867Y-118712946D01*
X87813867Y-118712946D02*
X87813867Y-118670612D01*
X87813867Y-118670612D02*
X87771534Y-118585946D01*
X87771534Y-118585946D02*
X87729201Y-118543612D01*
X87729201Y-118543612D02*
X87644534Y-118501279D01*
X87644534Y-118501279D02*
X87475201Y-118501279D01*
X87475201Y-118501279D02*
X87390534Y-118543612D01*
X87390534Y-118543612D02*
X87348201Y-118585946D01*
X87348201Y-118585946D02*
X87305867Y-118670612D01*
X87305867Y-118670612D02*
X87305867Y-118712946D01*
X87305867Y-118712946D02*
X87348201Y-118797612D01*
X87348201Y-118797612D02*
X87390534Y-118839946D01*
X87390534Y-118839946D02*
X87475201Y-118882279D01*
X87475201Y-118882279D02*
X87644534Y-118882279D01*
X87644534Y-118882279D02*
X87729201Y-118924612D01*
X87729201Y-118924612D02*
X87771534Y-118966946D01*
X87771534Y-118966946D02*
X87813867Y-119051612D01*
X87813867Y-119051612D02*
X87813867Y-119220946D01*
X87813867Y-119220946D02*
X87771534Y-119305612D01*
X87771534Y-119305612D02*
X87729201Y-119347946D01*
X87729201Y-119347946D02*
X87644534Y-119390279D01*
X87644534Y-119390279D02*
X87475201Y-119390279D01*
X87475201Y-119390279D02*
X87390534Y-119347946D01*
X87390534Y-119347946D02*
X87348201Y-119305612D01*
X87348201Y-119305612D02*
X87305867Y-119220946D01*
X87305867Y-119220946D02*
X87305867Y-119051612D01*
X87305867Y-119051612D02*
X87348201Y-118966946D01*
X87348201Y-118966946D02*
X87390534Y-118924612D01*
X87390534Y-118924612D02*
X87475201Y-118882279D01*
D10*
G36*
X118475977Y-84556600D02*
G01*
X118475977Y-81459678D01*
X116256765Y-81459678D01*
X116256765Y-81840838D01*
X118070251Y-81840838D01*
X118070251Y-82746092D01*
X116372155Y-82746092D01*
X116372155Y-83127251D01*
X118070251Y-83127251D01*
X118070251Y-84175440D01*
X116185298Y-84175440D01*
X116185298Y-84556600D01*
X118475977Y-84556600D01*
G37*
G36*
X115688748Y-84556600D02*
G01*
X115688748Y-82317287D01*
X115350023Y-82317287D01*
X115350023Y-82633679D01*
X115250507Y-82509964D01*
X115135655Y-82411844D01*
X115005466Y-82339321D01*
X114859940Y-82292395D01*
X114699078Y-82271064D01*
X114642048Y-82269642D01*
X114484140Y-82281683D01*
X114337044Y-82317805D01*
X114272800Y-82342599D01*
X114141320Y-82414619D01*
X114031188Y-82518563D01*
X114020431Y-82533178D01*
X113945337Y-82670760D01*
X113902807Y-82813092D01*
X113886543Y-82969373D01*
X113882146Y-83133577D01*
X113881963Y-83181596D01*
X113881963Y-84556600D01*
X114258656Y-84556600D01*
X114258656Y-83232963D01*
X114264832Y-83079804D01*
X114292284Y-82925423D01*
X114302578Y-82895727D01*
X114389723Y-82768720D01*
X114458913Y-82717803D01*
X114605429Y-82661860D01*
X114721705Y-82650802D01*
X114879279Y-82668483D01*
X115021370Y-82721528D01*
X115137109Y-82800437D01*
X115229366Y-82920203D01*
X115283182Y-83072872D01*
X115305905Y-83221009D01*
X115312055Y-83368454D01*
X115312055Y-84556600D01*
X115688748Y-84556600D01*
G37*
G36*
X112569796Y-82271945D02*
G01*
X112724277Y-82293969D01*
X112866745Y-82339313D01*
X113010954Y-82417044D01*
X113064054Y-82455825D01*
X113182658Y-82569674D01*
X113272120Y-82692775D01*
X113345213Y-82835426D01*
X113389884Y-82956041D01*
X113431197Y-83118132D01*
X113452693Y-83268837D01*
X113459858Y-83425777D01*
X113458878Y-83483419D01*
X113444178Y-83650136D01*
X113411838Y-83807535D01*
X113361858Y-83955617D01*
X113294238Y-84094382D01*
X113208978Y-84223829D01*
X113107369Y-84336919D01*
X112970500Y-84439285D01*
X112813895Y-84509804D01*
X112663955Y-84544901D01*
X112499515Y-84556600D01*
X112431487Y-84554087D01*
X112281050Y-84528683D01*
X112123343Y-84466149D01*
X111997791Y-84382119D01*
X111883853Y-84270730D01*
X111884408Y-84407772D01*
X111890515Y-84564863D01*
X111911398Y-84715168D01*
X111917993Y-84736548D01*
X111990446Y-84877615D01*
X112103466Y-84984660D01*
X112204040Y-85035303D01*
X112355629Y-85071315D01*
X112507704Y-85080694D01*
X112595102Y-85077710D01*
X112748226Y-85053841D01*
X112890352Y-84995826D01*
X112957563Y-84937899D01*
X113018398Y-84794824D01*
X113384669Y-84747179D01*
X113378841Y-84875126D01*
X113343387Y-85026017D01*
X113265681Y-85168852D01*
X113147933Y-85283185D01*
X113116721Y-85304820D01*
X112979951Y-85377405D01*
X112824105Y-85427655D01*
X112672091Y-85453304D01*
X112505471Y-85461853D01*
X112383561Y-85457404D01*
X112232577Y-85437630D01*
X112078514Y-85396474D01*
X111941176Y-85335296D01*
X111912997Y-85319119D01*
X111786586Y-85227502D01*
X111684311Y-85118001D01*
X111606172Y-84990615D01*
X111570247Y-84898367D01*
X111533908Y-84741986D01*
X111512952Y-84573854D01*
X111503041Y-84406492D01*
X111500460Y-84250630D01*
X111500460Y-83410888D01*
X111851842Y-83410888D01*
X111856149Y-83529277D01*
X111880960Y-83697302D01*
X111935235Y-83854852D01*
X112028277Y-83990816D01*
X112039339Y-84002175D01*
X112158917Y-84095929D01*
X112309261Y-84157410D01*
X112463037Y-84175440D01*
X112479329Y-84175259D01*
X112632814Y-84153536D01*
X112781831Y-84087824D01*
X112899286Y-83990071D01*
X112975173Y-83883382D01*
X113034630Y-83730766D01*
X113064443Y-83566137D01*
X113072743Y-83399721D01*
X113068454Y-83288104D01*
X113043747Y-83128116D01*
X112989702Y-82975494D01*
X112897053Y-82839893D01*
X112885953Y-82828259D01*
X112766957Y-82732237D01*
X112619267Y-82669268D01*
X112469737Y-82650802D01*
X112438109Y-82651552D01*
X112288695Y-82677812D01*
X112153822Y-82741584D01*
X112033488Y-82842871D01*
X111954018Y-82950118D01*
X111891754Y-83098468D01*
X111860534Y-83254955D01*
X111851842Y-83410888D01*
X111500460Y-83410888D01*
X111500460Y-82317287D01*
X111848119Y-82317287D01*
X111848119Y-82603157D01*
X111914120Y-82524989D01*
X112040032Y-82413275D01*
X112179197Y-82333479D01*
X112331613Y-82285602D01*
X112497282Y-82269642D01*
X112569796Y-82271945D01*
G37*
G36*
X110939888Y-81840838D02*
G01*
X110939888Y-81459678D01*
X110563195Y-81459678D01*
X110563195Y-81840838D01*
X110939888Y-81840838D01*
G37*
G36*
X110939888Y-84556600D02*
G01*
X110939888Y-82317287D01*
X110563195Y-82317287D01*
X110563195Y-84556600D01*
X110939888Y-84556600D01*
G37*
G36*
X109995178Y-84556600D02*
G01*
X109995178Y-82317287D01*
X109656452Y-82317287D01*
X109656452Y-82633679D01*
X109556937Y-82509964D01*
X109442085Y-82411844D01*
X109311896Y-82339321D01*
X109166370Y-82292395D01*
X109005507Y-82271064D01*
X108948478Y-82269642D01*
X108790570Y-82281683D01*
X108643474Y-82317805D01*
X108579230Y-82342599D01*
X108447750Y-82414619D01*
X108337617Y-82518563D01*
X108326860Y-82533178D01*
X108251767Y-82670760D01*
X108209237Y-82813092D01*
X108192972Y-82969373D01*
X108188576Y-83133577D01*
X108188392Y-83181596D01*
X108188392Y-84556600D01*
X108565085Y-84556600D01*
X108565085Y-83232963D01*
X108571262Y-83079804D01*
X108598713Y-82925423D01*
X108609008Y-82895727D01*
X108696152Y-82768720D01*
X108765343Y-82717803D01*
X108911858Y-82661860D01*
X109028134Y-82650802D01*
X109185708Y-82668483D01*
X109327800Y-82721528D01*
X109443539Y-82800437D01*
X109535796Y-82920203D01*
X109589612Y-83072872D01*
X109612335Y-83221009D01*
X109618485Y-83368454D01*
X109618485Y-84556600D01*
X109995178Y-84556600D01*
G37*
G36*
X106766096Y-82270858D02*
G01*
X106928826Y-82289091D01*
X107079464Y-82329204D01*
X107218011Y-82391197D01*
X107344466Y-82475070D01*
X107458829Y-82580823D01*
X107542042Y-82684229D01*
X107623280Y-82824581D01*
X107684209Y-82982679D01*
X107719469Y-83127981D01*
X107740625Y-83285607D01*
X107747677Y-83455555D01*
X107745164Y-83555598D01*
X107729810Y-83712856D01*
X107692959Y-83885924D01*
X107636009Y-84041927D01*
X107558958Y-84180866D01*
X107461807Y-84302741D01*
X107425285Y-84339251D01*
X107306263Y-84434649D01*
X107173056Y-84508847D01*
X107025663Y-84561846D01*
X106864085Y-84593645D01*
X106688321Y-84604244D01*
X106640383Y-84603561D01*
X106481162Y-84590406D01*
X106335265Y-84560508D01*
X106184839Y-84505837D01*
X106051815Y-84429298D01*
X105950222Y-84345955D01*
X105841693Y-84218804D01*
X105766085Y-84086897D01*
X105710111Y-83937215D01*
X106100204Y-83889570D01*
X106116793Y-83921402D01*
X106208395Y-84047977D01*
X106332473Y-84143429D01*
X106379776Y-84166376D01*
X106527887Y-84209939D01*
X106686088Y-84223085D01*
X106720533Y-84222413D01*
X106882030Y-84198902D01*
X107025642Y-84141803D01*
X107151370Y-84051116D01*
X107205496Y-83993687D01*
X107289538Y-83856690D01*
X107337577Y-83708157D01*
X107358328Y-83556056D01*
X105699689Y-83556056D01*
X105698200Y-83453321D01*
X105702620Y-83316563D01*
X105718534Y-83174896D01*
X106095737Y-83174896D01*
X107337484Y-83174896D01*
X107314472Y-83048131D01*
X107244766Y-82902928D01*
X107141693Y-82793737D01*
X107010205Y-82712359D01*
X106859365Y-82664760D01*
X106705444Y-82650802D01*
X106652506Y-82652372D01*
X106505000Y-82675927D01*
X106360995Y-82735251D01*
X106237928Y-82829470D01*
X106197317Y-82876772D01*
X106127597Y-83018491D01*
X106095737Y-83174896D01*
X105718534Y-83174896D01*
X105720577Y-83156706D01*
X105752347Y-83009171D01*
X105808704Y-82848396D01*
X105884953Y-82705365D01*
X105981092Y-82580079D01*
X106092655Y-82474579D01*
X106237366Y-82379083D01*
X106397752Y-82313297D01*
X106547701Y-82280556D01*
X106709166Y-82269642D01*
X106766096Y-82270858D01*
G37*
G36*
X104392782Y-82270858D02*
G01*
X104555512Y-82289091D01*
X104706150Y-82329204D01*
X104844697Y-82391197D01*
X104971152Y-82475070D01*
X105085516Y-82580823D01*
X105168728Y-82684229D01*
X105249967Y-82824581D01*
X105310896Y-82982679D01*
X105346155Y-83127981D01*
X105367311Y-83285607D01*
X105374363Y-83455555D01*
X105371851Y-83555598D01*
X105356496Y-83712856D01*
X105319646Y-83885924D01*
X105262695Y-84041927D01*
X105185644Y-84180866D01*
X105088493Y-84302741D01*
X105051972Y-84339251D01*
X104932949Y-84434649D01*
X104799742Y-84508847D01*
X104652349Y-84561846D01*
X104490771Y-84593645D01*
X104315008Y-84604244D01*
X104267069Y-84603561D01*
X104107848Y-84590406D01*
X103961951Y-84560508D01*
X103811525Y-84505837D01*
X103678501Y-84429298D01*
X103576909Y-84345955D01*
X103468379Y-84218804D01*
X103392771Y-84086897D01*
X103336797Y-83937215D01*
X103726890Y-83889570D01*
X103743479Y-83921402D01*
X103835082Y-84047977D01*
X103959159Y-84143429D01*
X104006462Y-84166376D01*
X104154573Y-84209939D01*
X104312774Y-84223085D01*
X104347220Y-84222413D01*
X104508716Y-84198902D01*
X104652329Y-84141803D01*
X104778057Y-84051116D01*
X104832182Y-83993687D01*
X104916224Y-83856690D01*
X104964263Y-83708157D01*
X104985015Y-83556056D01*
X103326375Y-83556056D01*
X103324886Y-83453321D01*
X103329306Y-83316563D01*
X103345220Y-83174896D01*
X103722424Y-83174896D01*
X104964170Y-83174896D01*
X104941158Y-83048131D01*
X104871453Y-82902928D01*
X104768379Y-82793737D01*
X104636892Y-82712359D01*
X104486051Y-82664760D01*
X104332130Y-82650802D01*
X104279192Y-82652372D01*
X104131686Y-82675927D01*
X103987681Y-82735251D01*
X103864614Y-82829470D01*
X103824004Y-82876772D01*
X103754284Y-83018491D01*
X103722424Y-83174896D01*
X103345220Y-83174896D01*
X103347263Y-83156706D01*
X103379033Y-83009171D01*
X103435391Y-82848396D01*
X103511639Y-82705365D01*
X103607778Y-82580079D01*
X103719341Y-82474579D01*
X103864053Y-82379083D01*
X104024439Y-82313297D01*
X104174388Y-82280556D01*
X104335852Y-82269642D01*
X104392782Y-82270858D01*
G37*
G36*
X102879704Y-84556600D02*
G01*
X102879704Y-82317287D01*
X102540234Y-82317287D01*
X102540234Y-82648569D01*
X102461165Y-82519278D01*
X102364027Y-82397284D01*
X102300520Y-82343343D01*
X102162071Y-82281806D01*
X102058573Y-82269642D01*
X101902744Y-82289055D01*
X101757157Y-82341434D01*
X101671458Y-82387266D01*
X101800993Y-82735669D01*
X101939275Y-82672019D01*
X102077184Y-82650802D01*
X102228802Y-82683183D01*
X102299775Y-82725992D01*
X102400509Y-82842661D01*
X102439732Y-82934438D01*
X102478293Y-83092309D01*
X102498006Y-83246588D01*
X102503011Y-83379621D01*
X102503011Y-84556600D01*
X102879704Y-84556600D01*
G37*
G36*
X101452589Y-81840838D02*
G01*
X101452589Y-81459678D01*
X101075896Y-81459678D01*
X101075896Y-81840838D01*
X101452589Y-81840838D01*
G37*
G36*
X101452589Y-84556600D02*
G01*
X101452589Y-82317287D01*
X101075896Y-82317287D01*
X101075896Y-84556600D01*
X101452589Y-84556600D01*
G37*
G36*
X100507879Y-84556600D02*
G01*
X100507879Y-82317287D01*
X100169153Y-82317287D01*
X100169153Y-82633679D01*
X100069638Y-82509964D01*
X99954786Y-82411844D01*
X99824597Y-82339321D01*
X99679071Y-82292395D01*
X99518208Y-82271064D01*
X99461179Y-82269642D01*
X99303271Y-82281683D01*
X99156175Y-82317805D01*
X99091931Y-82342599D01*
X98960451Y-82414619D01*
X98850318Y-82518563D01*
X98839562Y-82533178D01*
X98764468Y-82670760D01*
X98721938Y-82813092D01*
X98705674Y-82969373D01*
X98701277Y-83133577D01*
X98701094Y-83181596D01*
X98701094Y-84556600D01*
X99077786Y-84556600D01*
X99077786Y-83232963D01*
X99083963Y-83079804D01*
X99111415Y-82925423D01*
X99121709Y-82895727D01*
X99208854Y-82768720D01*
X99278044Y-82717803D01*
X99424559Y-82661860D01*
X99540836Y-82650802D01*
X99698409Y-82668483D01*
X99840501Y-82721528D01*
X99956240Y-82800437D01*
X100048497Y-82920203D01*
X100102313Y-83072872D01*
X100125036Y-83221009D01*
X100131186Y-83368454D01*
X100131186Y-84556600D01*
X100507879Y-84556600D01*
G37*
G36*
X97388927Y-82271945D02*
G01*
X97543408Y-82293969D01*
X97685876Y-82339313D01*
X97830084Y-82417044D01*
X97883185Y-82455825D01*
X98001788Y-82569674D01*
X98091251Y-82692775D01*
X98164344Y-82835426D01*
X98209015Y-82956041D01*
X98250328Y-83118132D01*
X98271824Y-83268837D01*
X98278989Y-83425777D01*
X98278009Y-83483419D01*
X98263309Y-83650136D01*
X98230969Y-83807535D01*
X98180989Y-83955617D01*
X98113369Y-84094382D01*
X98028109Y-84223829D01*
X97926500Y-84336919D01*
X97789630Y-84439285D01*
X97633026Y-84509804D01*
X97483085Y-84544901D01*
X97318646Y-84556600D01*
X97250618Y-84554087D01*
X97100181Y-84528683D01*
X96942474Y-84466149D01*
X96816922Y-84382119D01*
X96702984Y-84270730D01*
X96703539Y-84407772D01*
X96709645Y-84564863D01*
X96730529Y-84715168D01*
X96737124Y-84736548D01*
X96809577Y-84877615D01*
X96922597Y-84984660D01*
X97023171Y-85035303D01*
X97174760Y-85071315D01*
X97326835Y-85080694D01*
X97414232Y-85077710D01*
X97567357Y-85053841D01*
X97709483Y-84995826D01*
X97776693Y-84937899D01*
X97837529Y-84794824D01*
X98203799Y-84747179D01*
X98197972Y-84875126D01*
X98162517Y-85026017D01*
X98084812Y-85168852D01*
X97967064Y-85283185D01*
X97935852Y-85304820D01*
X97799082Y-85377405D01*
X97643236Y-85427655D01*
X97491221Y-85453304D01*
X97324601Y-85461853D01*
X97202692Y-85457404D01*
X97051707Y-85437630D01*
X96897645Y-85396474D01*
X96760307Y-85335296D01*
X96732128Y-85319119D01*
X96605717Y-85227502D01*
X96503442Y-85118001D01*
X96425303Y-84990615D01*
X96389378Y-84898367D01*
X96353039Y-84741986D01*
X96332082Y-84573854D01*
X96322172Y-84406492D01*
X96319591Y-84250630D01*
X96319591Y-83410888D01*
X96670972Y-83410888D01*
X96675280Y-83529277D01*
X96700091Y-83697302D01*
X96754366Y-83854852D01*
X96847408Y-83990816D01*
X96858470Y-84002175D01*
X96978047Y-84095929D01*
X97128392Y-84157410D01*
X97282168Y-84175440D01*
X97298460Y-84175259D01*
X97451945Y-84153536D01*
X97600962Y-84087824D01*
X97718417Y-83990071D01*
X97794304Y-83883382D01*
X97853761Y-83730766D01*
X97883574Y-83566137D01*
X97891874Y-83399721D01*
X97887585Y-83288104D01*
X97862878Y-83128116D01*
X97808833Y-82975494D01*
X97716183Y-82839893D01*
X97705083Y-82828259D01*
X97586087Y-82732237D01*
X97438398Y-82669268D01*
X97288868Y-82650802D01*
X97257240Y-82651552D01*
X97107826Y-82677812D01*
X96972952Y-82741584D01*
X96852619Y-82842871D01*
X96773148Y-82950118D01*
X96710885Y-83098468D01*
X96679664Y-83254955D01*
X96670972Y-83410888D01*
X96319591Y-83410888D01*
X96319591Y-82317287D01*
X96667250Y-82317287D01*
X96667250Y-82603157D01*
X96733250Y-82524989D01*
X96859163Y-82413275D01*
X96998328Y-82333479D01*
X97150744Y-82285602D01*
X97316412Y-82269642D01*
X97388927Y-82271945D01*
G37*
G36*
X114595149Y-89677240D02*
G01*
X115784783Y-86580318D01*
X115344812Y-86580318D01*
X114547504Y-88815908D01*
X114495598Y-88964429D01*
X114448756Y-89107649D01*
X114402650Y-89260567D01*
X114385958Y-89319902D01*
X114339109Y-89162564D01*
X114293217Y-89020835D01*
X114243790Y-88878989D01*
X114220689Y-88815908D01*
X113391369Y-86580318D01*
X112976710Y-86580318D01*
X114178255Y-89677240D01*
X114595149Y-89677240D01*
G37*
G36*
X112713173Y-86961478D02*
G01*
X112713173Y-86580318D01*
X112336481Y-86580318D01*
X112336481Y-86961478D01*
X112713173Y-86961478D01*
G37*
G36*
X112713173Y-89677240D02*
G01*
X112713173Y-87437927D01*
X112336481Y-87437927D01*
X112336481Y-89677240D01*
X112713173Y-89677240D01*
G37*
G36*
X111958299Y-89010210D02*
G01*
X111585328Y-88962565D01*
X111536453Y-89107582D01*
X111436334Y-89226273D01*
X111410382Y-89245457D01*
X111274845Y-89309082D01*
X111116363Y-89339023D01*
X111009122Y-89343725D01*
X110860217Y-89334928D01*
X110705551Y-89297190D01*
X110624241Y-89253646D01*
X110522509Y-89142415D01*
X110498428Y-89042222D01*
X110561241Y-88905150D01*
X110610096Y-88870998D01*
X110757280Y-88819189D01*
X110904513Y-88782431D01*
X110994978Y-88762308D01*
X111141524Y-88722875D01*
X111289870Y-88679517D01*
X111444796Y-88627957D01*
X111569695Y-88576195D01*
X111694926Y-88495605D01*
X111796212Y-88383643D01*
X111812386Y-88358070D01*
X111871699Y-88221179D01*
X111894698Y-88071529D01*
X111895020Y-88050611D01*
X111875901Y-87894183D01*
X111827275Y-87766975D01*
X111740848Y-87640369D01*
X111641907Y-87549595D01*
X111507091Y-87474626D01*
X111402193Y-87437183D01*
X111255073Y-87403519D01*
X111098465Y-87390466D01*
X111076867Y-87390282D01*
X110919413Y-87397625D01*
X110760824Y-87422664D01*
X110617540Y-87465472D01*
X110473847Y-87534805D01*
X110357573Y-87629257D01*
X110325715Y-87667963D01*
X110250001Y-87806446D01*
X110205288Y-87957427D01*
X110195436Y-88009667D01*
X110563940Y-88057312D01*
X110627591Y-87918297D01*
X110709853Y-87847376D01*
X110854649Y-87790425D01*
X111009022Y-87772109D01*
X111049323Y-87771442D01*
X111210351Y-87779975D01*
X111364406Y-87815516D01*
X111420060Y-87843654D01*
X111520151Y-87954205D01*
X111530983Y-88011900D01*
X111484827Y-88122823D01*
X111352483Y-88202779D01*
X111340404Y-88206946D01*
X111195794Y-88244173D01*
X111041300Y-88280359D01*
X111007633Y-88288092D01*
X110844311Y-88334081D01*
X110686010Y-88382017D01*
X110544072Y-88430049D01*
X110450039Y-88467505D01*
X110316430Y-88547013D01*
X110212919Y-88654330D01*
X110201392Y-88670740D01*
X110136736Y-88809900D01*
X110112105Y-88965461D01*
X110111313Y-89002021D01*
X110129497Y-89155601D01*
X110184048Y-89301809D01*
X110221492Y-89366803D01*
X110317387Y-89484333D01*
X110440919Y-89580088D01*
X110538629Y-89631828D01*
X110687422Y-89684808D01*
X110833986Y-89713889D01*
X110991309Y-89724794D01*
X111007633Y-89724884D01*
X111162887Y-89718551D01*
X111325756Y-89695151D01*
X111487814Y-89647297D01*
X111624188Y-89576923D01*
X111668707Y-89544727D01*
X111783413Y-89429609D01*
X111872091Y-89286931D01*
X111929065Y-89136971D01*
X111958299Y-89010210D01*
G37*
G36*
X109672831Y-86961478D02*
G01*
X109672831Y-86580318D01*
X109296138Y-86580318D01*
X109296138Y-86961478D01*
X109672831Y-86961478D01*
G37*
G36*
X109672831Y-89677240D02*
G01*
X109672831Y-87437927D01*
X109296138Y-87437927D01*
X109296138Y-89677240D01*
X109672831Y-89677240D01*
G37*
G36*
X107905501Y-89355636D02*
G01*
X107851156Y-89688406D01*
X108001908Y-89715765D01*
X108135537Y-89724884D01*
X108287245Y-89714441D01*
X108432134Y-89672915D01*
X108454162Y-89661606D01*
X108573169Y-89561561D01*
X108612731Y-89495593D01*
X108645860Y-89349389D01*
X108656678Y-89196486D01*
X108658887Y-89063066D01*
X108658887Y-87819087D01*
X108935823Y-87819087D01*
X108935823Y-87437927D01*
X108658887Y-87437927D01*
X108658887Y-86887033D01*
X108284427Y-86661464D01*
X108284427Y-87437927D01*
X107905501Y-87437927D01*
X107905501Y-87819087D01*
X108284427Y-87819087D01*
X108284427Y-89051900D01*
X108276091Y-89205395D01*
X108265072Y-89248435D01*
X108200304Y-89318414D01*
X108070770Y-89343725D01*
X107918186Y-89354194D01*
X107905501Y-89355636D01*
G37*
G36*
X106310140Y-89677240D02*
G01*
X105202395Y-89677240D01*
X105167842Y-89677033D01*
X105018543Y-89670994D01*
X104864535Y-89654476D01*
X104709568Y-89624383D01*
X104618505Y-89598908D01*
X104476652Y-89544295D01*
X104343297Y-89469537D01*
X104277995Y-89420957D01*
X104162768Y-89311458D01*
X104063383Y-89188134D01*
X104047561Y-89165434D01*
X103967087Y-89027485D01*
X103903546Y-88882841D01*
X103854192Y-88736996D01*
X103814607Y-88577372D01*
X103790296Y-88424806D01*
X103776221Y-88262190D01*
X103772303Y-88111657D01*
X103772413Y-88105701D01*
X104190685Y-88105701D01*
X104193537Y-88231877D01*
X104206216Y-88388793D01*
X104232604Y-88549863D01*
X104271830Y-88694563D01*
X104322120Y-88823303D01*
X104397340Y-88959541D01*
X104496655Y-89081678D01*
X104509770Y-89094249D01*
X104634372Y-89182048D01*
X104772102Y-89240246D01*
X104783024Y-89243681D01*
X104934055Y-89276396D01*
X105088064Y-89291663D01*
X105248551Y-89296080D01*
X105903669Y-89296080D01*
X105903669Y-86961478D01*
X105258974Y-86961478D01*
X105192749Y-86962027D01*
X105033297Y-86968867D01*
X104883723Y-86985905D01*
X104733390Y-87024012D01*
X104691558Y-87041975D01*
X104560814Y-87123399D01*
X104443447Y-87237975D01*
X104349253Y-87369438D01*
X104295365Y-87473577D01*
X104246586Y-87614853D01*
X104212983Y-87777432D01*
X104196259Y-87933741D01*
X104190685Y-88105701D01*
X103772413Y-88105701D01*
X103774187Y-88009620D01*
X103786553Y-87837998D01*
X103810462Y-87675210D01*
X103845912Y-87521256D01*
X103892904Y-87376138D01*
X103960556Y-87222176D01*
X104043655Y-87082637D01*
X104142202Y-86957523D01*
X104256196Y-86846832D01*
X104279763Y-86827122D01*
X104406669Y-86740259D01*
X104548696Y-86672881D01*
X104705846Y-86624985D01*
X104769062Y-86612118D01*
X104920250Y-86592925D01*
X105084539Y-86583110D01*
X105253018Y-86580318D01*
X106310140Y-86580318D01*
X106310140Y-89677240D01*
G37*
G36*
X102374791Y-87390582D02*
G01*
X102528186Y-87399343D01*
X102685917Y-87423305D01*
X102843971Y-87466961D01*
X102934194Y-87503607D01*
X103066154Y-87580850D01*
X103176741Y-87685085D01*
X103236466Y-87771715D01*
X103299977Y-87909206D01*
X103342009Y-88057312D01*
X102973505Y-88104956D01*
X102965619Y-88082044D01*
X102896082Y-87946574D01*
X102785903Y-87845143D01*
X102693210Y-87806277D01*
X102546088Y-87778639D01*
X102393577Y-87771442D01*
X102259808Y-87778328D01*
X102104594Y-87810284D01*
X101964028Y-87881621D01*
X101877948Y-88010964D01*
X101857571Y-88163024D01*
X101859060Y-88247891D01*
X101886986Y-88257302D01*
X102035899Y-88297633D01*
X102200202Y-88330714D01*
X102368623Y-88357523D01*
X102531301Y-88378915D01*
X102558869Y-88382367D01*
X102716512Y-88405229D01*
X102866304Y-88436238D01*
X103001276Y-88484852D01*
X103138029Y-88561306D01*
X103246533Y-88657340D01*
X103332331Y-88780175D01*
X103336911Y-88788718D01*
X103390419Y-88933118D01*
X103406776Y-89081678D01*
X103406009Y-89116461D01*
X103379139Y-89278597D01*
X103313883Y-89421104D01*
X103210241Y-89543983D01*
X103101039Y-89623127D01*
X102952938Y-89685135D01*
X102798848Y-89716228D01*
X102646691Y-89724884D01*
X102537210Y-89720185D01*
X102379793Y-89695513D01*
X102230542Y-89649695D01*
X102206286Y-89639874D01*
X102070696Y-89570788D01*
X101944227Y-89485845D01*
X101827793Y-89391370D01*
X101803115Y-89535753D01*
X101752604Y-89677240D01*
X101358788Y-89677240D01*
X101367539Y-89658018D01*
X101421486Y-89510516D01*
X101454823Y-89357125D01*
X101457708Y-89334905D01*
X101469340Y-89185331D01*
X101475295Y-89019504D01*
X101477808Y-88868203D01*
X101478438Y-88736996D01*
X101859060Y-88736996D01*
X101870745Y-88889423D01*
X101920105Y-89031799D01*
X101935833Y-89055754D01*
X102038220Y-89165513D01*
X102169497Y-89252902D01*
X102246036Y-89288291D01*
X102400277Y-89330953D01*
X102556612Y-89343725D01*
X102596867Y-89342999D01*
X102749984Y-89323066D01*
X102890871Y-89261091D01*
X102955719Y-89199442D01*
X103004772Y-89054877D01*
X103004721Y-89049866D01*
X102952661Y-88908220D01*
X102935089Y-88888297D01*
X102803770Y-88807719D01*
X102777458Y-88799263D01*
X102629871Y-88767531D01*
X102474722Y-88745930D01*
X102305059Y-88723798D01*
X102154989Y-88699742D01*
X102007471Y-88669894D01*
X101859060Y-88629051D01*
X101859060Y-88736996D01*
X101478438Y-88736996D01*
X101478645Y-88693818D01*
X101478645Y-88220347D01*
X101478718Y-88191301D01*
X101482208Y-88039991D01*
X101497257Y-87886832D01*
X101536259Y-87760441D01*
X101614880Y-87628507D01*
X101620184Y-87622120D01*
X101738596Y-87524002D01*
X101876183Y-87458027D01*
X101887408Y-87453860D01*
X102038438Y-87414165D01*
X102187329Y-87395641D01*
X102339232Y-87390282D01*
X102374791Y-87390582D01*
G37*
G36*
X100922540Y-90534848D02*
G01*
X100964229Y-90167833D01*
X100815497Y-90197375D01*
X100748338Y-90201334D01*
X100599945Y-90181277D01*
X100548080Y-90158900D01*
X100433683Y-90055825D01*
X100424501Y-90042021D01*
X100362677Y-89905868D01*
X100309111Y-89761363D01*
X100275611Y-89669051D01*
X101119075Y-87437927D01*
X100713348Y-87437927D01*
X100250299Y-88700518D01*
X100195817Y-88853204D01*
X100144971Y-89010687D01*
X100102317Y-89156525D01*
X100088753Y-89206001D01*
X100041235Y-89057272D01*
X99992845Y-88914430D01*
X99939512Y-88764319D01*
X99933907Y-88748908D01*
X99458946Y-87437927D01*
X99082254Y-87437927D01*
X99927951Y-89720418D01*
X99984633Y-89869435D01*
X100042258Y-90013044D01*
X100103559Y-90152513D01*
X100139376Y-90223667D01*
X100225947Y-90357939D01*
X100330171Y-90465989D01*
X100370156Y-90495392D01*
X100512346Y-90560718D01*
X100668638Y-90582408D01*
X100679848Y-90582493D01*
X100833404Y-90561974D01*
X100922540Y-90534848D01*
G37*
D13*
X119860200Y-119474946D02*
X119944867Y-119432612D01*
X119944867Y-119432612D02*
X120029534Y-119347946D01*
X120029534Y-119347946D02*
X120156534Y-119220946D01*
X120156534Y-119220946D02*
X120241200Y-119178612D01*
X120241200Y-119178612D02*
X120325867Y-119178612D01*
X120283534Y-119390279D02*
X120368200Y-119347946D01*
X120368200Y-119347946D02*
X120452867Y-119263279D01*
X120452867Y-119263279D02*
X120495200Y-119093946D01*
X120495200Y-119093946D02*
X120495200Y-118797612D01*
X120495200Y-118797612D02*
X120452867Y-118628279D01*
X120452867Y-118628279D02*
X120368200Y-118543612D01*
X120368200Y-118543612D02*
X120283534Y-118501279D01*
X120283534Y-118501279D02*
X120114200Y-118501279D01*
X120114200Y-118501279D02*
X120029534Y-118543612D01*
X120029534Y-118543612D02*
X119944867Y-118628279D01*
X119944867Y-118628279D02*
X119902534Y-118797612D01*
X119902534Y-118797612D02*
X119902534Y-119093946D01*
X119902534Y-119093946D02*
X119944867Y-119263279D01*
X119944867Y-119263279D02*
X120029534Y-119347946D01*
X120029534Y-119347946D02*
X120114200Y-119390279D01*
X120114200Y-119390279D02*
X120283534Y-119390279D01*
X119055867Y-119390279D02*
X119563867Y-119390279D01*
X119309867Y-119390279D02*
X119309867Y-118501279D01*
X119309867Y-118501279D02*
X119394534Y-118628279D01*
X119394534Y-118628279D02*
X119479201Y-118712946D01*
X119479201Y-118712946D02*
X119563867Y-118755279D01*
X107160200Y-119474946D02*
X107244867Y-119432612D01*
X107244867Y-119432612D02*
X107329534Y-119347946D01*
X107329534Y-119347946D02*
X107456534Y-119220946D01*
X107456534Y-119220946D02*
X107541200Y-119178612D01*
X107541200Y-119178612D02*
X107625867Y-119178612D01*
X107583534Y-119390279D02*
X107668200Y-119347946D01*
X107668200Y-119347946D02*
X107752867Y-119263279D01*
X107752867Y-119263279D02*
X107795200Y-119093946D01*
X107795200Y-119093946D02*
X107795200Y-118797612D01*
X107795200Y-118797612D02*
X107752867Y-118628279D01*
X107752867Y-118628279D02*
X107668200Y-118543612D01*
X107668200Y-118543612D02*
X107583534Y-118501279D01*
X107583534Y-118501279D02*
X107414200Y-118501279D01*
X107414200Y-118501279D02*
X107329534Y-118543612D01*
X107329534Y-118543612D02*
X107244867Y-118628279D01*
X107244867Y-118628279D02*
X107202534Y-118797612D01*
X107202534Y-118797612D02*
X107202534Y-119093946D01*
X107202534Y-119093946D02*
X107244867Y-119263279D01*
X107244867Y-119263279D02*
X107329534Y-119347946D01*
X107329534Y-119347946D02*
X107414200Y-119390279D01*
X107414200Y-119390279D02*
X107583534Y-119390279D01*
X106863867Y-118585946D02*
X106821534Y-118543612D01*
X106821534Y-118543612D02*
X106736867Y-118501279D01*
X106736867Y-118501279D02*
X106525201Y-118501279D01*
X106525201Y-118501279D02*
X106440534Y-118543612D01*
X106440534Y-118543612D02*
X106398201Y-118585946D01*
X106398201Y-118585946D02*
X106355867Y-118670612D01*
X106355867Y-118670612D02*
X106355867Y-118755279D01*
X106355867Y-118755279D02*
X106398201Y-118882279D01*
X106398201Y-118882279D02*
X106906201Y-119390279D01*
X106906201Y-119390279D02*
X106355867Y-119390279D01*
X98862867Y-114538132D02*
X98820534Y-114580466D01*
X98820534Y-114580466D02*
X98862867Y-114622799D01*
X98862867Y-114622799D02*
X98905200Y-114580466D01*
X98905200Y-114580466D02*
X98862867Y-114538132D01*
X98862867Y-114538132D02*
X98862867Y-114622799D01*
X98439534Y-114538132D02*
X98397201Y-114580466D01*
X98397201Y-114580466D02*
X98439534Y-114622799D01*
X98439534Y-114622799D02*
X98481867Y-114580466D01*
X98481867Y-114580466D02*
X98439534Y-114538132D01*
X98439534Y-114538132D02*
X98439534Y-114622799D01*
X98016201Y-114538132D02*
X97973868Y-114580466D01*
X97973868Y-114580466D02*
X98016201Y-114622799D01*
X98016201Y-114622799D02*
X98058534Y-114580466D01*
X98058534Y-114580466D02*
X98016201Y-114538132D01*
X98016201Y-114538132D02*
X98016201Y-114622799D01*
X98862867Y-115969372D02*
X98820534Y-116011706D01*
X98820534Y-116011706D02*
X98862867Y-116054039D01*
X98862867Y-116054039D02*
X98905200Y-116011706D01*
X98905200Y-116011706D02*
X98862867Y-115969372D01*
X98862867Y-115969372D02*
X98862867Y-116054039D01*
X98439534Y-115969372D02*
X98397201Y-116011706D01*
X98397201Y-116011706D02*
X98439534Y-116054039D01*
X98439534Y-116054039D02*
X98481867Y-116011706D01*
X98481867Y-116011706D02*
X98439534Y-115969372D01*
X98439534Y-115969372D02*
X98439534Y-116054039D01*
X98016201Y-115969372D02*
X97973868Y-116011706D01*
X97973868Y-116011706D02*
X98016201Y-116054039D01*
X98016201Y-116054039D02*
X98058534Y-116011706D01*
X98058534Y-116011706D02*
X98016201Y-115969372D01*
X98016201Y-115969372D02*
X98016201Y-116054039D01*
X98862867Y-117400612D02*
X98820534Y-117442946D01*
X98820534Y-117442946D02*
X98862867Y-117485279D01*
X98862867Y-117485279D02*
X98905200Y-117442946D01*
X98905200Y-117442946D02*
X98862867Y-117400612D01*
X98862867Y-117400612D02*
X98862867Y-117485279D01*
X98439534Y-117400612D02*
X98397201Y-117442946D01*
X98397201Y-117442946D02*
X98439534Y-117485279D01*
X98439534Y-117485279D02*
X98481867Y-117442946D01*
X98481867Y-117442946D02*
X98439534Y-117400612D01*
X98439534Y-117400612D02*
X98439534Y-117485279D01*
X98016201Y-117400612D02*
X97973868Y-117442946D01*
X97973868Y-117442946D02*
X98016201Y-117485279D01*
X98016201Y-117485279D02*
X98058534Y-117442946D01*
X98058534Y-117442946D02*
X98016201Y-117400612D01*
X98016201Y-117400612D02*
X98016201Y-117485279D01*
X91365474Y-111908166D02*
X91958141Y-111908166D01*
X91026808Y-111696500D02*
X91661808Y-111484833D01*
X91661808Y-111484833D02*
X91661808Y-112035166D01*
X91069141Y-112289167D02*
X91069141Y-112881833D01*
X91069141Y-112881833D02*
X91958141Y-112500833D01*
X91958141Y-113220500D02*
X91069141Y-113220500D01*
X91619474Y-113305167D02*
X91958141Y-113559167D01*
X91365474Y-113559167D02*
X91704141Y-113220500D01*
X87513141Y-113516833D02*
X87513141Y-113008833D01*
X87513141Y-113262833D02*
X86624141Y-113262833D01*
X86624141Y-113262833D02*
X86751141Y-113178166D01*
X86751141Y-113178166D02*
X86835808Y-113093500D01*
X86835808Y-113093500D02*
X86878141Y-113008833D01*
X86624141Y-114321167D02*
X86624141Y-113897833D01*
X86624141Y-113897833D02*
X87047474Y-113855500D01*
X87047474Y-113855500D02*
X87005141Y-113897833D01*
X87005141Y-113897833D02*
X86962808Y-113982500D01*
X86962808Y-113982500D02*
X86962808Y-114194167D01*
X86962808Y-114194167D02*
X87005141Y-114278833D01*
X87005141Y-114278833D02*
X87047474Y-114321167D01*
X87047474Y-114321167D02*
X87132141Y-114363500D01*
X87132141Y-114363500D02*
X87343808Y-114363500D01*
X87343808Y-114363500D02*
X87428474Y-114321167D01*
X87428474Y-114321167D02*
X87470808Y-114278833D01*
X87470808Y-114278833D02*
X87513141Y-114194167D01*
X87513141Y-114194167D02*
X87513141Y-113982500D01*
X87513141Y-113982500D02*
X87470808Y-113897833D01*
X87470808Y-113897833D02*
X87428474Y-113855500D01*
X86624141Y-114913834D02*
X86624141Y-114998500D01*
X86624141Y-114998500D02*
X86666474Y-115083167D01*
X86666474Y-115083167D02*
X86708808Y-115125500D01*
X86708808Y-115125500D02*
X86793474Y-115167834D01*
X86793474Y-115167834D02*
X86962808Y-115210167D01*
X86962808Y-115210167D02*
X87174474Y-115210167D01*
X87174474Y-115210167D02*
X87343808Y-115167834D01*
X87343808Y-115167834D02*
X87428474Y-115125500D01*
X87428474Y-115125500D02*
X87470808Y-115083167D01*
X87470808Y-115083167D02*
X87513141Y-114998500D01*
X87513141Y-114998500D02*
X87513141Y-114913834D01*
X87513141Y-114913834D02*
X87470808Y-114829167D01*
X87470808Y-114829167D02*
X87428474Y-114786834D01*
X87428474Y-114786834D02*
X87343808Y-114744500D01*
X87343808Y-114744500D02*
X87174474Y-114702167D01*
X87174474Y-114702167D02*
X86962808Y-114702167D01*
X86962808Y-114702167D02*
X86793474Y-114744500D01*
X86793474Y-114744500D02*
X86708808Y-114786834D01*
X86708808Y-114786834D02*
X86666474Y-114829167D01*
X86666474Y-114829167D02*
X86624141Y-114913834D01*
D10*
X104357892Y-119345152D02*
X104357892Y-120011819D01*
X104595987Y-118964200D02*
X104834082Y-119678485D01*
X104834082Y-119678485D02*
X104215035Y-119678485D01*
X103405511Y-119345152D02*
X103405511Y-120011819D01*
X103834082Y-119345152D02*
X103834082Y-119868961D01*
X103834082Y-119868961D02*
X103786463Y-119964200D01*
X103786463Y-119964200D02*
X103691225Y-120011819D01*
X103691225Y-120011819D02*
X103548368Y-120011819D01*
X103548368Y-120011819D02*
X103453130Y-119964200D01*
X103453130Y-119964200D02*
X103405511Y-119916580D01*
X103024558Y-119011819D02*
X102357892Y-119011819D01*
X102357892Y-119011819D02*
X102786463Y-120011819D01*
D13*
X106563141Y-113516833D02*
X106563141Y-113008833D01*
X106563141Y-113262833D02*
X105674141Y-113262833D01*
X105674141Y-113262833D02*
X105801141Y-113178166D01*
X105801141Y-113178166D02*
X105885808Y-113093500D01*
X105885808Y-113093500D02*
X105928141Y-113008833D01*
X105674141Y-114321167D02*
X105674141Y-113897833D01*
X105674141Y-113897833D02*
X106097474Y-113855500D01*
X106097474Y-113855500D02*
X106055141Y-113897833D01*
X106055141Y-113897833D02*
X106012808Y-113982500D01*
X106012808Y-113982500D02*
X106012808Y-114194167D01*
X106012808Y-114194167D02*
X106055141Y-114278833D01*
X106055141Y-114278833D02*
X106097474Y-114321167D01*
X106097474Y-114321167D02*
X106182141Y-114363500D01*
X106182141Y-114363500D02*
X106393808Y-114363500D01*
X106393808Y-114363500D02*
X106478474Y-114321167D01*
X106478474Y-114321167D02*
X106520808Y-114278833D01*
X106520808Y-114278833D02*
X106563141Y-114194167D01*
X106563141Y-114194167D02*
X106563141Y-113982500D01*
X106563141Y-113982500D02*
X106520808Y-113897833D01*
X106520808Y-113897833D02*
X106478474Y-113855500D01*
X105674141Y-114913834D02*
X105674141Y-114998500D01*
X105674141Y-114998500D02*
X105716474Y-115083167D01*
X105716474Y-115083167D02*
X105758808Y-115125500D01*
X105758808Y-115125500D02*
X105843474Y-115167834D01*
X105843474Y-115167834D02*
X106012808Y-115210167D01*
X106012808Y-115210167D02*
X106224474Y-115210167D01*
X106224474Y-115210167D02*
X106393808Y-115167834D01*
X106393808Y-115167834D02*
X106478474Y-115125500D01*
X106478474Y-115125500D02*
X106520808Y-115083167D01*
X106520808Y-115083167D02*
X106563141Y-114998500D01*
X106563141Y-114998500D02*
X106563141Y-114913834D01*
X106563141Y-114913834D02*
X106520808Y-114829167D01*
X106520808Y-114829167D02*
X106478474Y-114786834D01*
X106478474Y-114786834D02*
X106393808Y-114744500D01*
X106393808Y-114744500D02*
X106224474Y-114702167D01*
X106224474Y-114702167D02*
X106012808Y-114702167D01*
X106012808Y-114702167D02*
X105843474Y-114744500D01*
X105843474Y-114744500D02*
X105758808Y-114786834D01*
X105758808Y-114786834D02*
X105716474Y-114829167D01*
X105716474Y-114829167D02*
X105674141Y-114913834D01*
%LPC*%
D11*
X101612139Y-101738997D02*
X102270775Y-99929953D01*
X100241244Y-101171377D02*
X101054751Y-99426539D01*
X122284918Y-88374716D02*
X124181101Y-88709151D01*
X121100997Y-92130388D02*
X122845484Y-92943892D01*
X104475989Y-102506643D02*
X104810422Y-100610460D01*
X107429797Y-70671271D02*
X107429797Y-68745810D01*
X108744599Y-100782263D02*
X108912169Y-102700316D01*
X120493159Y-78213303D02*
X122160388Y-77250574D01*
X121604407Y-80596319D02*
X123413451Y-79937683D01*
X90999880Y-81353028D02*
X92859373Y-81851504D01*
X112588820Y-99929953D02*
X113247454Y-101738997D01*
X118096034Y-75089102D02*
X119457404Y-73727732D01*
X108744599Y-70728419D02*
X108912169Y-68810721D01*
X111333989Y-71184912D02*
X111832110Y-69325422D01*
X107429797Y-102764876D02*
X107429797Y-100839766D01*
X122000228Y-89659533D02*
X123859721Y-90157656D01*
X98925030Y-71024754D02*
X99887761Y-72691981D01*
X92014117Y-78566788D02*
X93758956Y-79380646D01*
X91446142Y-91573000D02*
X93255186Y-90914362D01*
X110049172Y-100610460D02*
X110383605Y-102506643D01*
X95402192Y-97782946D02*
X96763561Y-96421576D01*
X119786193Y-94407568D02*
X121363108Y-95511763D01*
X93496487Y-95511759D02*
X95073405Y-94407564D01*
X119786196Y-77103462D02*
X121363112Y-75999270D01*
X105947425Y-102700316D02*
X106114995Y-100782263D01*
X122456721Y-84440893D02*
X124374423Y-84272970D01*
X118985034Y-76059593D02*
X120459998Y-74822048D01*
X113804843Y-72084500D02*
X114618350Y-70339663D01*
X122456721Y-87070147D02*
X124374423Y-87238070D01*
X97673731Y-71822035D02*
X98777926Y-73398951D01*
X96496155Y-98785540D02*
X97733699Y-97310576D01*
X118985034Y-95451437D02*
X120459998Y-96688982D01*
X90999879Y-90157656D02*
X92859370Y-89659535D01*
X92699212Y-94260107D02*
X94366439Y-93297728D01*
X98925030Y-100485930D02*
X99887761Y-98818705D01*
X90485175Y-84272970D02*
X92402876Y-84440893D01*
X96496158Y-72725496D02*
X97733702Y-74200108D01*
X97673728Y-99688654D02*
X98777922Y-98111738D01*
X105947425Y-68810721D02*
X106114995Y-70728422D01*
X103027484Y-69325426D02*
X103525605Y-71184918D01*
X95402194Y-73727738D02*
X96763563Y-75089108D01*
X90420266Y-85755343D02*
X92345374Y-85755343D01*
X117125895Y-97310583D02*
X118363440Y-98785544D01*
X90485175Y-87238070D02*
X92402876Y-87070147D01*
X103027484Y-102185259D02*
X103525605Y-100325770D01*
X110049172Y-70900221D02*
X110383605Y-69004393D01*
X92699209Y-77250574D02*
X94366436Y-78213305D01*
X113804843Y-99426539D02*
X114618350Y-101171377D01*
X94399951Y-74822050D02*
X95874562Y-76059595D01*
X121604411Y-90914362D02*
X123413455Y-91573000D01*
X90678849Y-88709152D02*
X92574677Y-88374720D01*
X90678851Y-82801888D02*
X92574680Y-83135967D01*
X117125895Y-74200104D02*
X118363436Y-72725493D01*
X122000224Y-81851504D02*
X123859713Y-81353029D01*
X104475989Y-69004397D02*
X104810422Y-70900223D01*
X122514224Y-85755343D02*
X124439334Y-85755343D01*
X114971835Y-72691982D02*
X115934565Y-71024756D01*
X94399951Y-96688978D02*
X95874562Y-95451433D01*
X122284915Y-83135967D02*
X124181098Y-82801888D01*
X121100993Y-79380646D02*
X122845481Y-78566788D01*
X116081671Y-73398947D02*
X117186221Y-71822029D01*
X101612139Y-69771685D02*
X102270774Y-71580731D01*
X100241244Y-70339659D02*
X101054749Y-72084498D01*
X118096034Y-96421580D02*
X119457404Y-97782950D01*
X120493159Y-93297732D02*
X122160384Y-94260107D01*
X114971835Y-98818705D02*
X115934565Y-100485930D01*
X93496485Y-75999272D02*
X95073402Y-77103466D01*
X92014114Y-92943892D02*
X93758953Y-92130388D01*
X111333989Y-100325770D02*
X111832110Y-102185263D01*
X91446145Y-79937683D02*
X93255189Y-80596319D01*
X112588820Y-71580731D02*
X113247456Y-69771685D01*
X116081671Y-98111738D02*
X117186221Y-99688654D01*
%LPD*%
M02*
