%TF.GenerationSoftware,KiCad,Pcbnew,8.0.5-8.0.5-0~ubuntu22.04.1*%
%TF.CreationDate,2024-09-21T22:00:18-05:00*%
%TF.ProjectId,Valpo Shield,56616c70-6f20-4536-9869-656c642e6b69,rev?*%
%TF.SameCoordinates,Original*%
%TF.FileFunction,Copper,L1,Top*%
%TF.FilePolarity,Positive*%
%FSLAX46Y46*%
G04 Gerber Fmt 4.6, Leading zero omitted, Abs format (unit mm)*
G04 Created by KiCad (PCBNEW 8.0.5-8.0.5-0~ubuntu22.04.1) date 2024-09-21 22:00:18*
%MOMM*%
%LPD*%
G01*
G04 APERTURE LIST*
G04 Aperture macros list*
%AMRoundRect*
0 Rectangle with rounded corners*
0 $1 Rounding radius*
0 $2 $3 $4 $5 $6 $7 $8 $9 X,Y pos of 4 corners*
0 Add a 4 corners polygon primitive as box body*
4,1,4,$2,$3,$4,$5,$6,$7,$8,$9,$2,$3,0*
0 Add four circle primitives for the rounded corners*
1,1,$1+$1,$2,$3*
1,1,$1+$1,$4,$5*
1,1,$1+$1,$6,$7*
1,1,$1+$1,$8,$9*
0 Add four rect primitives between the rounded corners*
20,1,$1+$1,$2,$3,$4,$5,0*
20,1,$1+$1,$4,$5,$6,$7,0*
20,1,$1+$1,$6,$7,$8,$9,0*
20,1,$1+$1,$8,$9,$2,$3,0*%
G04 Aperture macros list end*
%TA.AperFunction,SMDPad,CuDef*%
%ADD10RoundRect,0.200000X-0.275000X0.200000X-0.275000X-0.200000X0.275000X-0.200000X0.275000X0.200000X0*%
%TD*%
%TA.AperFunction,SMDPad,CuDef*%
%ADD11RoundRect,0.150000X-0.587500X-0.150000X0.587500X-0.150000X0.587500X0.150000X-0.587500X0.150000X0*%
%TD*%
%TA.AperFunction,SMDPad,CuDef*%
%ADD12RoundRect,0.250000X-0.375000X-0.625000X0.375000X-0.625000X0.375000X0.625000X-0.375000X0.625000X0*%
%TD*%
%TA.AperFunction,SMDPad,CuDef*%
%ADD13R,1.700000X1.000000*%
%TD*%
%TA.AperFunction,SMDPad,CuDef*%
%ADD14RoundRect,0.250000X-0.625000X0.375000X-0.625000X-0.375000X0.625000X-0.375000X0.625000X0.375000X0*%
%TD*%
%TA.AperFunction,SMDPad,CuDef*%
%ADD15RoundRect,0.225000X-0.250000X0.225000X-0.250000X-0.225000X0.250000X-0.225000X0.250000X0.225000X0*%
%TD*%
%TA.AperFunction,SMDPad,CuDef*%
%ADD16RoundRect,0.250000X-0.707107X-0.176777X-0.176777X-0.707107X0.707107X0.176777X0.176777X0.707107X0*%
%TD*%
%TA.AperFunction,SMDPad,CuDef*%
%ADD17RoundRect,0.250000X0.176777X-0.707107X0.707107X-0.176777X-0.176777X0.707107X-0.707107X0.176777X0*%
%TD*%
%TA.AperFunction,SMDPad,CuDef*%
%ADD18RoundRect,0.250000X-0.176777X0.707107X-0.707107X0.176777X0.176777X-0.707107X0.707107X-0.176777X0*%
%TD*%
%TA.AperFunction,SMDPad,CuDef*%
%ADD19R,3.500000X4.500000*%
%TD*%
%TA.AperFunction,SMDPad,CuDef*%
%ADD20RoundRect,0.250000X0.375000X0.625000X-0.375000X0.625000X-0.375000X-0.625000X0.375000X-0.625000X0*%
%TD*%
%TA.AperFunction,SMDPad,CuDef*%
%ADD21RoundRect,0.250000X0.707107X0.176777X0.176777X0.707107X-0.707107X-0.176777X-0.176777X-0.707107X0*%
%TD*%
%TA.AperFunction,SMDPad,CuDef*%
%ADD22RoundRect,0.250000X0.625000X-0.375000X0.625000X0.375000X-0.625000X0.375000X-0.625000X-0.375000X0*%
%TD*%
%TA.AperFunction,ViaPad*%
%ADD23C,0.800000*%
%TD*%
%TA.AperFunction,Conductor*%
%ADD24C,1.000000*%
%TD*%
%TA.AperFunction,Conductor*%
%ADD25C,0.250000*%
%TD*%
G04 APERTURE END LIST*
D10*
%TO.P,R1,1*%
%TO.N,VDD*%
X114414797Y-119952000D03*
%TO.P,R1,2*%
%TO.N,Net-(Q1-B)*%
X114414797Y-121602000D03*
%TD*%
D11*
%TO.P,Q4,1,B*%
%TO.N,Net-(Q4-B)*%
X132527297Y-123637000D03*
%TO.P,Q4,2,E*%
%TO.N,GND*%
X132527297Y-125537000D03*
%TO.P,Q4,3,C*%
%TO.N,Net-(Q4-C)*%
X134402297Y-124587000D03*
%TD*%
D12*
%TO.P,D1,1,K*%
%TO.N,Net-(D1-K)*%
X132699797Y-85852000D03*
%TO.P,D1,2,A*%
%TO.N,VDD*%
X135499797Y-85852000D03*
%TD*%
D10*
%TO.P,R6,1*%
%TO.N,Net-(D3-K)*%
X127749797Y-119952000D03*
%TO.P,R6,2*%
%TO.N,Net-(Q3-C)*%
X127749797Y-121602000D03*
%TD*%
%TO.P,R9,1*%
%TO.N,VDD*%
X114414797Y-128982000D03*
%TO.P,R9,2*%
%TO.N,Net-(Q5-B)*%
X114414797Y-130632000D03*
%TD*%
%TO.P,R4,1*%
%TO.N,Net-(D2-K)*%
X122034797Y-119952000D03*
%TO.P,R4,2*%
%TO.N,Net-(Q2-C)*%
X122034797Y-121602000D03*
%TD*%
%TO.P,R2,1*%
%TO.N,Net-(D1-K)*%
X116319797Y-119952000D03*
%TO.P,R2,2*%
%TO.N,Net-(Q1-C)*%
X116319797Y-121602000D03*
%TD*%
D11*
%TO.P,Q1,1,B*%
%TO.N,Net-(Q1-B)*%
X115382297Y-123637000D03*
%TO.P,Q1,2,E*%
%TO.N,GND*%
X115382297Y-125537000D03*
%TO.P,Q1,3,C*%
%TO.N,Net-(Q1-C)*%
X117257297Y-124587000D03*
%TD*%
D13*
%TO.P,SW1,1,A*%
%TO.N,Net-(SW1-A)*%
X85329797Y-116277000D03*
%TO.P,SW1,2,B*%
X78729797Y-116277000D03*
%TO.P,SW1,3,C*%
%TO.N,VDD*%
X85329797Y-112577000D03*
%TO.P,SW1,4,D*%
X78729797Y-112577000D03*
%TD*%
D14*
%TO.P,D7,1,K*%
%TO.N,Net-(D7-K)*%
X107429797Y-111122000D03*
%TO.P,D7,2,A*%
%TO.N,VDD*%
X107429797Y-113922000D03*
%TD*%
D10*
%TO.P,R13,1*%
%TO.N,VDD*%
X125844797Y-128982000D03*
%TO.P,R13,2*%
%TO.N,Net-(Q7-B)*%
X125844797Y-130632000D03*
%TD*%
D11*
%TO.P,Q8,1,B*%
%TO.N,Net-(Q8-B)*%
X132527297Y-132667000D03*
%TO.P,Q8,2,E*%
%TO.N,GND*%
X132527297Y-134567000D03*
%TO.P,Q8,3,C*%
%TO.N,Net-(Q8-C)*%
X134402297Y-133617000D03*
%TD*%
%TO.P,Q6,1,B*%
%TO.N,Net-(Q6-B)*%
X121097297Y-132667000D03*
%TO.P,Q6,2,E*%
%TO.N,GND*%
X121097297Y-134567000D03*
%TO.P,Q6,3,C*%
%TO.N,Net-(Q6-C)*%
X122972297Y-133617000D03*
%TD*%
D15*
%TO.P,C5,1*%
%TO.N,Net-(Q5-C)*%
X118224797Y-129032000D03*
%TO.P,C5,2*%
%TO.N,Net-(Q6-B)*%
X118224797Y-130582000D03*
%TD*%
D11*
%TO.P,Q7,1,B*%
%TO.N,Net-(Q7-B)*%
X126812297Y-132667000D03*
%TO.P,Q7,2,E*%
%TO.N,GND*%
X126812297Y-134567000D03*
%TO.P,Q7,3,C*%
%TO.N,Net-(Q7-C)*%
X128687297Y-133617000D03*
%TD*%
D10*
%TO.P,R12,1*%
%TO.N,Net-(D6-K)*%
X122034797Y-128982000D03*
%TO.P,R12,2*%
%TO.N,Net-(Q6-C)*%
X122034797Y-130632000D03*
%TD*%
D16*
%TO.P,D8,1,K*%
%TO.N,Net-(D8-K)*%
X125298386Y-103720589D03*
%TO.P,D8,2,A*%
%TO.N,VDD*%
X127278284Y-105700487D03*
%TD*%
D17*
%TO.P,D2,1,K*%
%TO.N,Net-(D2-K)*%
X125298386Y-67983411D03*
%TO.P,D2,2,A*%
%TO.N,VDD*%
X127278284Y-66003513D03*
%TD*%
D10*
%TO.P,R16,1*%
%TO.N,Net-(D8-K)*%
X133464797Y-128982000D03*
%TO.P,R16,2*%
%TO.N,Net-(Q8-C)*%
X133464797Y-130632000D03*
%TD*%
D15*
%TO.P,C8,1*%
%TO.N,Net-(Q8-C)*%
X135369797Y-129032000D03*
%TO.P,C8,2*%
%TO.N,Net-(Q1-B)*%
X135369797Y-130582000D03*
%TD*%
D10*
%TO.P,R15,1*%
%TO.N,VDD*%
X131559797Y-128982000D03*
%TO.P,R15,2*%
%TO.N,Net-(Q8-B)*%
X131559797Y-130632000D03*
%TD*%
D11*
%TO.P,Q5,1,B*%
%TO.N,Net-(Q5-B)*%
X115382297Y-132667000D03*
%TO.P,Q5,2,E*%
%TO.N,GND*%
X115382297Y-134567000D03*
%TO.P,Q5,3,C*%
%TO.N,Net-(Q5-C)*%
X117257297Y-133617000D03*
%TD*%
D10*
%TO.P,R3,1*%
%TO.N,VDD*%
X120129797Y-119952000D03*
%TO.P,R3,2*%
%TO.N,Net-(Q2-B)*%
X120129797Y-121602000D03*
%TD*%
D15*
%TO.P,C2,1*%
%TO.N,Net-(Q2-C)*%
X123939797Y-120002000D03*
%TO.P,C2,2*%
%TO.N,Net-(Q3-B)*%
X123939797Y-121552000D03*
%TD*%
D18*
%TO.P,D6,1,K*%
%TO.N,Net-(D6-K)*%
X89561208Y-103720589D03*
%TO.P,D6,2,A*%
%TO.N,VDD*%
X87581310Y-105700487D03*
%TD*%
D10*
%TO.P,R5,1*%
%TO.N,VDD*%
X125844797Y-119952000D03*
%TO.P,R5,2*%
%TO.N,Net-(Q3-B)*%
X125844797Y-121602000D03*
%TD*%
D11*
%TO.P,Q2,1,B*%
%TO.N,Net-(Q2-B)*%
X121097297Y-123637000D03*
%TO.P,Q2,2,E*%
%TO.N,GND*%
X121097297Y-125537000D03*
%TO.P,Q2,3,C*%
%TO.N,Net-(Q2-C)*%
X122972297Y-124587000D03*
%TD*%
D19*
%TO.P,BT1,1,1*%
%TO.N,Net-(SW1-A)*%
X79929797Y-129062000D03*
%TO.P,BT1,2,2*%
%TO.N,GND*%
X109529797Y-129002000D03*
%TD*%
D10*
%TO.P,R8,1*%
%TO.N,Net-(D4-K)*%
X133464797Y-119952000D03*
%TO.P,R8,2*%
%TO.N,Net-(Q4-C)*%
X133464797Y-121602000D03*
%TD*%
D20*
%TO.P,D5,1,K*%
%TO.N,Net-(D5-K)*%
X82159797Y-85852000D03*
%TO.P,D5,2,A*%
%TO.N,VDD*%
X79359797Y-85852000D03*
%TD*%
D15*
%TO.P,C6,1*%
%TO.N,Net-(Q6-C)*%
X123939797Y-129032000D03*
%TO.P,C6,2*%
%TO.N,Net-(Q7-B)*%
X123939797Y-130582000D03*
%TD*%
D10*
%TO.P,R14,1*%
%TO.N,Net-(D7-K)*%
X127749797Y-128982000D03*
%TO.P,R14,2*%
%TO.N,Net-(Q7-C)*%
X127749797Y-130632000D03*
%TD*%
D15*
%TO.P,C3,1*%
%TO.N,Net-(Q3-C)*%
X129654797Y-120002000D03*
%TO.P,C3,2*%
%TO.N,Net-(Q4-B)*%
X129654797Y-121552000D03*
%TD*%
D10*
%TO.P,R10,1*%
%TO.N,Net-(D5-K)*%
X116319797Y-128982000D03*
%TO.P,R10,2*%
%TO.N,Net-(Q5-C)*%
X116319797Y-130632000D03*
%TD*%
D15*
%TO.P,C7,1*%
%TO.N,Net-(Q7-C)*%
X129654797Y-129032000D03*
%TO.P,C7,2*%
%TO.N,Net-(Q8-B)*%
X129654797Y-130582000D03*
%TD*%
D10*
%TO.P,R7,1*%
%TO.N,VDD*%
X131559797Y-119952000D03*
%TO.P,R7,2*%
%TO.N,Net-(Q4-B)*%
X131559797Y-121602000D03*
%TD*%
D11*
%TO.P,Q3,1,B*%
%TO.N,Net-(Q3-B)*%
X126812297Y-123637000D03*
%TO.P,Q3,2,E*%
%TO.N,GND*%
X126812297Y-125537000D03*
%TO.P,Q3,3,C*%
%TO.N,Net-(Q3-C)*%
X128687297Y-124587000D03*
%TD*%
D21*
%TO.P,D4,1,K*%
%TO.N,Net-(D4-K)*%
X89561208Y-67983411D03*
%TO.P,D4,2,A*%
%TO.N,VDD*%
X87581310Y-66003513D03*
%TD*%
D22*
%TO.P,D3,1,K*%
%TO.N,Net-(D3-K)*%
X107429797Y-60582000D03*
%TO.P,D3,2,A*%
%TO.N,VDD*%
X107429797Y-57782000D03*
%TD*%
D10*
%TO.P,R11,1*%
%TO.N,VDD*%
X120129797Y-128982000D03*
%TO.P,R11,2*%
%TO.N,Net-(Q6-B)*%
X120129797Y-130632000D03*
%TD*%
D15*
%TO.P,C4,1*%
%TO.N,Net-(Q4-C)*%
X135369797Y-120002000D03*
%TO.P,C4,2*%
%TO.N,Net-(Q5-B)*%
X135369797Y-121552000D03*
%TD*%
%TO.P,C1,1*%
%TO.N,Net-(Q1-C)*%
X118224797Y-120002000D03*
%TO.P,C1,2*%
%TO.N,Net-(Q2-B)*%
X118224797Y-121552000D03*
%TD*%
D23*
%TO.N,GND*%
X111784797Y-128397000D03*
X117589797Y-125767000D03*
X130289797Y-134567000D03*
X124574797Y-134567000D03*
X118859797Y-134567000D03*
X111784797Y-130937000D03*
X111784797Y-129667000D03*
X134099797Y-125767000D03*
%TO.N,Net-(D1-K)*%
X131559797Y-85852000D03*
X131559797Y-110617000D03*
%TO.N,Net-(D2-K)*%
X124574797Y-68707000D03*
X122034797Y-113157000D03*
%TO.N,Net-(D3-K)*%
X127749797Y-118237000D03*
X107429797Y-61722000D03*
%TO.N,Net-(D4-K)*%
X133464797Y-118237000D03*
X90284797Y-68707000D03*
%TO.N,Net-(D5-K)*%
X83299797Y-85852000D03*
X116954797Y-128397000D03*
%TO.N,Net-(D6-K)*%
X90284797Y-102997000D03*
X122669797Y-128397000D03*
%TO.N,Net-(D7-K)*%
X107429797Y-112522000D03*
X128384797Y-128397000D03*
%TO.N,Net-(D8-K)*%
X124574797Y-102997000D03*
X134099797Y-128397000D03*
%TO.N,VDD*%
X105524797Y-123952000D03*
X114414797Y-127762000D03*
X106794797Y-123952000D03*
%TD*%
D24*
%TO.N,Net-(SW1-A)*%
X82029797Y-116332000D02*
X81974797Y-116277000D01*
X81974797Y-116277000D02*
X78729797Y-116277000D01*
X82029797Y-120777000D02*
X82029797Y-116332000D01*
X82029797Y-116332000D02*
X83299797Y-116332000D01*
X83299797Y-116332000D02*
X83354797Y-116277000D01*
X83354797Y-116277000D02*
X85329797Y-116277000D01*
D25*
%TO.N,GND*%
X111784797Y-130937000D02*
X111464797Y-130937000D01*
X117359797Y-125537000D02*
X117589797Y-125767000D01*
X110134797Y-128397000D02*
X111784797Y-128397000D01*
X121097297Y-134567000D02*
X118859797Y-134567000D01*
X115382297Y-134567000D02*
X118859797Y-134567000D01*
X124574797Y-134567000D02*
X130289797Y-134567000D01*
X111464797Y-130937000D02*
X109529797Y-129002000D01*
X110194797Y-129667000D02*
X109529797Y-129002000D01*
X132527297Y-125537000D02*
X133869797Y-125537000D01*
X115382297Y-125537000D02*
X117359797Y-125537000D01*
X109529797Y-129002000D02*
X110134797Y-128397000D01*
X126812297Y-134567000D02*
X124574797Y-134567000D01*
X118859797Y-134567000D02*
X124574797Y-134567000D01*
X115382297Y-125537000D02*
X132527297Y-125537000D01*
X132527297Y-134567000D02*
X130289797Y-134567000D01*
X133869797Y-125537000D02*
X134099797Y-125767000D01*
X111784797Y-129667000D02*
X110194797Y-129667000D01*
%TO.N,Net-(Q2-B)*%
X121097297Y-122569500D02*
X120129797Y-121602000D01*
X118224797Y-121552000D02*
X120079797Y-121552000D01*
X121097297Y-123637000D02*
X121097297Y-122569500D01*
X120079797Y-121552000D02*
X120129797Y-121602000D01*
%TO.N,Net-(Q1-C)*%
X116319797Y-121602000D02*
X116624797Y-121602000D01*
X116624797Y-121602000D02*
X118224797Y-120002000D01*
X117257297Y-122539500D02*
X116319797Y-121602000D01*
X117257297Y-124587000D02*
X117257297Y-122539500D01*
%TO.N,Net-(Q3-B)*%
X126812297Y-122569500D02*
X125844797Y-121602000D01*
X123939797Y-121552000D02*
X125794797Y-121552000D01*
X125794797Y-121552000D02*
X125844797Y-121602000D01*
X126812297Y-123637000D02*
X126812297Y-122569500D01*
%TO.N,Net-(Q2-C)*%
X123939797Y-120002000D02*
X123634797Y-120002000D01*
X122339797Y-121602000D02*
X123939797Y-120002000D01*
X122034797Y-121602000D02*
X122339797Y-121602000D01*
X122972297Y-122539500D02*
X122034797Y-121602000D01*
X122972297Y-124587000D02*
X122972297Y-122539500D01*
%TO.N,Net-(Q4-B)*%
X132527297Y-122569500D02*
X131559797Y-121602000D01*
X129654797Y-121552000D02*
X131509797Y-121552000D01*
X131509797Y-121552000D02*
X131559797Y-121602000D01*
X132527297Y-123637000D02*
X132527297Y-122569500D01*
%TO.N,Net-(Q3-C)*%
X129654797Y-120002000D02*
X129349797Y-120002000D01*
X128687297Y-124587000D02*
X128687297Y-122539500D01*
X128054797Y-121602000D02*
X129654797Y-120002000D01*
X127749797Y-121602000D02*
X128054797Y-121602000D01*
X128687297Y-122539500D02*
X127749797Y-121602000D01*
%TO.N,Net-(Q4-C)*%
X133464797Y-121602000D02*
X135064797Y-120002000D01*
X134402297Y-122539500D02*
X133464797Y-121602000D01*
X134402297Y-124587000D02*
X134402297Y-122539500D01*
X135064797Y-120002000D02*
X135369797Y-120002000D01*
%TO.N,Net-(Q5-C)*%
X116624797Y-130632000D02*
X118224797Y-129032000D01*
X118224797Y-129032000D02*
X117919797Y-129032000D01*
X117257297Y-131569500D02*
X116319797Y-130632000D01*
X117257297Y-133617000D02*
X117257297Y-131569500D01*
X116319797Y-130632000D02*
X116624797Y-130632000D01*
%TO.N,Net-(Q6-B)*%
X118224797Y-130582000D02*
X120079797Y-130582000D01*
X121097297Y-132667000D02*
X121097297Y-131599500D01*
X121097297Y-131599500D02*
X120129797Y-130632000D01*
X120079797Y-130582000D02*
X120129797Y-130632000D01*
%TO.N,Net-(Q6-C)*%
X122034797Y-130632000D02*
X122339797Y-130632000D01*
X122339797Y-130632000D02*
X123939797Y-129032000D01*
X123939797Y-129032000D02*
X123634797Y-129032000D01*
X122972297Y-133617000D02*
X122972297Y-131569500D01*
X122972297Y-131569500D02*
X122034797Y-130632000D01*
%TO.N,Net-(Q7-B)*%
X123939797Y-130582000D02*
X125794797Y-130582000D01*
X126812297Y-132667000D02*
X126812297Y-131599500D01*
X126812297Y-131599500D02*
X125844797Y-130632000D01*
X125794797Y-130582000D02*
X125844797Y-130632000D01*
%TO.N,Net-(Q8-B)*%
X131509797Y-130582000D02*
X131559797Y-130632000D01*
X129654797Y-130582000D02*
X131509797Y-130582000D01*
X132527297Y-132667000D02*
X132527297Y-131599500D01*
X132527297Y-131599500D02*
X131559797Y-130632000D01*
%TO.N,Net-(Q7-C)*%
X129654797Y-129032000D02*
X129349797Y-129032000D01*
X128687297Y-133617000D02*
X128687297Y-131569500D01*
X127749797Y-130632000D02*
X128054797Y-130632000D01*
X128687297Y-131569500D02*
X127749797Y-130632000D01*
X128054797Y-130632000D02*
X129654797Y-129032000D01*
%TO.N,Net-(Q8-C)*%
X133769797Y-130632000D02*
X135369797Y-129032000D01*
X134402297Y-131569500D02*
X133464797Y-130632000D01*
X134402297Y-133617000D02*
X134402297Y-131569500D01*
X135369797Y-129032000D02*
X135064797Y-129032000D01*
X133464797Y-130632000D02*
X133769797Y-130632000D01*
%TO.N,Net-(Q1-B)*%
X112509797Y-124587000D02*
X112509797Y-134887000D01*
X136639797Y-135522000D02*
X136639797Y-131077000D01*
X112509797Y-134887000D02*
X113779797Y-136157000D01*
X136004797Y-136157000D02*
X136639797Y-135522000D01*
X113459797Y-123637000D02*
X112509797Y-124587000D01*
X115382297Y-122569500D02*
X114414797Y-121602000D01*
X136144797Y-130582000D02*
X135369797Y-130582000D01*
X136639797Y-131077000D02*
X136144797Y-130582000D01*
X115382297Y-123637000D02*
X115382297Y-122569500D01*
X113779797Y-136157000D02*
X136004797Y-136157000D01*
X115382297Y-123637000D02*
X113459797Y-123637000D01*
%TO.N,Net-(D1-K)*%
X131559797Y-85852000D02*
X132699797Y-85852000D01*
X116319797Y-116332000D02*
X116319797Y-119952000D01*
X122034797Y-110617000D02*
X116319797Y-116332000D01*
X131559797Y-110617000D02*
X122034797Y-110617000D01*
%TO.N,Net-(D2-K)*%
X124574797Y-68707000D02*
X125298386Y-67983411D01*
X122034797Y-113157000D02*
X122034797Y-119952000D01*
%TO.N,Net-(D3-K)*%
X107429797Y-61722000D02*
X107429797Y-60582000D01*
X127749797Y-119952000D02*
X127749797Y-118237000D01*
%TO.N,Net-(D4-K)*%
X133464797Y-119952000D02*
X133464797Y-118237000D01*
X90284797Y-68707000D02*
X89561208Y-67983411D01*
%TO.N,Net-(D5-K)*%
X116369797Y-128982000D02*
X116954797Y-128397000D01*
X83299797Y-85852000D02*
X82159797Y-85852000D01*
X116319797Y-128982000D02*
X116369797Y-128982000D01*
%TO.N,Net-(D6-K)*%
X89561208Y-103720589D02*
X90284797Y-102997000D01*
%TO.N,Net-(D7-K)*%
X127749797Y-128982000D02*
X127799797Y-128982000D01*
X127799797Y-128982000D02*
X128384797Y-128397000D01*
X107429797Y-112522000D02*
X107429797Y-111122000D01*
%TO.N,Net-(D8-K)*%
X133464797Y-128982000D02*
X133514797Y-128982000D01*
X125298386Y-103720589D02*
X124574797Y-102997000D01*
X133514797Y-128982000D02*
X134099797Y-128397000D01*
D24*
%TO.N,Net-(SW1-A)*%
X79929797Y-122877000D02*
X82029797Y-120777000D01*
X79929797Y-129062000D02*
X79929797Y-122877000D01*
%TO.N,VDD*%
X114414797Y-128982000D02*
X114414797Y-127762000D01*
X105524797Y-123952000D02*
X106794797Y-123952000D01*
D25*
%TO.N,Net-(Q5-B)*%
X115382297Y-131599500D02*
X114414797Y-130632000D01*
X136004797Y-126492000D02*
X114414797Y-126492000D01*
X135369797Y-121552000D02*
X136144797Y-121552000D01*
X136639797Y-125857000D02*
X136004797Y-126492000D01*
X114414797Y-126492000D02*
X113144797Y-127762000D01*
X114099797Y-132667000D02*
X115382297Y-132667000D01*
X113144797Y-131712000D02*
X114099797Y-132667000D01*
X115382297Y-132667000D02*
X115382297Y-131599500D01*
X136144797Y-121552000D02*
X136639797Y-122047000D01*
X113144797Y-127762000D02*
X113144797Y-131712000D01*
X136639797Y-122047000D02*
X136639797Y-125857000D01*
%TD*%
%TA.AperFunction,Conductor*%
%TO.N,VDD*%
G36*
X107987424Y-54739556D02*
G01*
X109093131Y-54779047D01*
X109097544Y-54779283D01*
X110201168Y-54858216D01*
X110205474Y-54858601D01*
X111305634Y-54976881D01*
X111309990Y-54977428D01*
X112405151Y-55134889D01*
X112409494Y-55135592D01*
X113498371Y-55332048D01*
X113502672Y-55332904D01*
X114583811Y-55568091D01*
X114588094Y-55569103D01*
X115660166Y-55842733D01*
X115664383Y-55843890D01*
X116682969Y-56142974D01*
X116726010Y-56155612D01*
X116730236Y-56156935D01*
X117780027Y-56506339D01*
X117784129Y-56507785D01*
X118820879Y-56894473D01*
X118824921Y-56896063D01*
X119287995Y-57087875D01*
X119847150Y-57319485D01*
X119851201Y-57321248D01*
X119929547Y-57357028D01*
X120857596Y-57780854D01*
X120861589Y-57782764D01*
X121850994Y-58278025D01*
X121854916Y-58280077D01*
X122825974Y-58810314D01*
X122829820Y-58812504D01*
X123781359Y-59377078D01*
X123785100Y-59379389D01*
X124715869Y-59977558D01*
X124719549Y-59980017D01*
X125102961Y-60246224D01*
X125628408Y-60611048D01*
X125631960Y-60613610D01*
X126517251Y-61276331D01*
X126517684Y-61276655D01*
X126521180Y-61279370D01*
X127382686Y-61973616D01*
X127386083Y-61976455D01*
X127868981Y-62394888D01*
X128131659Y-62622500D01*
X128222249Y-62700996D01*
X128225542Y-62703954D01*
X129035324Y-63457887D01*
X129038509Y-63460961D01*
X129820835Y-64243287D01*
X129823909Y-64246472D01*
X130274771Y-64730733D01*
X130577842Y-65056254D01*
X130580800Y-65059547D01*
X131305341Y-65895713D01*
X131308180Y-65899110D01*
X132002426Y-66760616D01*
X132005141Y-66764112D01*
X132474740Y-67391423D01*
X132668172Y-67649817D01*
X132670755Y-67653399D01*
X132678724Y-67664876D01*
X133301779Y-68562247D01*
X133304238Y-68565927D01*
X133866625Y-69441018D01*
X133902391Y-69496670D01*
X133904718Y-69500437D01*
X134469292Y-70451976D01*
X134471482Y-70455822D01*
X135001719Y-71426880D01*
X135003771Y-71430802D01*
X135499032Y-72420207D01*
X135500942Y-72424200D01*
X135960544Y-73430587D01*
X135962311Y-73434646D01*
X136385717Y-74456836D01*
X136387338Y-74460955D01*
X136773998Y-75497631D01*
X136775470Y-75501806D01*
X137124861Y-76551562D01*
X137126184Y-76555786D01*
X137437899Y-77617387D01*
X137439070Y-77621656D01*
X137712690Y-78693690D01*
X137713708Y-78697998D01*
X137948888Y-79779104D01*
X137949752Y-79783445D01*
X138146201Y-80872289D01*
X138146909Y-80876659D01*
X138304365Y-81971788D01*
X138304917Y-81976180D01*
X138423190Y-83076271D01*
X138423584Y-83080680D01*
X138502512Y-84184248D01*
X138502749Y-84188668D01*
X138542249Y-85294641D01*
X138542327Y-85298514D01*
X138544796Y-85851775D01*
X138544797Y-85852328D01*
X138544797Y-139703000D01*
X138525112Y-139770039D01*
X138472308Y-139815794D01*
X138420797Y-139827000D01*
X76438797Y-139827000D01*
X76371758Y-139807315D01*
X76326003Y-139754511D01*
X76314797Y-139703000D01*
X76314797Y-115729135D01*
X77379297Y-115729135D01*
X77379297Y-116824870D01*
X77379298Y-116824876D01*
X77385705Y-116884483D01*
X77435999Y-117019328D01*
X77436003Y-117019335D01*
X77522249Y-117134544D01*
X77522252Y-117134547D01*
X77637461Y-117220793D01*
X77637468Y-117220797D01*
X77772314Y-117271091D01*
X77772313Y-117271091D01*
X77779241Y-117271835D01*
X77831924Y-117277500D01*
X78621253Y-117277499D01*
X78621267Y-117277500D01*
X78631256Y-117277500D01*
X80905297Y-117277500D01*
X80972336Y-117297185D01*
X81018091Y-117349989D01*
X81029297Y-117401500D01*
X81029297Y-120311217D01*
X81009612Y-120378256D01*
X80992978Y-120398898D01*
X79292017Y-122099859D01*
X79292015Y-122099861D01*
X79222335Y-122169540D01*
X79152656Y-122239219D01*
X79043168Y-122403079D01*
X79043161Y-122403092D01*
X78967747Y-122585160D01*
X78967744Y-122585170D01*
X78929297Y-122778456D01*
X78929297Y-126187500D01*
X78909612Y-126254539D01*
X78856808Y-126300294D01*
X78805297Y-126311500D01*
X78131926Y-126311500D01*
X78131920Y-126311501D01*
X78072313Y-126317908D01*
X77937468Y-126368202D01*
X77937461Y-126368206D01*
X77822252Y-126454452D01*
X77822249Y-126454455D01*
X77736003Y-126569664D01*
X77735999Y-126569671D01*
X77685705Y-126704517D01*
X77679298Y-126764116D01*
X77679298Y-126764123D01*
X77679297Y-126764135D01*
X77679297Y-131359870D01*
X77679298Y-131359876D01*
X77685705Y-131419483D01*
X77735999Y-131554328D01*
X77736003Y-131554335D01*
X77822249Y-131669544D01*
X77822252Y-131669547D01*
X77937461Y-131755793D01*
X77937468Y-131755797D01*
X78072314Y-131806091D01*
X78072313Y-131806091D01*
X78079241Y-131806835D01*
X78131924Y-131812500D01*
X81727669Y-131812499D01*
X81787280Y-131806091D01*
X81922128Y-131755796D01*
X82037343Y-131669546D01*
X82123593Y-131554331D01*
X82173888Y-131419483D01*
X82180297Y-131359873D01*
X82180296Y-126764128D01*
X82173888Y-126704517D01*
X82173745Y-126704135D01*
X107279297Y-126704135D01*
X107279297Y-131299870D01*
X107279298Y-131299876D01*
X107285705Y-131359483D01*
X107335999Y-131494328D01*
X107336003Y-131494335D01*
X107422249Y-131609544D01*
X107422252Y-131609547D01*
X107537461Y-131695793D01*
X107537468Y-131695797D01*
X107672314Y-131746091D01*
X107672313Y-131746091D01*
X107679241Y-131746835D01*
X107731924Y-131752500D01*
X111327669Y-131752499D01*
X111327671Y-131752498D01*
X111327684Y-131752498D01*
X111354732Y-131749590D01*
X111418422Y-131759599D01*
X111504994Y-131798144D01*
X111690151Y-131837500D01*
X111690152Y-131837500D01*
X111760297Y-131837500D01*
X111827336Y-131857185D01*
X111873091Y-131909989D01*
X111884297Y-131961500D01*
X111884297Y-134948608D01*
X111890023Y-134977393D01*
X111890023Y-134977396D01*
X111901708Y-135036142D01*
X111908334Y-135069451D01*
X111955485Y-135183286D01*
X111955486Y-135183287D01*
X111984552Y-135226788D01*
X111984553Y-135226789D01*
X111997621Y-135246347D01*
X112023939Y-135285733D01*
X112023942Y-135285736D01*
X112023945Y-135285740D01*
X112115383Y-135377178D01*
X112115405Y-135377198D01*
X113290813Y-136552606D01*
X113290842Y-136552637D01*
X113381060Y-136642855D01*
X113381064Y-136642858D01*
X113483504Y-136711307D01*
X113483508Y-136711309D01*
X113483511Y-136711311D01*
X113597345Y-136758463D01*
X113657768Y-136770481D01*
X113718190Y-136782500D01*
X136066404Y-136782500D01*
X136126826Y-136770481D01*
X136187249Y-136758463D01*
X136187252Y-136758461D01*
X136187255Y-136758461D01*
X136220584Y-136744654D01*
X136220583Y-136744654D01*
X136220589Y-136744652D01*
X136301083Y-136711312D01*
X136352306Y-136677084D01*
X136403530Y-136642858D01*
X136490655Y-136555733D01*
X136490656Y-136555730D01*
X137125655Y-135920733D01*
X137194109Y-135818285D01*
X137241260Y-135704451D01*
X137265298Y-135583606D01*
X137265298Y-135460393D01*
X137265298Y-135455283D01*
X137265297Y-135455257D01*
X137265297Y-131015393D01*
X137265296Y-131015389D01*
X137241261Y-130894555D01*
X137241260Y-130894548D01*
X137208083Y-130814452D01*
X137194109Y-130780715D01*
X137125655Y-130678267D01*
X137125652Y-130678263D01*
X136637725Y-130190338D01*
X136637722Y-130190334D01*
X136637722Y-130190335D01*
X136630655Y-130183268D01*
X136630655Y-130183267D01*
X136543530Y-130096142D01*
X136543529Y-130096141D01*
X136543528Y-130096140D01*
X136492306Y-130061915D01*
X136441084Y-130027689D01*
X136441083Y-130027688D01*
X136441080Y-130027686D01*
X136441077Y-130027685D01*
X136360589Y-129994347D01*
X136327249Y-129980537D01*
X136327243Y-129980535D01*
X136280784Y-129971294D01*
X136218873Y-129938909D01*
X136199437Y-129914773D01*
X136192765Y-129903956D01*
X136183490Y-129894681D01*
X136150005Y-129833358D01*
X136154989Y-129763666D01*
X136183490Y-129719319D01*
X136183846Y-129718963D01*
X136192765Y-129710044D01*
X136281800Y-129565697D01*
X136335146Y-129404708D01*
X136345297Y-129305345D01*
X136345296Y-128758656D01*
X136335146Y-128659292D01*
X136281800Y-128498303D01*
X136281796Y-128498297D01*
X136281795Y-128498294D01*
X136192767Y-128353959D01*
X136192764Y-128353955D01*
X136072841Y-128234032D01*
X136072837Y-128234029D01*
X135928502Y-128145001D01*
X135928496Y-128144998D01*
X135928494Y-128144997D01*
X135789771Y-128099029D01*
X135767506Y-128091651D01*
X135668143Y-128081500D01*
X135071459Y-128081500D01*
X135071436Y-128081502D01*
X135043651Y-128084340D01*
X134974958Y-128071569D01*
X134924075Y-128023687D01*
X134923665Y-128022982D01*
X134886385Y-127958411D01*
X134832330Y-127864784D01*
X134705668Y-127724112D01*
X134705667Y-127724111D01*
X134552531Y-127612851D01*
X134552526Y-127612848D01*
X134379604Y-127535857D01*
X134379599Y-127535855D01*
X134233798Y-127504865D01*
X134194443Y-127496500D01*
X134005151Y-127496500D01*
X133972694Y-127503398D01*
X133819994Y-127535855D01*
X133819989Y-127535857D01*
X133647067Y-127612848D01*
X133647062Y-127612851D01*
X133493926Y-127724111D01*
X133367263Y-127864785D01*
X133277939Y-128019500D01*
X133227372Y-128067715D01*
X133170552Y-128081500D01*
X133133181Y-128081500D01*
X133113942Y-128083248D01*
X133062604Y-128087913D01*
X132900190Y-128138522D01*
X132754608Y-128226530D01*
X132634328Y-128346810D01*
X132634323Y-128346817D01*
X132618119Y-128373621D01*
X132566591Y-128420808D01*
X132497731Y-128432645D01*
X132433403Y-128405375D01*
X132405887Y-128373619D01*
X132389869Y-128347122D01*
X132269674Y-128226927D01*
X132124192Y-128138980D01*
X132124193Y-128138980D01*
X131961902Y-128088409D01*
X131961903Y-128088409D01*
X131891369Y-128082000D01*
X131809797Y-128082000D01*
X131809797Y-129108000D01*
X131790112Y-129175039D01*
X131737308Y-129220794D01*
X131685797Y-129232000D01*
X131433797Y-129232000D01*
X131366758Y-129212315D01*
X131321003Y-129159511D01*
X131309797Y-129108000D01*
X131309797Y-128082000D01*
X131309796Y-128081999D01*
X131228214Y-128082000D01*
X131157694Y-128088408D01*
X131157689Y-128088409D01*
X130995400Y-128138981D01*
X130849919Y-128226927D01*
X130729725Y-128347121D01*
X130729722Y-128347125D01*
X130707977Y-128383096D01*
X130656449Y-128430283D01*
X130587590Y-128442121D01*
X130523261Y-128414852D01*
X130496323Y-128384042D01*
X130477767Y-128353959D01*
X130477764Y-128353955D01*
X130357841Y-128234032D01*
X130357837Y-128234029D01*
X130213502Y-128145001D01*
X130213496Y-128144998D01*
X130213494Y-128144997D01*
X130074771Y-128099029D01*
X130052506Y-128091651D01*
X129953143Y-128081500D01*
X129356459Y-128081500D01*
X129356436Y-128081502D01*
X129328651Y-128084340D01*
X129259958Y-128071569D01*
X129209075Y-128023687D01*
X129208665Y-128022982D01*
X129171385Y-127958411D01*
X129117330Y-127864784D01*
X128990668Y-127724112D01*
X128990667Y-127724111D01*
X128837531Y-127612851D01*
X128837526Y-127612848D01*
X128664604Y-127535857D01*
X128664599Y-127535855D01*
X128518798Y-127504865D01*
X128479443Y-127496500D01*
X128290151Y-127496500D01*
X128257694Y-127503398D01*
X128104994Y-127535855D01*
X128104989Y-127535857D01*
X127932067Y-127612848D01*
X127932062Y-127612851D01*
X127778926Y-127724111D01*
X127652263Y-127864785D01*
X127562939Y-128019500D01*
X127512372Y-128067715D01*
X127455552Y-128081500D01*
X127418181Y-128081500D01*
X127398942Y-128083248D01*
X127347604Y-128087913D01*
X127185190Y-128138522D01*
X127039608Y-128226530D01*
X126919328Y-128346810D01*
X126919323Y-128346817D01*
X126903119Y-128373621D01*
X126851591Y-128420808D01*
X126782731Y-128432645D01*
X126718403Y-128405375D01*
X126690887Y-128373619D01*
X126674869Y-128347122D01*
X126554674Y-128226927D01*
X126409192Y-128138980D01*
X126409193Y-128138980D01*
X126246902Y-128088409D01*
X126246903Y-128088409D01*
X126176369Y-128082000D01*
X126094797Y-128082000D01*
X126094797Y-129108000D01*
X126075112Y-129175039D01*
X126022308Y-129220794D01*
X125970797Y-129232000D01*
X125718797Y-129232000D01*
X125651758Y-129212315D01*
X125606003Y-129159511D01*
X125594797Y-129108000D01*
X125594797Y-128082000D01*
X125594796Y-128081999D01*
X125513214Y-128082000D01*
X125442694Y-128088408D01*
X125442689Y-128088409D01*
X125280400Y-128138981D01*
X125134919Y-128226927D01*
X125014725Y-128347121D01*
X125014722Y-128347125D01*
X124992977Y-128383096D01*
X124941449Y-128430283D01*
X124872590Y-128442121D01*
X124808261Y-128414852D01*
X124781323Y-128384042D01*
X124762767Y-128353959D01*
X124762764Y-128353955D01*
X124642841Y-128234032D01*
X124642837Y-128234029D01*
X124498502Y-128145001D01*
X124498496Y-128144998D01*
X124498494Y-128144997D01*
X124359771Y-128099029D01*
X124337506Y-128091651D01*
X124238143Y-128081500D01*
X123641459Y-128081500D01*
X123641436Y-128081502D01*
X123613651Y-128084340D01*
X123544958Y-128071569D01*
X123494075Y-128023687D01*
X123493665Y-128022982D01*
X123456385Y-127958411D01*
X123402330Y-127864784D01*
X123275668Y-127724112D01*
X123275667Y-127724111D01*
X123122531Y-127612851D01*
X123122526Y-127612848D01*
X122949604Y-127535857D01*
X122949599Y-127535855D01*
X122803798Y-127504865D01*
X122764443Y-127496500D01*
X122575151Y-127496500D01*
X122542694Y-127503398D01*
X122389994Y-127535855D01*
X122389989Y-127535857D01*
X122217067Y-127612848D01*
X122217062Y-127612851D01*
X122063926Y-127724111D01*
X121937263Y-127864785D01*
X121847939Y-128019500D01*
X121797372Y-128067715D01*
X121740552Y-128081500D01*
X121703181Y-128081500D01*
X121683942Y-128083248D01*
X121632604Y-128087913D01*
X121470190Y-128138522D01*
X121324608Y-128226530D01*
X121204328Y-128346810D01*
X121204323Y-128346817D01*
X121188119Y-128373621D01*
X121136591Y-128420808D01*
X121067731Y-128432645D01*
X121003403Y-128405375D01*
X120975887Y-128373619D01*
X120959869Y-128347122D01*
X120839674Y-128226927D01*
X120694192Y-128138980D01*
X120694193Y-128138980D01*
X120531902Y-128088409D01*
X120531903Y-128088409D01*
X120461369Y-128082000D01*
X120379797Y-128082000D01*
X120379797Y-129108000D01*
X120360112Y-129175039D01*
X120307308Y-129220794D01*
X120255797Y-129232000D01*
X120003797Y-129232000D01*
X119936758Y-129212315D01*
X119891003Y-129159511D01*
X119879797Y-129108000D01*
X119879797Y-128082000D01*
X119879796Y-128081999D01*
X119798214Y-128082000D01*
X119727694Y-128088408D01*
X119727689Y-128088409D01*
X119565400Y-128138981D01*
X119419919Y-128226927D01*
X119299725Y-128347121D01*
X119299722Y-128347125D01*
X119277977Y-128383096D01*
X119226449Y-128430283D01*
X119157590Y-128442121D01*
X119093261Y-128414852D01*
X119066323Y-128384042D01*
X119047767Y-128353959D01*
X119047764Y-128353955D01*
X118927841Y-128234032D01*
X118927837Y-128234029D01*
X118783502Y-128145001D01*
X118783496Y-128144998D01*
X118783494Y-128144997D01*
X118644771Y-128099029D01*
X118622506Y-128091651D01*
X118523143Y-128081500D01*
X117926459Y-128081500D01*
X117926436Y-128081502D01*
X117898651Y-128084340D01*
X117829958Y-128071569D01*
X117779075Y-128023687D01*
X117778665Y-128022982D01*
X117741385Y-127958411D01*
X117687330Y-127864784D01*
X117560668Y-127724112D01*
X117560667Y-127724111D01*
X117407531Y-127612851D01*
X117407526Y-127612848D01*
X117234604Y-127535857D01*
X117234599Y-127535855D01*
X117088798Y-127504865D01*
X117049443Y-127496500D01*
X116860151Y-127496500D01*
X116827694Y-127503398D01*
X116674994Y-127535855D01*
X116674989Y-127535857D01*
X116502067Y-127612848D01*
X116502062Y-127612851D01*
X116348926Y-127724111D01*
X116222263Y-127864785D01*
X116132939Y-128019500D01*
X116082372Y-128067715D01*
X116025552Y-128081500D01*
X115988181Y-128081500D01*
X115968942Y-128083248D01*
X115917604Y-128087913D01*
X115755190Y-128138522D01*
X115609608Y-128226530D01*
X115489328Y-128346810D01*
X115489323Y-128346817D01*
X115473119Y-128373621D01*
X115421591Y-128420808D01*
X115352731Y-128432645D01*
X115288403Y-128405375D01*
X115260887Y-128373619D01*
X115244869Y-128347122D01*
X115124674Y-128226927D01*
X114979192Y-128138980D01*
X114979193Y-128138980D01*
X114816902Y-128088409D01*
X114816903Y-128088409D01*
X114746369Y-128082000D01*
X114664797Y-128082000D01*
X114664797Y-129108000D01*
X114645112Y-129175039D01*
X114592308Y-129220794D01*
X114540797Y-129232000D01*
X114288797Y-129232000D01*
X114221758Y-129212315D01*
X114176003Y-129159511D01*
X114164797Y-129108000D01*
X114164797Y-128082000D01*
X114164796Y-128081999D01*
X114083214Y-128082000D01*
X114083212Y-128082001D01*
X114013086Y-128088372D01*
X113944541Y-128074834D01*
X113894196Y-128026386D01*
X113878036Y-127958411D01*
X113901191Y-127892490D01*
X113914180Y-127877206D01*
X114637568Y-127153819D01*
X114698891Y-127120334D01*
X114725249Y-127117500D01*
X136066404Y-127117500D01*
X136126826Y-127105481D01*
X136187249Y-127093463D01*
X136187252Y-127093461D01*
X136187255Y-127093461D01*
X136220584Y-127079654D01*
X136220583Y-127079654D01*
X136220589Y-127079652D01*
X136301083Y-127046312D01*
X136352306Y-127012084D01*
X136403530Y-126977858D01*
X136490655Y-126890733D01*
X136490656Y-126890730D01*
X137125655Y-126255733D01*
X137194109Y-126153285D01*
X137241260Y-126039451D01*
X137253197Y-125979440D01*
X137265298Y-125918608D01*
X137265298Y-125790283D01*
X137265297Y-125790257D01*
X137265297Y-121985393D01*
X137265296Y-121985389D01*
X137241261Y-121864555D01*
X137241260Y-121864548D01*
X137208083Y-121784452D01*
X137194109Y-121750715D01*
X137125655Y-121648267D01*
X137125652Y-121648263D01*
X136637725Y-121160338D01*
X136637722Y-121160334D01*
X136637722Y-121160335D01*
X136630655Y-121153268D01*
X136630655Y-121153267D01*
X136543530Y-121066142D01*
X136543529Y-121066141D01*
X136543528Y-121066140D01*
X136492306Y-121031915D01*
X136441084Y-120997689D01*
X136441083Y-120997688D01*
X136441080Y-120997686D01*
X136441077Y-120997685D01*
X136360589Y-120964347D01*
X136327249Y-120950537D01*
X136327243Y-120950535D01*
X136280784Y-120941294D01*
X136218873Y-120908909D01*
X136199437Y-120884773D01*
X136192765Y-120873956D01*
X136183490Y-120864681D01*
X136150005Y-120803358D01*
X136154989Y-120733666D01*
X136183490Y-120689319D01*
X136183846Y-120688963D01*
X136192765Y-120680044D01*
X136281800Y-120535697D01*
X136335146Y-120374708D01*
X136345297Y-120275345D01*
X136345296Y-119728656D01*
X136335146Y-119629292D01*
X136281800Y-119468303D01*
X136281796Y-119468297D01*
X136281795Y-119468294D01*
X136192767Y-119323959D01*
X136192764Y-119323955D01*
X136072841Y-119204032D01*
X136072837Y-119204029D01*
X135928502Y-119115001D01*
X135928496Y-119114998D01*
X135928494Y-119114997D01*
X135910336Y-119108980D01*
X135767506Y-119061651D01*
X135668143Y-119051500D01*
X135071459Y-119051500D01*
X135071441Y-119051501D01*
X134972089Y-119061650D01*
X134972086Y-119061651D01*
X134811102Y-119114996D01*
X134811091Y-119115001D01*
X134666756Y-119204029D01*
X134666752Y-119204032D01*
X134546828Y-119323956D01*
X134528566Y-119353564D01*
X134476617Y-119400288D01*
X134407654Y-119411509D01*
X134343573Y-119383665D01*
X134316912Y-119352618D01*
X134295269Y-119316815D01*
X134295267Y-119316813D01*
X134295266Y-119316811D01*
X134174985Y-119196530D01*
X134174983Y-119196529D01*
X134174982Y-119196528D01*
X134150145Y-119181513D01*
X134102959Y-119129984D01*
X134090297Y-119075397D01*
X134090297Y-118935687D01*
X134109982Y-118868648D01*
X134122147Y-118852715D01*
X134140688Y-118832122D01*
X134197330Y-118769216D01*
X134291976Y-118605284D01*
X134350471Y-118425256D01*
X134370257Y-118237000D01*
X134350471Y-118048744D01*
X134291976Y-117868716D01*
X134197330Y-117704784D01*
X134070668Y-117564112D01*
X134070667Y-117564111D01*
X133917531Y-117452851D01*
X133917526Y-117452848D01*
X133744604Y-117375857D01*
X133744599Y-117375855D01*
X133593345Y-117343706D01*
X133559443Y-117336500D01*
X133370151Y-117336500D01*
X133337694Y-117343398D01*
X133184994Y-117375855D01*
X133184989Y-117375857D01*
X133012067Y-117452848D01*
X133012062Y-117452851D01*
X132858926Y-117564111D01*
X132732263Y-117704785D01*
X132637618Y-117868715D01*
X132637615Y-117868722D01*
X132579124Y-118048740D01*
X132579123Y-118048744D01*
X132559337Y-118237000D01*
X132579123Y-118425256D01*
X132579124Y-118425259D01*
X132637615Y-118605277D01*
X132637618Y-118605284D01*
X132732264Y-118769216D01*
X132775569Y-118817310D01*
X132807447Y-118852715D01*
X132837677Y-118915706D01*
X132839297Y-118935687D01*
X132839297Y-119075397D01*
X132819612Y-119142436D01*
X132779449Y-119181513D01*
X132754610Y-119196529D01*
X132754608Y-119196530D01*
X132634328Y-119316810D01*
X132634323Y-119316817D01*
X132618119Y-119343621D01*
X132566591Y-119390808D01*
X132497731Y-119402645D01*
X132433403Y-119375375D01*
X132405887Y-119343619D01*
X132389869Y-119317122D01*
X132269674Y-119196927D01*
X132124192Y-119108980D01*
X132124193Y-119108980D01*
X131961902Y-119058409D01*
X131961903Y-119058409D01*
X131891369Y-119052000D01*
X131809797Y-119052000D01*
X131809797Y-120078000D01*
X131790112Y-120145039D01*
X131737308Y-120190794D01*
X131685797Y-120202000D01*
X131433797Y-120202000D01*
X131366758Y-120182315D01*
X131321003Y-120129511D01*
X131309797Y-120078000D01*
X131309797Y-119052000D01*
X131309796Y-119051999D01*
X131228214Y-119052000D01*
X131157694Y-119058408D01*
X131157689Y-119058409D01*
X130995400Y-119108981D01*
X130849919Y-119196927D01*
X130729725Y-119317121D01*
X130729722Y-119317125D01*
X130707977Y-119353096D01*
X130656449Y-119400283D01*
X130587590Y-119412121D01*
X130523261Y-119384852D01*
X130496323Y-119354042D01*
X130477767Y-119323959D01*
X130477764Y-119323955D01*
X130357841Y-119204032D01*
X130357837Y-119204029D01*
X130213502Y-119115001D01*
X130213496Y-119114998D01*
X130213494Y-119114997D01*
X130195336Y-119108980D01*
X130052506Y-119061651D01*
X129953143Y-119051500D01*
X129356459Y-119051500D01*
X129356441Y-119051501D01*
X129257089Y-119061650D01*
X129257086Y-119061651D01*
X129096102Y-119114996D01*
X129096091Y-119115001D01*
X128951756Y-119204029D01*
X128951752Y-119204032D01*
X128831828Y-119323956D01*
X128813566Y-119353564D01*
X128761617Y-119400288D01*
X128692654Y-119411509D01*
X128628573Y-119383665D01*
X128601912Y-119352618D01*
X128580269Y-119316815D01*
X128580267Y-119316813D01*
X128580266Y-119316811D01*
X128459985Y-119196530D01*
X128459983Y-119196529D01*
X128459982Y-119196528D01*
X128435145Y-119181513D01*
X128387959Y-119129984D01*
X128375297Y-119075397D01*
X128375297Y-118935687D01*
X128394982Y-118868648D01*
X128407147Y-118852715D01*
X128425688Y-118832122D01*
X128482330Y-118769216D01*
X128576976Y-118605284D01*
X128635471Y-118425256D01*
X128655257Y-118237000D01*
X128635471Y-118048744D01*
X128576976Y-117868716D01*
X128482330Y-117704784D01*
X128355668Y-117564112D01*
X128355667Y-117564111D01*
X128202531Y-117452851D01*
X128202526Y-117452848D01*
X128029604Y-117375857D01*
X128029599Y-117375855D01*
X127878345Y-117343706D01*
X127844443Y-117336500D01*
X127655151Y-117336500D01*
X127622694Y-117343398D01*
X127469994Y-117375855D01*
X127469989Y-117375857D01*
X127297067Y-117452848D01*
X127297062Y-117452851D01*
X127143926Y-117564111D01*
X127017263Y-117704785D01*
X126922618Y-117868715D01*
X126922615Y-117868722D01*
X126864124Y-118048740D01*
X126864123Y-118048744D01*
X126844337Y-118237000D01*
X126864123Y-118425256D01*
X126864124Y-118425259D01*
X126922615Y-118605277D01*
X126922618Y-118605284D01*
X127017264Y-118769216D01*
X127060569Y-118817310D01*
X127092447Y-118852715D01*
X127122677Y-118915706D01*
X127124297Y-118935687D01*
X127124297Y-119075397D01*
X127104612Y-119142436D01*
X127064449Y-119181513D01*
X127039610Y-119196529D01*
X127039608Y-119196530D01*
X126919328Y-119316810D01*
X126919323Y-119316817D01*
X126903119Y-119343621D01*
X126851591Y-119390808D01*
X126782731Y-119402645D01*
X126718403Y-119375375D01*
X126690887Y-119343619D01*
X126674869Y-119317122D01*
X126554674Y-119196927D01*
X126409192Y-119108980D01*
X126409193Y-119108980D01*
X126246902Y-119058409D01*
X126246903Y-119058409D01*
X126176369Y-119052000D01*
X126094797Y-119052000D01*
X126094797Y-120078000D01*
X126075112Y-120145039D01*
X126022308Y-120190794D01*
X125970797Y-120202000D01*
X125718797Y-120202000D01*
X125651758Y-120182315D01*
X125606003Y-120129511D01*
X125594797Y-120078000D01*
X125594797Y-119052000D01*
X125594796Y-119051999D01*
X125513214Y-119052000D01*
X125442694Y-119058408D01*
X125442689Y-119058409D01*
X125280400Y-119108981D01*
X125134919Y-119196927D01*
X125014725Y-119317121D01*
X125014722Y-119317125D01*
X124992977Y-119353096D01*
X124941449Y-119400283D01*
X124872590Y-119412121D01*
X124808261Y-119384852D01*
X124781323Y-119354042D01*
X124762767Y-119323959D01*
X124762764Y-119323955D01*
X124642841Y-119204032D01*
X124642837Y-119204029D01*
X124498502Y-119115001D01*
X124498496Y-119114998D01*
X124498494Y-119114997D01*
X124480336Y-119108980D01*
X124337506Y-119061651D01*
X124238143Y-119051500D01*
X123641459Y-119051500D01*
X123641441Y-119051501D01*
X123542089Y-119061650D01*
X123542086Y-119061651D01*
X123381102Y-119114996D01*
X123381091Y-119115001D01*
X123236756Y-119204029D01*
X123236752Y-119204032D01*
X123116828Y-119323956D01*
X123098566Y-119353564D01*
X123046617Y-119400288D01*
X122977654Y-119411509D01*
X122913573Y-119383665D01*
X122886912Y-119352618D01*
X122865269Y-119316815D01*
X122865267Y-119316813D01*
X122865266Y-119316811D01*
X122744985Y-119196530D01*
X122744983Y-119196529D01*
X122744982Y-119196528D01*
X122720145Y-119181513D01*
X122672959Y-119129984D01*
X122660297Y-119075397D01*
X122660297Y-113855687D01*
X122679982Y-113788648D01*
X122692147Y-113772715D01*
X122710688Y-113752122D01*
X122767330Y-113689216D01*
X122861976Y-113525284D01*
X122920471Y-113345256D01*
X122940257Y-113157000D01*
X122920471Y-112968744D01*
X122861976Y-112788716D01*
X122767330Y-112624784D01*
X122640668Y-112484112D01*
X122640667Y-112484111D01*
X122487531Y-112372851D01*
X122487526Y-112372848D01*
X122314604Y-112295857D01*
X122314599Y-112295855D01*
X122146182Y-112260058D01*
X122129443Y-112256500D01*
X121940151Y-112256500D01*
X121923412Y-112260058D01*
X121754994Y-112295855D01*
X121754989Y-112295857D01*
X121582067Y-112372848D01*
X121582062Y-112372851D01*
X121428926Y-112484111D01*
X121302263Y-112624785D01*
X121207618Y-112788715D01*
X121207615Y-112788722D01*
X121174616Y-112890284D01*
X121149123Y-112968744D01*
X121129337Y-113157000D01*
X121149123Y-113345256D01*
X121149124Y-113345259D01*
X121207615Y-113525277D01*
X121207618Y-113525284D01*
X121302264Y-113689216D01*
X121345569Y-113737310D01*
X121377447Y-113772715D01*
X121407677Y-113835706D01*
X121409297Y-113855687D01*
X121409297Y-119075397D01*
X121389612Y-119142436D01*
X121349449Y-119181513D01*
X121324610Y-119196529D01*
X121324608Y-119196530D01*
X121204328Y-119316810D01*
X121204323Y-119316817D01*
X121188119Y-119343621D01*
X121136591Y-119390808D01*
X121067731Y-119402645D01*
X121003403Y-119375375D01*
X120975887Y-119343619D01*
X120959869Y-119317122D01*
X120839674Y-119196927D01*
X120694192Y-119108980D01*
X120694193Y-119108980D01*
X120531902Y-119058409D01*
X120531903Y-119058409D01*
X120461369Y-119052000D01*
X120379797Y-119052000D01*
X120379797Y-120078000D01*
X120360112Y-120145039D01*
X120307308Y-120190794D01*
X120255797Y-120202000D01*
X120003797Y-120202000D01*
X119936758Y-120182315D01*
X119891003Y-120129511D01*
X119879797Y-120078000D01*
X119879797Y-119052000D01*
X119879796Y-119051999D01*
X119798214Y-119052000D01*
X119727694Y-119058408D01*
X119727689Y-119058409D01*
X119565400Y-119108981D01*
X119419919Y-119196927D01*
X119299725Y-119317121D01*
X119299722Y-119317125D01*
X119277977Y-119353096D01*
X119226449Y-119400283D01*
X119157590Y-119412121D01*
X119093261Y-119384852D01*
X119066323Y-119354042D01*
X119047767Y-119323959D01*
X119047764Y-119323955D01*
X118927841Y-119204032D01*
X118927837Y-119204029D01*
X118783502Y-119115001D01*
X118783496Y-119114998D01*
X118783494Y-119114997D01*
X118765336Y-119108980D01*
X118622506Y-119061651D01*
X118523143Y-119051500D01*
X117926459Y-119051500D01*
X117926441Y-119051501D01*
X117827089Y-119061650D01*
X117827086Y-119061651D01*
X117666102Y-119114996D01*
X117666091Y-119115001D01*
X117521756Y-119204029D01*
X117521752Y-119204032D01*
X117401828Y-119323956D01*
X117383566Y-119353564D01*
X117331617Y-119400288D01*
X117262654Y-119411509D01*
X117198573Y-119383665D01*
X117171912Y-119352618D01*
X117150269Y-119316815D01*
X117150267Y-119316813D01*
X117150266Y-119316811D01*
X117029985Y-119196530D01*
X117029983Y-119196529D01*
X117029982Y-119196528D01*
X117005145Y-119181513D01*
X116957959Y-119129984D01*
X116945297Y-119075397D01*
X116945297Y-116642452D01*
X116964982Y-116575413D01*
X116981616Y-116554771D01*
X122257569Y-111278819D01*
X122318892Y-111245334D01*
X122345250Y-111242500D01*
X130856049Y-111242500D01*
X130923088Y-111262185D01*
X130948197Y-111283526D01*
X130953923Y-111289885D01*
X130953927Y-111289889D01*
X131107062Y-111401148D01*
X131107067Y-111401151D01*
X131279989Y-111478142D01*
X131279994Y-111478144D01*
X131465151Y-111517500D01*
X131465152Y-111517500D01*
X131654441Y-111517500D01*
X131654443Y-111517500D01*
X131839600Y-111478144D01*
X132012527Y-111401151D01*
X132165668Y-111289888D01*
X132292330Y-111149216D01*
X132386976Y-110985284D01*
X132445471Y-110805256D01*
X132465257Y-110617000D01*
X132445471Y-110428744D01*
X132386976Y-110248716D01*
X132292330Y-110084784D01*
X132165668Y-109944112D01*
X132165667Y-109944111D01*
X132012531Y-109832851D01*
X132012526Y-109832848D01*
X131839604Y-109755857D01*
X131839599Y-109755855D01*
X131693798Y-109724865D01*
X131654443Y-109716500D01*
X131465151Y-109716500D01*
X131432694Y-109723398D01*
X131279994Y-109755855D01*
X131279989Y-109755857D01*
X131107067Y-109832848D01*
X131107062Y-109832851D01*
X130953927Y-109944110D01*
X130953923Y-109944114D01*
X130948197Y-109950474D01*
X130888710Y-109987121D01*
X130856049Y-109991500D01*
X122102538Y-109991500D01*
X122102518Y-109991499D01*
X122096404Y-109991499D01*
X121973191Y-109991499D01*
X121872394Y-110011548D01*
X121872389Y-110011548D01*
X121852346Y-110015536D01*
X121852344Y-110015536D01*
X121805194Y-110035067D01*
X121738516Y-110062685D01*
X121738514Y-110062686D01*
X121636063Y-110131141D01*
X121636060Y-110131144D01*
X115921066Y-115846140D01*
X115833941Y-115933264D01*
X115833935Y-115933272D01*
X115765489Y-116035705D01*
X115765481Y-116035719D01*
X115732144Y-116116207D01*
X115726620Y-116129543D01*
X115718334Y-116149545D01*
X115718332Y-116149553D01*
X115694297Y-116270389D01*
X115694297Y-119075397D01*
X115674612Y-119142436D01*
X115634449Y-119181513D01*
X115609610Y-119196529D01*
X115609608Y-119196530D01*
X115489328Y-119316810D01*
X115489323Y-119316817D01*
X115473119Y-119343621D01*
X115421591Y-119390808D01*
X115352731Y-119402645D01*
X115288403Y-119375375D01*
X115260887Y-119343619D01*
X115244869Y-119317122D01*
X115124674Y-119196927D01*
X114979192Y-119108980D01*
X114979193Y-119108980D01*
X114816902Y-119058409D01*
X114816903Y-119058409D01*
X114746369Y-119052000D01*
X114664797Y-119052000D01*
X114664797Y-120078000D01*
X114645112Y-120145039D01*
X114592308Y-120190794D01*
X114540797Y-120202000D01*
X113439798Y-120202000D01*
X113439798Y-120208582D01*
X113446205Y-120279102D01*
X113446206Y-120279107D01*
X113496778Y-120441396D01*
X113584724Y-120586877D01*
X113686812Y-120688965D01*
X113720297Y-120750288D01*
X113715313Y-120819980D01*
X113686812Y-120864327D01*
X113584328Y-120966810D01*
X113584327Y-120966811D01*
X113496319Y-121112393D01*
X113445710Y-121274807D01*
X113439297Y-121345386D01*
X113439297Y-121858613D01*
X113445710Y-121929192D01*
X113445710Y-121929194D01*
X113445711Y-121929196D01*
X113496319Y-122091606D01*
X113581074Y-122231808D01*
X113584327Y-122237188D01*
X113704608Y-122357469D01*
X113704610Y-122357470D01*
X113704612Y-122357472D01*
X113850191Y-122445478D01*
X114012601Y-122496086D01*
X114083181Y-122502500D01*
X114379345Y-122502500D01*
X114446384Y-122522185D01*
X114467026Y-122538819D01*
X114602378Y-122674171D01*
X114635863Y-122735494D01*
X114630879Y-122805186D01*
X114589007Y-122861119D01*
X114549295Y-122880928D01*
X114534399Y-122885255D01*
X114392934Y-122968917D01*
X114392926Y-122968923D01*
X114386669Y-122975181D01*
X114325346Y-123008666D01*
X114298988Y-123011500D01*
X113398186Y-123011500D01*
X113338341Y-123023404D01*
X113337768Y-123023518D01*
X113277345Y-123035537D01*
X113277340Y-123035538D01*
X113243343Y-123049620D01*
X113230194Y-123055067D01*
X113207966Y-123064274D01*
X113163510Y-123082688D01*
X113153354Y-123089475D01*
X113153246Y-123089547D01*
X113061065Y-123151140D01*
X113017502Y-123194703D01*
X112973939Y-123238267D01*
X112973936Y-123238270D01*
X112111067Y-124101139D01*
X112111064Y-124101142D01*
X112067501Y-124144704D01*
X112023939Y-124188266D01*
X112007112Y-124213449D01*
X111990399Y-124238463D01*
X111974338Y-124262500D01*
X111955484Y-124290715D01*
X111955482Y-124290718D01*
X111922144Y-124371207D01*
X111916620Y-124384543D01*
X111908334Y-124404545D01*
X111908332Y-124404553D01*
X111884297Y-124525389D01*
X111884297Y-126351785D01*
X111864612Y-126418824D01*
X111811808Y-126464579D01*
X111742650Y-126474523D01*
X111679094Y-126445498D01*
X111661031Y-126426097D01*
X111655586Y-126418824D01*
X111637343Y-126394454D01*
X111637341Y-126394453D01*
X111637341Y-126394452D01*
X111522132Y-126308206D01*
X111522125Y-126308202D01*
X111387279Y-126257908D01*
X111387280Y-126257908D01*
X111327680Y-126251501D01*
X111327678Y-126251500D01*
X111327670Y-126251500D01*
X111327661Y-126251500D01*
X107731926Y-126251500D01*
X107731920Y-126251501D01*
X107672313Y-126257908D01*
X107537468Y-126308202D01*
X107537461Y-126308206D01*
X107422252Y-126394452D01*
X107422249Y-126394455D01*
X107336003Y-126509664D01*
X107335999Y-126509671D01*
X107285705Y-126644517D01*
X107279298Y-126704116D01*
X107279297Y-126704135D01*
X82173745Y-126704135D01*
X82173738Y-126704116D01*
X82123594Y-126569671D01*
X82123590Y-126569664D01*
X82037344Y-126454455D01*
X82037341Y-126454452D01*
X81922132Y-126368206D01*
X81922125Y-126368202D01*
X81787279Y-126317908D01*
X81787280Y-126317908D01*
X81727680Y-126311501D01*
X81727678Y-126311500D01*
X81727670Y-126311500D01*
X81727662Y-126311500D01*
X81054297Y-126311500D01*
X80987258Y-126291815D01*
X80941503Y-126239011D01*
X80930297Y-126187500D01*
X80930297Y-123342782D01*
X80949982Y-123275743D01*
X80966616Y-123255101D01*
X81871748Y-122349970D01*
X82806936Y-121414782D01*
X82853306Y-121345384D01*
X82900466Y-121274805D01*
X82908473Y-121262819D01*
X82916429Y-121250914D01*
X82956875Y-121153269D01*
X82972253Y-121116143D01*
X82972253Y-121116142D01*
X82973806Y-121112393D01*
X82991848Y-121068836D01*
X83030297Y-120875541D01*
X83030297Y-120678460D01*
X83030297Y-119695427D01*
X113439797Y-119695427D01*
X113439797Y-119702000D01*
X114164797Y-119702000D01*
X114164797Y-119052000D01*
X114164796Y-119051999D01*
X114083214Y-119052000D01*
X114012694Y-119058408D01*
X114012689Y-119058409D01*
X113850400Y-119108981D01*
X113704919Y-119196927D01*
X113584724Y-119317122D01*
X113496777Y-119462604D01*
X113446206Y-119624893D01*
X113439797Y-119695427D01*
X83030297Y-119695427D01*
X83030297Y-117456500D01*
X83049982Y-117389461D01*
X83102786Y-117343706D01*
X83154297Y-117332500D01*
X83398339Y-117332500D01*
X83417667Y-117328655D01*
X83494985Y-117313275D01*
X83591633Y-117294051D01*
X83608803Y-117286938D01*
X83656255Y-117277500D01*
X85442772Y-117277500D01*
X85442780Y-117277499D01*
X86227668Y-117277499D01*
X86227669Y-117277499D01*
X86287280Y-117271091D01*
X86422128Y-117220796D01*
X86537343Y-117134546D01*
X86623593Y-117019331D01*
X86673888Y-116884483D01*
X86680297Y-116824873D01*
X86680296Y-115729128D01*
X86673888Y-115669517D01*
X86623593Y-115534669D01*
X86623592Y-115534668D01*
X86623590Y-115534664D01*
X86537344Y-115419455D01*
X86537341Y-115419452D01*
X86422132Y-115333206D01*
X86422125Y-115333202D01*
X86287279Y-115282908D01*
X86287280Y-115282908D01*
X86227680Y-115276501D01*
X86227678Y-115276500D01*
X86227670Y-115276500D01*
X85428340Y-115276500D01*
X85428338Y-115276500D01*
X83256256Y-115276500D01*
X83256252Y-115276500D01*
X83159609Y-115295724D01*
X83062967Y-115314946D01*
X83062962Y-115314948D01*
X83050955Y-115319922D01*
X83045790Y-115322061D01*
X82998339Y-115331500D01*
X82331255Y-115331500D01*
X82283803Y-115322061D01*
X82266633Y-115314949D01*
X82266631Y-115314948D01*
X82266626Y-115314946D01*
X82169985Y-115295724D01*
X82073341Y-115276500D01*
X82073338Y-115276500D01*
X78631256Y-115276500D01*
X78631253Y-115276500D01*
X77831926Y-115276500D01*
X77831920Y-115276501D01*
X77772313Y-115282908D01*
X77637468Y-115333202D01*
X77637461Y-115333206D01*
X77522252Y-115419452D01*
X77522249Y-115419455D01*
X77436003Y-115534664D01*
X77435999Y-115534671D01*
X77385705Y-115669517D01*
X77379298Y-115729116D01*
X77379298Y-115729123D01*
X77379297Y-115729135D01*
X76314797Y-115729135D01*
X76314797Y-114346986D01*
X106054798Y-114346986D01*
X106065291Y-114449697D01*
X106120438Y-114616119D01*
X106120440Y-114616124D01*
X106212481Y-114765345D01*
X106336451Y-114889315D01*
X106485672Y-114981356D01*
X106485677Y-114981358D01*
X106652099Y-115036505D01*
X106652106Y-115036506D01*
X106754816Y-115046999D01*
X107179796Y-115046999D01*
X107679797Y-115046999D01*
X108104769Y-115046999D01*
X108104783Y-115046998D01*
X108207494Y-115036505D01*
X108373916Y-114981358D01*
X108373921Y-114981356D01*
X108523142Y-114889315D01*
X108647112Y-114765345D01*
X108739153Y-114616124D01*
X108739155Y-114616119D01*
X108794302Y-114449697D01*
X108794303Y-114449690D01*
X108804796Y-114346986D01*
X108804797Y-114346973D01*
X108804797Y-114172000D01*
X107679797Y-114172000D01*
X107679797Y-115046999D01*
X107179796Y-115046999D01*
X107179797Y-115046998D01*
X107179797Y-114172000D01*
X106054798Y-114172000D01*
X106054798Y-114346986D01*
X76314797Y-114346986D01*
X76314797Y-113124844D01*
X77379797Y-113124844D01*
X77386198Y-113184372D01*
X77386200Y-113184379D01*
X77436442Y-113319086D01*
X77436446Y-113319093D01*
X77522606Y-113434187D01*
X77522609Y-113434190D01*
X77637703Y-113520350D01*
X77637710Y-113520354D01*
X77772417Y-113570596D01*
X77772424Y-113570598D01*
X77831952Y-113576999D01*
X77831969Y-113577000D01*
X78479797Y-113577000D01*
X78979797Y-113577000D01*
X79627625Y-113577000D01*
X79627641Y-113576999D01*
X79687169Y-113570598D01*
X79687176Y-113570596D01*
X79821883Y-113520354D01*
X79821890Y-113520350D01*
X79936984Y-113434190D01*
X79936987Y-113434187D01*
X80023147Y-113319093D01*
X80023151Y-113319086D01*
X80073393Y-113184379D01*
X80073395Y-113184372D01*
X80079796Y-113124844D01*
X83979797Y-113124844D01*
X83986198Y-113184372D01*
X83986200Y-113184379D01*
X84036442Y-113319086D01*
X84036446Y-113319093D01*
X84122606Y-113434187D01*
X84122609Y-113434190D01*
X84237703Y-113520350D01*
X84237710Y-113520354D01*
X84372417Y-113570596D01*
X84372424Y-113570598D01*
X84431952Y-113576999D01*
X84431969Y-113577000D01*
X85079797Y-113577000D01*
X85579797Y-113577000D01*
X86227625Y-113577000D01*
X86227641Y-113576999D01*
X86287169Y-113570598D01*
X86287176Y-113570596D01*
X86421883Y-113520354D01*
X86421890Y-113520350D01*
X86536984Y-113434190D01*
X86536987Y-113434187D01*
X86623147Y-113319093D01*
X86623151Y-113319086D01*
X86673393Y-113184379D01*
X86673395Y-113184372D01*
X86679796Y-113124844D01*
X86679797Y-113124827D01*
X86679797Y-112827000D01*
X85579797Y-112827000D01*
X85579797Y-113577000D01*
X85079797Y-113577000D01*
X85079797Y-112827000D01*
X83979797Y-112827000D01*
X83979797Y-113124844D01*
X80079796Y-113124844D01*
X80079797Y-113124827D01*
X80079797Y-112827000D01*
X78979797Y-112827000D01*
X78979797Y-113577000D01*
X78479797Y-113577000D01*
X78479797Y-112827000D01*
X77379797Y-112827000D01*
X77379797Y-113124844D01*
X76314797Y-113124844D01*
X76314797Y-112029155D01*
X77379797Y-112029155D01*
X77379797Y-112327000D01*
X78479797Y-112327000D01*
X78979797Y-112327000D01*
X80079797Y-112327000D01*
X80079797Y-112029172D01*
X80079796Y-112029155D01*
X83979797Y-112029155D01*
X83979797Y-112327000D01*
X85079797Y-112327000D01*
X85579797Y-112327000D01*
X86679797Y-112327000D01*
X86679797Y-112029172D01*
X86679796Y-112029155D01*
X86673395Y-111969627D01*
X86673393Y-111969620D01*
X86623151Y-111834913D01*
X86623147Y-111834906D01*
X86536987Y-111719812D01*
X86536984Y-111719809D01*
X86421890Y-111633649D01*
X86421883Y-111633645D01*
X86287176Y-111583403D01*
X86287169Y-111583401D01*
X86227641Y-111577000D01*
X85579797Y-111577000D01*
X85579797Y-112327000D01*
X85079797Y-112327000D01*
X85079797Y-111577000D01*
X84431952Y-111577000D01*
X84372424Y-111583401D01*
X84372417Y-111583403D01*
X84237710Y-111633645D01*
X84237703Y-111633649D01*
X84122609Y-111719809D01*
X84122606Y-111719812D01*
X84036446Y-111834906D01*
X84036442Y-111834913D01*
X83986200Y-111969620D01*
X83986198Y-111969627D01*
X83979797Y-112029155D01*
X80079796Y-112029155D01*
X80073395Y-111969627D01*
X80073393Y-111969620D01*
X80023151Y-111834913D01*
X80023147Y-111834906D01*
X79936987Y-111719812D01*
X79936984Y-111719809D01*
X79821890Y-111633649D01*
X79821883Y-111633645D01*
X79687176Y-111583403D01*
X79687169Y-111583401D01*
X79627641Y-111577000D01*
X78979797Y-111577000D01*
X78979797Y-112327000D01*
X78479797Y-112327000D01*
X78479797Y-111577000D01*
X77831952Y-111577000D01*
X77772424Y-111583401D01*
X77772417Y-111583403D01*
X77637710Y-111633645D01*
X77637703Y-111633649D01*
X77522609Y-111719809D01*
X77522606Y-111719812D01*
X77436446Y-111834906D01*
X77436442Y-111834913D01*
X77386200Y-111969620D01*
X77386198Y-111969627D01*
X77379797Y-112029155D01*
X76314797Y-112029155D01*
X76314797Y-110696983D01*
X106054297Y-110696983D01*
X106054297Y-111547001D01*
X106054298Y-111547019D01*
X106064797Y-111649796D01*
X106064798Y-111649799D01*
X106119982Y-111816331D01*
X106119984Y-111816336D01*
X106154866Y-111872888D01*
X106212085Y-111965656D01*
X106336141Y-112089712D01*
X106485463Y-112181814D01*
X106485464Y-112181814D01*
X106491610Y-112185605D01*
X106490030Y-112188166D01*
X106532274Y-112225349D01*
X106551438Y-112292539D01*
X106545376Y-112329885D01*
X106544125Y-112333733D01*
X106544123Y-112333743D01*
X106524337Y-112522000D01*
X106544123Y-112710257D01*
X106544741Y-112712159D01*
X106545526Y-112714575D01*
X106545530Y-112714585D01*
X106547525Y-112784426D01*
X106511445Y-112844259D01*
X106491183Y-112857815D01*
X106491822Y-112858851D01*
X106336451Y-112954684D01*
X106212481Y-113078654D01*
X106120440Y-113227875D01*
X106120438Y-113227880D01*
X106065291Y-113394302D01*
X106065290Y-113394309D01*
X106054797Y-113497013D01*
X106054797Y-113672000D01*
X108804796Y-113672000D01*
X108804796Y-113497028D01*
X108804795Y-113497013D01*
X108794302Y-113394302D01*
X108739155Y-113227880D01*
X108739153Y-113227875D01*
X108647112Y-113078654D01*
X108523142Y-112954684D01*
X108367772Y-112858851D01*
X108369358Y-112856278D01*
X108327151Y-112819116D01*
X108307998Y-112751923D01*
X108314066Y-112714579D01*
X108315471Y-112710256D01*
X108335257Y-112522000D01*
X108315471Y-112333744D01*
X108314220Y-112329896D01*
X108314153Y-112327546D01*
X108314119Y-112327383D01*
X108314148Y-112327376D01*
X108312224Y-112260058D01*
X108348302Y-112200224D01*
X108368623Y-112186641D01*
X108367984Y-112185605D01*
X108374129Y-112181814D01*
X108374131Y-112181814D01*
X108523453Y-112089712D01*
X108647509Y-111965656D01*
X108739611Y-111816334D01*
X108794796Y-111649797D01*
X108805297Y-111547009D01*
X108805296Y-110696992D01*
X108794796Y-110594203D01*
X108739611Y-110427666D01*
X108647509Y-110278344D01*
X108523453Y-110154288D01*
X108410770Y-110084785D01*
X108374133Y-110062187D01*
X108374128Y-110062185D01*
X108372659Y-110061698D01*
X108207594Y-110007001D01*
X108207592Y-110007000D01*
X108104807Y-109996500D01*
X106754795Y-109996500D01*
X106754778Y-109996501D01*
X106652000Y-110007000D01*
X106651997Y-110007001D01*
X106485465Y-110062185D01*
X106485460Y-110062187D01*
X106336139Y-110154289D01*
X106212086Y-110278342D01*
X106119984Y-110427663D01*
X106119982Y-110427668D01*
X106092146Y-110511670D01*
X106064798Y-110594203D01*
X106064798Y-110594204D01*
X106064797Y-110594204D01*
X106054297Y-110696983D01*
X76314797Y-110696983D01*
X76314797Y-106672758D01*
X86962591Y-106672758D01*
X87263089Y-106973255D01*
X87263110Y-106973274D01*
X87343141Y-107038470D01*
X87343147Y-107038474D01*
X87499825Y-107117160D01*
X87670427Y-107157594D01*
X87845747Y-107157594D01*
X88016348Y-107117160D01*
X88173025Y-107038474D01*
X88253062Y-106973275D01*
X88253067Y-106973271D01*
X88376804Y-106849534D01*
X88376803Y-106849533D01*
X126482789Y-106849533D01*
X126482789Y-106849534D01*
X126606510Y-106973255D01*
X126606531Y-106973274D01*
X126686562Y-107038470D01*
X126686568Y-107038474D01*
X126843245Y-107117160D01*
X127013847Y-107157594D01*
X127189167Y-107157594D01*
X127359768Y-107117160D01*
X127516446Y-107038474D01*
X127596483Y-106973275D01*
X127596498Y-106973262D01*
X127897002Y-106672758D01*
X127897002Y-106672757D01*
X127278284Y-106054040D01*
X126482789Y-106849533D01*
X88376803Y-106849533D01*
X87581309Y-106054040D01*
X86962591Y-106672758D01*
X76314797Y-106672758D01*
X76314797Y-105436049D01*
X86124203Y-105436049D01*
X86124203Y-105611370D01*
X86164636Y-105781971D01*
X86243322Y-105938649D01*
X86308521Y-106018686D01*
X86308535Y-106018702D01*
X86609037Y-106319205D01*
X86609038Y-106319205D01*
X87227757Y-105700487D01*
X86432262Y-104904992D01*
X86308532Y-105028723D01*
X86308522Y-105028734D01*
X86243326Y-105108765D01*
X86243322Y-105108771D01*
X86164636Y-105265448D01*
X86124203Y-105436049D01*
X76314797Y-105436049D01*
X76314797Y-104551438D01*
X86785815Y-104551438D01*
X87581310Y-105346934D01*
X88730356Y-106495981D01*
X88854083Y-106372255D01*
X88854092Y-106372245D01*
X88919293Y-106292208D01*
X88919297Y-106292202D01*
X88997983Y-106135525D01*
X89038417Y-105964924D01*
X89038417Y-105789603D01*
X125821177Y-105789603D01*
X125821177Y-105964924D01*
X125861610Y-106135525D01*
X125940296Y-106292202D01*
X126005495Y-106372239D01*
X126005499Y-106372244D01*
X126129236Y-106495981D01*
X126924732Y-105700486D01*
X127631837Y-105700486D01*
X127631837Y-105700487D01*
X128250554Y-106319205D01*
X128551052Y-106018707D01*
X128551071Y-106018686D01*
X128616267Y-105938655D01*
X128616271Y-105938649D01*
X128694957Y-105781971D01*
X128735391Y-105611370D01*
X128735391Y-105436049D01*
X128694957Y-105265448D01*
X128616271Y-105108771D01*
X128551072Y-105028734D01*
X128551068Y-105028729D01*
X128427330Y-104904992D01*
X127631837Y-105700486D01*
X126924732Y-105700486D01*
X127278284Y-105346934D01*
X128073778Y-104551439D01*
X127950057Y-104427718D01*
X127950036Y-104427699D01*
X127870005Y-104362503D01*
X127869999Y-104362499D01*
X127713322Y-104283813D01*
X127542721Y-104243380D01*
X127367401Y-104243380D01*
X127196799Y-104283813D01*
X127040121Y-104362499D01*
X126960084Y-104427698D01*
X126960069Y-104427711D01*
X126005515Y-105382266D01*
X126005496Y-105382287D01*
X125940300Y-105462318D01*
X125940296Y-105462324D01*
X125861610Y-105619002D01*
X125821177Y-105789603D01*
X89038417Y-105789603D01*
X88997983Y-105619002D01*
X88919297Y-105462324D01*
X88854098Y-105382287D01*
X88854085Y-105382272D01*
X87899530Y-104427718D01*
X87899509Y-104427699D01*
X87819478Y-104362503D01*
X87819472Y-104362499D01*
X87662794Y-104283813D01*
X87492193Y-104243380D01*
X87316873Y-104243380D01*
X87146271Y-104283813D01*
X86989594Y-104362499D01*
X86909552Y-104427702D01*
X86909546Y-104427707D01*
X86785815Y-104551438D01*
X76314797Y-104551438D01*
X76314797Y-103456091D01*
X88103601Y-103456091D01*
X88103601Y-103631533D01*
X88144061Y-103802246D01*
X88144062Y-103802249D01*
X88222796Y-103959022D01*
X88222800Y-103959029D01*
X88244028Y-103985087D01*
X88288056Y-104039134D01*
X89242663Y-104993740D01*
X89242671Y-104993746D01*
X89242676Y-104993751D01*
X89322762Y-105058992D01*
X89322766Y-105058994D01*
X89322770Y-105058998D01*
X89322772Y-105058999D01*
X89322775Y-105059001D01*
X89479547Y-105137734D01*
X89479551Y-105137736D01*
X89650264Y-105178196D01*
X89650266Y-105178196D01*
X89825703Y-105178196D01*
X89825706Y-105178196D01*
X89996418Y-105137736D01*
X90153199Y-105058998D01*
X90233307Y-104993741D01*
X90834359Y-104392688D01*
X90899617Y-104312580D01*
X90978355Y-104155799D01*
X91018815Y-103985087D01*
X91018815Y-103809645D01*
X90980883Y-103649598D01*
X90984577Y-103579829D01*
X91009391Y-103538032D01*
X91017330Y-103529216D01*
X91111976Y-103365284D01*
X91170471Y-103185256D01*
X91190257Y-102997000D01*
X123669337Y-102997000D01*
X123689123Y-103185256D01*
X123689124Y-103185259D01*
X123747615Y-103365277D01*
X123747618Y-103365284D01*
X123842264Y-103529216D01*
X123846923Y-103534391D01*
X123850205Y-103538036D01*
X123880432Y-103601029D01*
X123878710Y-103649601D01*
X123840779Y-103809645D01*
X123840779Y-103985087D01*
X123881239Y-104155799D01*
X123881240Y-104155803D01*
X123959974Y-104312575D01*
X123959977Y-104312580D01*
X124025234Y-104392688D01*
X124626287Y-104993740D01*
X124669231Y-105028723D01*
X124706392Y-105058996D01*
X124706400Y-105059001D01*
X124863171Y-105137734D01*
X124863172Y-105137734D01*
X124863176Y-105137736D01*
X125033888Y-105178196D01*
X125033891Y-105178196D01*
X125209328Y-105178196D01*
X125209330Y-105178196D01*
X125380043Y-105137736D01*
X125536824Y-105058998D01*
X125616931Y-104993741D01*
X126571537Y-104039134D01*
X126636795Y-103959027D01*
X126715533Y-103802246D01*
X126755993Y-103631533D01*
X126755993Y-103456091D01*
X126715533Y-103285379D01*
X126715531Y-103285375D01*
X126715531Y-103285374D01*
X126636797Y-103128602D01*
X126636795Y-103128598D01*
X126571538Y-103048490D01*
X125970485Y-102447438D01*
X125930431Y-102414809D01*
X125890379Y-102382181D01*
X125890371Y-102382176D01*
X125733600Y-102303443D01*
X125711242Y-102298144D01*
X125562884Y-102262982D01*
X125387442Y-102262982D01*
X125268728Y-102291117D01*
X125223496Y-102301838D01*
X125153724Y-102298144D01*
X125122015Y-102281498D01*
X125027531Y-102212851D01*
X125027526Y-102212848D01*
X124854604Y-102135857D01*
X124854599Y-102135855D01*
X124708798Y-102104865D01*
X124669443Y-102096500D01*
X124480151Y-102096500D01*
X124447694Y-102103398D01*
X124294994Y-102135855D01*
X124294989Y-102135857D01*
X124122067Y-102212848D01*
X124122062Y-102212851D01*
X123968926Y-102324111D01*
X123842263Y-102464785D01*
X123747618Y-102628715D01*
X123747615Y-102628722D01*
X123689124Y-102808740D01*
X123689123Y-102808744D01*
X123669337Y-102997000D01*
X91190257Y-102997000D01*
X91170471Y-102808744D01*
X91111976Y-102628716D01*
X91017330Y-102464784D01*
X90890668Y-102324112D01*
X90890667Y-102324111D01*
X90737531Y-102212851D01*
X90737526Y-102212848D01*
X90564604Y-102135857D01*
X90564599Y-102135855D01*
X90418798Y-102104865D01*
X90379443Y-102096500D01*
X90190151Y-102096500D01*
X90157694Y-102103398D01*
X90004994Y-102135855D01*
X90004989Y-102135857D01*
X89832067Y-102212848D01*
X89832062Y-102212851D01*
X89737578Y-102281498D01*
X89671771Y-102304978D01*
X89636097Y-102301838D01*
X89620511Y-102298144D01*
X89472152Y-102262982D01*
X89296710Y-102262982D01*
X89161246Y-102295087D01*
X89125993Y-102303443D01*
X88969221Y-102382177D01*
X88969220Y-102382178D01*
X88969218Y-102382179D01*
X88969217Y-102382180D01*
X88969216Y-102382181D01*
X88889108Y-102447437D01*
X88889102Y-102447443D01*
X88288064Y-103048482D01*
X88288056Y-103048491D01*
X88222800Y-103128595D01*
X88222795Y-103128603D01*
X88144062Y-103285374D01*
X88144061Y-103285379D01*
X88103601Y-103456091D01*
X76314797Y-103456091D01*
X76314797Y-86526986D01*
X78234798Y-86526986D01*
X78245291Y-86629697D01*
X78300438Y-86796119D01*
X78300440Y-86796124D01*
X78392481Y-86945345D01*
X78516451Y-87069315D01*
X78665672Y-87161356D01*
X78665677Y-87161358D01*
X78832099Y-87216505D01*
X78832106Y-87216506D01*
X78934816Y-87226999D01*
X79109796Y-87226999D01*
X79609797Y-87226999D01*
X79784769Y-87226999D01*
X79784783Y-87226998D01*
X79887494Y-87216505D01*
X80053916Y-87161358D01*
X80053921Y-87161356D01*
X80203142Y-87069315D01*
X80327112Y-86945345D01*
X80419153Y-86796124D01*
X80419155Y-86796119D01*
X80474302Y-86629697D01*
X80474303Y-86629690D01*
X80484796Y-86526986D01*
X80484797Y-86526973D01*
X80484797Y-86102000D01*
X79609797Y-86102000D01*
X79609797Y-87226999D01*
X79109796Y-87226999D01*
X79109797Y-87226998D01*
X79109797Y-86102000D01*
X78234798Y-86102000D01*
X78234798Y-86526986D01*
X76314797Y-86526986D01*
X76314797Y-85852328D01*
X76314798Y-85851775D01*
X76317266Y-85298514D01*
X76317344Y-85294641D01*
X76321471Y-85179111D01*
X76321546Y-85177013D01*
X78234797Y-85177013D01*
X78234797Y-85602000D01*
X79109797Y-85602000D01*
X79609797Y-85602000D01*
X80484796Y-85602000D01*
X80484796Y-85177028D01*
X80484795Y-85177013D01*
X80484792Y-85176983D01*
X81034297Y-85176983D01*
X81034297Y-86527001D01*
X81034298Y-86527018D01*
X81044797Y-86629796D01*
X81044798Y-86629799D01*
X81099982Y-86796331D01*
X81099984Y-86796336D01*
X81134866Y-86852888D01*
X81192085Y-86945656D01*
X81316141Y-87069712D01*
X81465463Y-87161814D01*
X81632000Y-87216999D01*
X81734788Y-87227500D01*
X82584805Y-87227499D01*
X82584813Y-87227498D01*
X82584816Y-87227498D01*
X82641099Y-87221748D01*
X82687594Y-87216999D01*
X82854131Y-87161814D01*
X83003453Y-87069712D01*
X83127509Y-86945656D01*
X83210316Y-86811402D01*
X83262264Y-86764679D01*
X83315855Y-86752500D01*
X83394441Y-86752500D01*
X83394443Y-86752500D01*
X83579600Y-86713144D01*
X83752527Y-86636151D01*
X83905668Y-86524888D01*
X84032330Y-86384216D01*
X84126976Y-86220284D01*
X84185471Y-86040256D01*
X84205257Y-85852000D01*
X130654337Y-85852000D01*
X130674123Y-86040256D01*
X130674124Y-86040259D01*
X130732615Y-86220277D01*
X130732618Y-86220284D01*
X130827264Y-86384216D01*
X130953926Y-86524888D01*
X131107062Y-86636148D01*
X131107067Y-86636151D01*
X131279989Y-86713142D01*
X131279994Y-86713144D01*
X131465151Y-86752500D01*
X131543739Y-86752500D01*
X131610778Y-86772185D01*
X131649276Y-86811401D01*
X131732085Y-86945656D01*
X131856141Y-87069712D01*
X132005463Y-87161814D01*
X132172000Y-87216999D01*
X132274788Y-87227500D01*
X133124805Y-87227499D01*
X133124813Y-87227498D01*
X133124816Y-87227498D01*
X133181099Y-87221748D01*
X133227594Y-87216999D01*
X133394131Y-87161814D01*
X133543453Y-87069712D01*
X133667509Y-86945656D01*
X133759611Y-86796334D01*
X133814796Y-86629797D01*
X133825297Y-86527009D01*
X133825297Y-86526986D01*
X134374798Y-86526986D01*
X134385291Y-86629697D01*
X134440438Y-86796119D01*
X134440440Y-86796124D01*
X134532481Y-86945345D01*
X134656451Y-87069315D01*
X134805672Y-87161356D01*
X134805677Y-87161358D01*
X134972099Y-87216505D01*
X134972106Y-87216506D01*
X135074816Y-87226999D01*
X135249796Y-87226999D01*
X135749797Y-87226999D01*
X135924769Y-87226999D01*
X135924783Y-87226998D01*
X136027494Y-87216505D01*
X136193916Y-87161358D01*
X136193921Y-87161356D01*
X136343142Y-87069315D01*
X136467112Y-86945345D01*
X136559153Y-86796124D01*
X136559155Y-86796119D01*
X136614302Y-86629697D01*
X136614303Y-86629690D01*
X136624796Y-86526986D01*
X136624797Y-86526973D01*
X136624797Y-86102000D01*
X135749797Y-86102000D01*
X135749797Y-87226999D01*
X135249796Y-87226999D01*
X135249797Y-87226998D01*
X135249797Y-86102000D01*
X134374798Y-86102000D01*
X134374798Y-86526986D01*
X133825297Y-86526986D01*
X133825296Y-85177013D01*
X134374797Y-85177013D01*
X134374797Y-85602000D01*
X135249797Y-85602000D01*
X135749797Y-85602000D01*
X136624796Y-85602000D01*
X136624796Y-85177028D01*
X136624795Y-85177013D01*
X136614302Y-85074302D01*
X136559155Y-84907880D01*
X136559153Y-84907875D01*
X136467112Y-84758654D01*
X136343142Y-84634684D01*
X136193921Y-84542643D01*
X136193916Y-84542641D01*
X136027494Y-84487494D01*
X136027487Y-84487493D01*
X135924783Y-84477000D01*
X135749797Y-84477000D01*
X135749797Y-85602000D01*
X135249797Y-85602000D01*
X135249797Y-84477000D01*
X135074826Y-84477000D01*
X135074809Y-84477001D01*
X134972099Y-84487494D01*
X134805677Y-84542641D01*
X134805672Y-84542643D01*
X134656451Y-84634684D01*
X134532481Y-84758654D01*
X134440440Y-84907875D01*
X134440438Y-84907880D01*
X134385291Y-85074302D01*
X134385290Y-85074309D01*
X134374797Y-85177013D01*
X133825296Y-85177013D01*
X133825296Y-85176992D01*
X133814796Y-85074203D01*
X133759611Y-84907666D01*
X133667509Y-84758344D01*
X133543453Y-84634288D01*
X133394131Y-84542186D01*
X133227594Y-84487001D01*
X133227592Y-84487000D01*
X133124807Y-84476500D01*
X132274795Y-84476500D01*
X132274777Y-84476501D01*
X132172000Y-84487000D01*
X132171997Y-84487001D01*
X132005465Y-84542185D01*
X132005460Y-84542187D01*
X131856139Y-84634289D01*
X131732086Y-84758342D01*
X131649278Y-84892597D01*
X131597330Y-84939321D01*
X131543739Y-84951500D01*
X131465151Y-84951500D01*
X131432694Y-84958398D01*
X131279994Y-84990855D01*
X131279989Y-84990857D01*
X131107067Y-85067848D01*
X131107062Y-85067851D01*
X130953926Y-85179111D01*
X130827263Y-85319785D01*
X130732618Y-85483715D01*
X130732615Y-85483722D01*
X130674124Y-85663740D01*
X130674123Y-85663744D01*
X130654337Y-85852000D01*
X84205257Y-85852000D01*
X84185471Y-85663744D01*
X84126976Y-85483716D01*
X84032330Y-85319784D01*
X83905668Y-85179112D01*
X83902779Y-85177013D01*
X83752531Y-85067851D01*
X83752526Y-85067848D01*
X83579604Y-84990857D01*
X83579599Y-84990855D01*
X83433798Y-84959865D01*
X83394443Y-84951500D01*
X83394442Y-84951500D01*
X83315855Y-84951500D01*
X83248816Y-84931815D01*
X83210316Y-84892597D01*
X83127509Y-84758344D01*
X83003453Y-84634288D01*
X82854131Y-84542186D01*
X82687594Y-84487001D01*
X82687592Y-84487000D01*
X82584807Y-84476500D01*
X81734795Y-84476500D01*
X81734777Y-84476501D01*
X81632000Y-84487000D01*
X81631997Y-84487001D01*
X81465465Y-84542185D01*
X81465460Y-84542187D01*
X81316139Y-84634289D01*
X81192086Y-84758342D01*
X81099984Y-84907663D01*
X81099982Y-84907668D01*
X81085458Y-84951500D01*
X81044798Y-85074203D01*
X81044798Y-85074204D01*
X81044797Y-85074204D01*
X81034297Y-85176983D01*
X80484792Y-85176983D01*
X80474302Y-85074302D01*
X80419155Y-84907880D01*
X80419153Y-84907875D01*
X80327112Y-84758654D01*
X80203142Y-84634684D01*
X80053921Y-84542643D01*
X80053916Y-84542641D01*
X79887494Y-84487494D01*
X79887487Y-84487493D01*
X79784783Y-84477000D01*
X79609797Y-84477000D01*
X79609797Y-85602000D01*
X79109797Y-85602000D01*
X79109797Y-84477000D01*
X78934826Y-84477000D01*
X78934809Y-84477001D01*
X78832099Y-84487494D01*
X78665677Y-84542641D01*
X78665672Y-84542643D01*
X78516451Y-84634684D01*
X78392481Y-84758654D01*
X78300440Y-84907875D01*
X78300438Y-84907880D01*
X78245291Y-85074302D01*
X78245290Y-85074309D01*
X78234797Y-85177013D01*
X76321546Y-85177013D01*
X76356844Y-84188662D01*
X76357081Y-84184248D01*
X76436014Y-83080623D01*
X76436397Y-83076327D01*
X76554679Y-81976155D01*
X76555228Y-81971788D01*
X76712684Y-80876659D01*
X76713392Y-80872289D01*
X76909847Y-79783414D01*
X76910698Y-79779135D01*
X77145890Y-78697973D01*
X77146903Y-78693690D01*
X77420533Y-77621616D01*
X77421682Y-77617427D01*
X77733413Y-76555772D01*
X77734732Y-76551562D01*
X78084142Y-75501752D01*
X78085575Y-75497685D01*
X78472277Y-74460898D01*
X78473852Y-74456894D01*
X78897285Y-73434639D01*
X78899036Y-73430615D01*
X79358663Y-72424174D01*
X79360561Y-72420207D01*
X79855822Y-71430802D01*
X79857874Y-71426880D01*
X80388111Y-70455822D01*
X80390288Y-70451997D01*
X80954890Y-69500411D01*
X80957170Y-69496721D01*
X81555379Y-68565890D01*
X81557814Y-68562247D01*
X81897874Y-68072467D01*
X88103601Y-68072467D01*
X88103601Y-68247909D01*
X88144061Y-68418621D01*
X88144062Y-68418625D01*
X88222796Y-68575397D01*
X88222799Y-68575402D01*
X88288056Y-68655510D01*
X88889109Y-69256562D01*
X88940961Y-69298802D01*
X88969214Y-69321818D01*
X88969222Y-69321823D01*
X89125993Y-69400556D01*
X89125994Y-69400556D01*
X89125998Y-69400558D01*
X89296710Y-69441018D01*
X89296713Y-69441018D01*
X89472153Y-69441018D01*
X89550281Y-69422501D01*
X89636097Y-69402162D01*
X89705868Y-69405855D01*
X89737576Y-69422499D01*
X89763065Y-69441018D01*
X89832067Y-69491151D01*
X90004989Y-69568142D01*
X90004994Y-69568144D01*
X90190151Y-69607500D01*
X90190152Y-69607500D01*
X90379441Y-69607500D01*
X90379443Y-69607500D01*
X90564600Y-69568144D01*
X90737527Y-69491151D01*
X90890668Y-69379888D01*
X91017330Y-69239216D01*
X91111976Y-69075284D01*
X91170471Y-68895256D01*
X91190257Y-68707000D01*
X123669337Y-68707000D01*
X123689123Y-68895256D01*
X123689124Y-68895259D01*
X123747615Y-69075277D01*
X123747618Y-69075284D01*
X123842264Y-69239216D01*
X123916642Y-69321821D01*
X123968926Y-69379888D01*
X124122062Y-69491148D01*
X124122067Y-69491151D01*
X124294989Y-69568142D01*
X124294994Y-69568144D01*
X124480151Y-69607500D01*
X124480152Y-69607500D01*
X124669441Y-69607500D01*
X124669443Y-69607500D01*
X124854600Y-69568144D01*
X125027527Y-69491151D01*
X125122016Y-69422500D01*
X125187820Y-69399021D01*
X125223497Y-69402162D01*
X125387441Y-69441018D01*
X125387442Y-69441018D01*
X125562881Y-69441018D01*
X125562884Y-69441018D01*
X125733596Y-69400558D01*
X125890377Y-69321820D01*
X125970485Y-69256563D01*
X126571537Y-68655510D01*
X126636795Y-68575402D01*
X126715533Y-68418621D01*
X126755993Y-68247909D01*
X126755993Y-68072467D01*
X126715533Y-67901754D01*
X126636795Y-67744973D01*
X126636788Y-67744965D01*
X126587714Y-67684723D01*
X126571538Y-67664866D01*
X125616931Y-66710260D01*
X125616919Y-66710250D01*
X125616917Y-66710248D01*
X125536831Y-66645007D01*
X125536818Y-66644998D01*
X125380046Y-66566265D01*
X125380044Y-66566264D01*
X125380043Y-66566264D01*
X125209330Y-66525804D01*
X125033888Y-66525804D01*
X124898424Y-66557909D01*
X124863171Y-66566265D01*
X124706399Y-66644999D01*
X124706398Y-66645000D01*
X124706396Y-66645001D01*
X124706395Y-66645002D01*
X124706394Y-66645003D01*
X124626286Y-66710259D01*
X124626280Y-66710265D01*
X124025242Y-67311304D01*
X124025234Y-67311313D01*
X123959978Y-67391417D01*
X123959973Y-67391425D01*
X123881240Y-67548196D01*
X123881239Y-67548201D01*
X123840779Y-67718913D01*
X123840779Y-67894355D01*
X123842532Y-67901750D01*
X123878710Y-68054398D01*
X123875016Y-68124170D01*
X123850208Y-68165960D01*
X123842265Y-68174782D01*
X123842261Y-68174787D01*
X123747618Y-68338715D01*
X123747615Y-68338722D01*
X123689124Y-68518740D01*
X123689123Y-68518744D01*
X123669337Y-68707000D01*
X91190257Y-68707000D01*
X91170471Y-68518744D01*
X91111976Y-68338716D01*
X91017330Y-68174784D01*
X91009389Y-68165965D01*
X90979161Y-68102976D01*
X90980884Y-68054398D01*
X91018815Y-67894356D01*
X91018815Y-67718915D01*
X91018815Y-67718913D01*
X90978355Y-67548201D01*
X90978353Y-67548197D01*
X90978353Y-67548196D01*
X90899619Y-67391424D01*
X90899617Y-67391420D01*
X90834360Y-67311312D01*
X90233307Y-66710260D01*
X90190349Y-66675265D01*
X90153201Y-66645003D01*
X90153193Y-66644998D01*
X89996422Y-66566265D01*
X89996418Y-66566264D01*
X89825706Y-66525804D01*
X89650264Y-66525804D01*
X89479551Y-66566264D01*
X89479547Y-66566265D01*
X89322774Y-66644999D01*
X89322767Y-66645003D01*
X89242673Y-66710250D01*
X89242655Y-66710266D01*
X88288064Y-67664858D01*
X88288045Y-67664879D01*
X88222804Y-67744965D01*
X88222795Y-67744978D01*
X88144062Y-67901750D01*
X88144061Y-67901753D01*
X88144061Y-67901754D01*
X88103601Y-68072467D01*
X81897874Y-68072467D01*
X82188864Y-67653361D01*
X82191388Y-67649862D01*
X82563664Y-67152560D01*
X86785815Y-67152560D01*
X86909536Y-67276281D01*
X86909557Y-67276300D01*
X86989588Y-67341496D01*
X86989594Y-67341500D01*
X87146271Y-67420186D01*
X87316873Y-67460620D01*
X87492193Y-67460620D01*
X87662794Y-67420186D01*
X87819472Y-67341500D01*
X87899509Y-67276301D01*
X87899524Y-67276288D01*
X88854078Y-66321733D01*
X88854097Y-66321712D01*
X88919293Y-66241681D01*
X88919297Y-66241675D01*
X88997983Y-66084997D01*
X89038417Y-65914396D01*
X89038417Y-65739075D01*
X125821177Y-65739075D01*
X125821177Y-65914396D01*
X125861610Y-66084997D01*
X125940296Y-66241675D01*
X126005495Y-66321712D01*
X126005508Y-66321727D01*
X126960063Y-67276281D01*
X126960084Y-67276300D01*
X127040115Y-67341496D01*
X127040121Y-67341500D01*
X127196799Y-67420186D01*
X127367401Y-67460620D01*
X127542721Y-67460620D01*
X127713322Y-67420186D01*
X127869999Y-67341500D01*
X127950036Y-67276301D01*
X127950041Y-67276297D01*
X128073778Y-67152560D01*
X126924730Y-66003512D01*
X127631837Y-66003512D01*
X127631837Y-66003513D01*
X128427330Y-66799007D01*
X128551057Y-66675281D01*
X128551066Y-66675271D01*
X128616267Y-66595234D01*
X128616271Y-66595228D01*
X128694957Y-66438551D01*
X128735391Y-66267950D01*
X128735391Y-66092629D01*
X128694957Y-65922028D01*
X128616271Y-65765350D01*
X128551072Y-65685313D01*
X128551058Y-65685297D01*
X128250555Y-65384794D01*
X128250554Y-65384794D01*
X127631837Y-66003512D01*
X126924730Y-66003512D01*
X126129236Y-65208018D01*
X126005506Y-65331749D01*
X126005496Y-65331760D01*
X125940300Y-65411791D01*
X125940296Y-65411797D01*
X125861610Y-65568474D01*
X125821177Y-65739075D01*
X89038417Y-65739075D01*
X88997983Y-65568474D01*
X88919297Y-65411797D01*
X88854098Y-65331760D01*
X88854094Y-65331755D01*
X88730356Y-65208018D01*
X87581310Y-66357066D01*
X86785815Y-67152560D01*
X82563664Y-67152560D01*
X82854473Y-66764084D01*
X82857145Y-66760643D01*
X83395465Y-66092629D01*
X86124203Y-66092629D01*
X86124203Y-66267950D01*
X86164636Y-66438551D01*
X86243322Y-66595228D01*
X86308521Y-66675265D01*
X86308525Y-66675270D01*
X86432262Y-66799007D01*
X87227757Y-66003513D01*
X86609038Y-65384794D01*
X86308532Y-65685302D01*
X86308522Y-65685313D01*
X86243326Y-65765344D01*
X86243322Y-65765350D01*
X86164636Y-65922028D01*
X86124203Y-66092629D01*
X83395465Y-66092629D01*
X83551427Y-65899092D01*
X83554237Y-65895730D01*
X84278823Y-65059513D01*
X84281719Y-65056288D01*
X84305040Y-65031240D01*
X86962591Y-65031240D01*
X86962591Y-65031241D01*
X87581309Y-65649959D01*
X88376804Y-64854465D01*
X88376803Y-64854464D01*
X126482789Y-64854464D01*
X127278284Y-65649959D01*
X127897002Y-65031241D01*
X127897002Y-65031240D01*
X127596504Y-64730744D01*
X127596483Y-64730725D01*
X127516452Y-64665529D01*
X127516446Y-64665525D01*
X127359768Y-64586839D01*
X127189167Y-64546406D01*
X127013847Y-64546406D01*
X126843245Y-64586839D01*
X126686568Y-64665525D01*
X126606526Y-64730728D01*
X126606520Y-64730733D01*
X126482789Y-64854464D01*
X88376803Y-64854464D01*
X88253083Y-64730744D01*
X88253062Y-64730725D01*
X88173031Y-64665529D01*
X88173025Y-64665525D01*
X88016348Y-64586839D01*
X87845747Y-64546406D01*
X87670427Y-64546406D01*
X87499825Y-64586839D01*
X87343147Y-64665525D01*
X87263110Y-64730724D01*
X87263094Y-64730738D01*
X86962591Y-65031240D01*
X84305040Y-65031240D01*
X85035711Y-64246443D01*
X85038730Y-64243315D01*
X85821112Y-63460933D01*
X85824240Y-63457914D01*
X86634085Y-62703922D01*
X86637310Y-62701026D01*
X87473527Y-61976440D01*
X87476889Y-61973630D01*
X88338440Y-61279348D01*
X88341881Y-61276676D01*
X89227659Y-60613591D01*
X89231158Y-60611067D01*
X89885163Y-60156983D01*
X106054297Y-60156983D01*
X106054297Y-61007001D01*
X106054298Y-61007019D01*
X106064797Y-61109796D01*
X106064798Y-61109799D01*
X106119982Y-61276331D01*
X106119984Y-61276336D01*
X106154866Y-61332888D01*
X106212085Y-61425656D01*
X106336141Y-61549712D01*
X106466164Y-61629910D01*
X106512888Y-61681858D01*
X106524388Y-61722487D01*
X106544123Y-61910256D01*
X106544124Y-61910259D01*
X106602615Y-62090277D01*
X106602618Y-62090284D01*
X106697264Y-62254216D01*
X106823926Y-62394888D01*
X106977062Y-62506148D01*
X106977067Y-62506151D01*
X107149989Y-62583142D01*
X107149994Y-62583144D01*
X107335151Y-62622500D01*
X107335152Y-62622500D01*
X107524441Y-62622500D01*
X107524443Y-62622500D01*
X107709600Y-62583144D01*
X107882527Y-62506151D01*
X108035668Y-62394888D01*
X108162330Y-62254216D01*
X108256976Y-62090284D01*
X108315471Y-61910256D01*
X108335206Y-61722484D01*
X108361789Y-61657872D01*
X108393424Y-61629913D01*
X108523453Y-61549712D01*
X108647509Y-61425656D01*
X108739611Y-61276334D01*
X108794796Y-61109797D01*
X108805297Y-61007009D01*
X108805296Y-60156992D01*
X108794796Y-60054203D01*
X108739611Y-59887666D01*
X108647509Y-59738344D01*
X108523453Y-59614288D01*
X108374131Y-59522186D01*
X108207594Y-59467001D01*
X108207592Y-59467000D01*
X108104807Y-59456500D01*
X106754795Y-59456500D01*
X106754778Y-59456501D01*
X106652000Y-59467000D01*
X106651997Y-59467001D01*
X106485465Y-59522185D01*
X106485460Y-59522187D01*
X106336139Y-59614289D01*
X106212086Y-59738342D01*
X106119984Y-59887663D01*
X106119983Y-59887666D01*
X106064798Y-60054203D01*
X106064798Y-60054204D01*
X106064797Y-60054204D01*
X106054297Y-60156983D01*
X89885163Y-60156983D01*
X90140056Y-59980008D01*
X90143687Y-59977582D01*
X91074518Y-59379373D01*
X91078208Y-59377093D01*
X92029794Y-58812491D01*
X92033597Y-58810326D01*
X93004695Y-58280067D01*
X93008581Y-58278033D01*
X93150515Y-58206986D01*
X106054798Y-58206986D01*
X106065291Y-58309697D01*
X106120438Y-58476119D01*
X106120440Y-58476124D01*
X106212481Y-58625345D01*
X106336451Y-58749315D01*
X106485672Y-58841356D01*
X106485677Y-58841358D01*
X106652099Y-58896505D01*
X106652106Y-58896506D01*
X106754816Y-58906999D01*
X107179796Y-58906999D01*
X107679797Y-58906999D01*
X108104769Y-58906999D01*
X108104783Y-58906998D01*
X108207494Y-58896505D01*
X108373916Y-58841358D01*
X108373921Y-58841356D01*
X108523142Y-58749315D01*
X108647112Y-58625345D01*
X108739153Y-58476124D01*
X108739155Y-58476119D01*
X108794302Y-58309697D01*
X108794303Y-58309690D01*
X108804796Y-58206986D01*
X108804797Y-58206973D01*
X108804797Y-58032000D01*
X107679797Y-58032000D01*
X107679797Y-58906999D01*
X107179796Y-58906999D01*
X107179797Y-58906998D01*
X107179797Y-58032000D01*
X106054798Y-58032000D01*
X106054798Y-58206986D01*
X93150515Y-58206986D01*
X93998008Y-57782761D01*
X94001971Y-57780866D01*
X94930078Y-57357013D01*
X106054797Y-57357013D01*
X106054797Y-57532000D01*
X107179797Y-57532000D01*
X107679797Y-57532000D01*
X108804796Y-57532000D01*
X108804796Y-57357028D01*
X108804795Y-57357013D01*
X108794302Y-57254302D01*
X108739155Y-57087880D01*
X108739153Y-57087875D01*
X108647112Y-56938654D01*
X108523142Y-56814684D01*
X108373921Y-56722643D01*
X108373916Y-56722641D01*
X108207494Y-56667494D01*
X108207487Y-56667493D01*
X108104783Y-56657000D01*
X107679797Y-56657000D01*
X107679797Y-57532000D01*
X107179797Y-57532000D01*
X107179797Y-56657000D01*
X106754825Y-56657000D01*
X106754809Y-56657001D01*
X106652099Y-56667494D01*
X106485677Y-56722641D01*
X106485672Y-56722643D01*
X106336451Y-56814684D01*
X106212481Y-56938654D01*
X106120440Y-57087875D01*
X106120438Y-57087880D01*
X106065291Y-57254302D01*
X106065290Y-57254309D01*
X106054797Y-57357013D01*
X94930078Y-57357013D01*
X95008412Y-57321239D01*
X95012443Y-57319485D01*
X96034691Y-56896055D01*
X96038695Y-56894480D01*
X97075482Y-56507778D01*
X97079549Y-56506345D01*
X98129372Y-56156930D01*
X98133569Y-56155616D01*
X99195224Y-55843885D01*
X99199413Y-55842736D01*
X100271512Y-55569100D01*
X100275770Y-55568093D01*
X101356932Y-55332901D01*
X101361211Y-55332050D01*
X102450108Y-55135591D01*
X102454433Y-55134890D01*
X103549610Y-54977427D01*
X103553952Y-54976882D01*
X104654124Y-54858600D01*
X104658420Y-54858217D01*
X105762052Y-54779283D01*
X105766459Y-54779047D01*
X106872169Y-54739556D01*
X106876595Y-54739478D01*
X107982999Y-54739478D01*
X107987424Y-54739556D01*
G37*
%TD.AperFunction*%
%TD*%
M02*
