%TF.GenerationSoftware,KiCad,Pcbnew,8.0.5-8.0.5-0~ubuntu22.04.1*%
%TF.CreationDate,2024-09-21T22:00:18-05:00*%
%TF.ProjectId,Valpo Shield,56616c70-6f20-4536-9869-656c642e6b69,rev?*%
%TF.SameCoordinates,Original*%
%TF.FileFunction,Copper,L2,Bot*%
%TF.FilePolarity,Positive*%
%FSLAX46Y46*%
G04 Gerber Fmt 4.6, Leading zero omitted, Abs format (unit mm)*
G04 Created by KiCad (PCBNEW 8.0.5-8.0.5-0~ubuntu22.04.1) date 2024-09-21 22:00:18*
%MOMM*%
%LPD*%
G01*
G04 APERTURE LIST*
%TA.AperFunction,ViaPad*%
%ADD10C,0.800000*%
%TD*%
%TA.AperFunction,Conductor*%
%ADD11C,0.250000*%
%TD*%
%TA.AperFunction,Conductor*%
%ADD12C,1.000000*%
%TD*%
G04 APERTURE END LIST*
D10*
%TO.N,GND*%
X111784797Y-128397000D03*
X117589797Y-125767000D03*
X130289797Y-134567000D03*
X124574797Y-134567000D03*
X118859797Y-134567000D03*
X111784797Y-130937000D03*
X111784797Y-129667000D03*
X134099797Y-125767000D03*
%TO.N,Net-(D1-K)*%
X131559797Y-85852000D03*
X131559797Y-110617000D03*
%TO.N,Net-(D2-K)*%
X124574797Y-68707000D03*
X122034797Y-113157000D03*
%TO.N,Net-(D3-K)*%
X127749797Y-118237000D03*
X107429797Y-61722000D03*
%TO.N,Net-(D4-K)*%
X133464797Y-118237000D03*
X90284797Y-68707000D03*
%TO.N,Net-(D5-K)*%
X83299797Y-85852000D03*
X116954797Y-128397000D03*
%TO.N,Net-(D6-K)*%
X90284797Y-102997000D03*
X122669797Y-128397000D03*
%TO.N,Net-(D7-K)*%
X107429797Y-112522000D03*
X128384797Y-128397000D03*
%TO.N,Net-(D8-K)*%
X124574797Y-102997000D03*
X134099797Y-128397000D03*
%TO.N,VDD*%
X105524797Y-123952000D03*
X114414797Y-127762000D03*
X106794797Y-123952000D03*
%TD*%
D11*
%TO.N,GND*%
X111784797Y-128397000D02*
X111784797Y-129667000D01*
%TO.N,Net-(D1-K)*%
X131559797Y-110617000D02*
X131559797Y-85852000D01*
%TO.N,Net-(D2-K)*%
X126479797Y-70612000D02*
X124574797Y-68707000D01*
X126479797Y-102997000D02*
X126479797Y-70612000D01*
X122034797Y-107442000D02*
X126479797Y-102997000D01*
X122034797Y-113157000D02*
X122034797Y-107442000D01*
%TO.N,Net-(D3-K)*%
X132829797Y-113157000D02*
X132829797Y-75936695D01*
X127749797Y-118237000D02*
X132829797Y-113157000D01*
X132829797Y-75936695D02*
X118615102Y-61722000D01*
X118615102Y-61722000D02*
X107429797Y-61722000D01*
%TO.N,Net-(D4-K)*%
X118224797Y-59182000D02*
X99809797Y-59182000D01*
X134099797Y-117602000D02*
X134099797Y-75057000D01*
X134099797Y-75057000D02*
X118224797Y-59182000D01*
X133464797Y-118237000D02*
X134099797Y-117602000D01*
X99809797Y-59182000D02*
X90284797Y-68707000D01*
%TO.N,Net-(D5-K)*%
X83299797Y-114427000D02*
X83299797Y-85852000D01*
X91999797Y-123127000D02*
X83299797Y-114427000D01*
X109231523Y-125222000D02*
X107136523Y-123127000D01*
X107136523Y-123127000D02*
X91999797Y-123127000D01*
X116954797Y-128397000D02*
X113779797Y-125222000D01*
X113779797Y-125222000D02*
X109231523Y-125222000D01*
%TO.N,Net-(D6-K)*%
X109232919Y-124587000D02*
X107322919Y-122677000D01*
X93454797Y-122677000D02*
X90284797Y-119507000D01*
X90284797Y-119507000D02*
X90284797Y-102997000D01*
X118859797Y-124587000D02*
X109232919Y-124587000D01*
X107322919Y-122677000D02*
X93454797Y-122677000D01*
X122669797Y-128397000D02*
X118859797Y-124587000D01*
%TO.N,Net-(D7-K)*%
X116504797Y-122233396D02*
X116504797Y-114612000D01*
X118223401Y-123952000D02*
X116504797Y-122233396D01*
X128384797Y-128397000D02*
X123939797Y-123952000D01*
X114414797Y-112522000D02*
X107429797Y-112522000D01*
X123939797Y-123952000D02*
X118223401Y-123952000D01*
X116504797Y-114612000D02*
X114414797Y-112522000D01*
%TO.N,Net-(D8-K)*%
X134099797Y-128397000D02*
X129019797Y-123317000D01*
X117589797Y-122047000D02*
X117589797Y-109982000D01*
X117589797Y-109982000D02*
X124574797Y-102997000D01*
X129019797Y-123317000D02*
X118859797Y-123317000D01*
X118859797Y-123317000D02*
X117589797Y-122047000D01*
D12*
%TO.N,VDD*%
X114414797Y-127762000D02*
X113779797Y-127127000D01*
X113779797Y-127127000D02*
X109969797Y-127127000D01*
X109969797Y-127127000D02*
X106794797Y-123952000D01*
X106794797Y-123952000D02*
X105524797Y-123952000D01*
%TD*%
%TA.AperFunction,Conductor*%
%TO.N,GND*%
G36*
X107987424Y-54739556D02*
G01*
X109093131Y-54779047D01*
X109097544Y-54779283D01*
X110201168Y-54858216D01*
X110205474Y-54858601D01*
X111305634Y-54976881D01*
X111309990Y-54977428D01*
X112405151Y-55134889D01*
X112409494Y-55135592D01*
X113498371Y-55332048D01*
X113502672Y-55332904D01*
X114583811Y-55568091D01*
X114588094Y-55569103D01*
X115660166Y-55842733D01*
X115664383Y-55843890D01*
X116682969Y-56142974D01*
X116726010Y-56155612D01*
X116730236Y-56156935D01*
X117780027Y-56506339D01*
X117784129Y-56507785D01*
X118820879Y-56894473D01*
X118824921Y-56896063D01*
X119589561Y-57212788D01*
X119847150Y-57319485D01*
X119851209Y-57321252D01*
X120857596Y-57780854D01*
X120861589Y-57782764D01*
X121850994Y-58278025D01*
X121854916Y-58280077D01*
X122825974Y-58810314D01*
X122829820Y-58812504D01*
X123781359Y-59377078D01*
X123785100Y-59379389D01*
X124481884Y-59827185D01*
X124715869Y-59977558D01*
X124719549Y-59980017D01*
X125102961Y-60246224D01*
X125628408Y-60611048D01*
X125631960Y-60613610D01*
X126401639Y-61189785D01*
X126517684Y-61276655D01*
X126521180Y-61279370D01*
X127382686Y-61973616D01*
X127386083Y-61976455D01*
X127814292Y-62347500D01*
X128131659Y-62622500D01*
X128222249Y-62700996D01*
X128225542Y-62703954D01*
X129035324Y-63457887D01*
X129038509Y-63460961D01*
X129820835Y-64243287D01*
X129823909Y-64246472D01*
X130577842Y-65056254D01*
X130580800Y-65059547D01*
X131305341Y-65895713D01*
X131308180Y-65899110D01*
X132002426Y-66760616D01*
X132005141Y-66764112D01*
X132668172Y-67649817D01*
X132670755Y-67653399D01*
X132777055Y-67806500D01*
X133301779Y-68562247D01*
X133304238Y-68565927D01*
X133827339Y-69379888D01*
X133902391Y-69496670D01*
X133904718Y-69500437D01*
X134469292Y-70451976D01*
X134471482Y-70455822D01*
X135001719Y-71426880D01*
X135003771Y-71430802D01*
X135499032Y-72420207D01*
X135500942Y-72424200D01*
X135960544Y-73430587D01*
X135962311Y-73434646D01*
X136385717Y-74456836D01*
X136387334Y-74460946D01*
X136771508Y-75490954D01*
X136773998Y-75497631D01*
X136775468Y-75501802D01*
X136804004Y-75587540D01*
X137124861Y-76551562D01*
X137126184Y-76555786D01*
X137437899Y-77617387D01*
X137439070Y-77621656D01*
X137712690Y-78693690D01*
X137713708Y-78697998D01*
X137948888Y-79779104D01*
X137949752Y-79783445D01*
X138146201Y-80872289D01*
X138146909Y-80876659D01*
X138304365Y-81971788D01*
X138304917Y-81976180D01*
X138423190Y-83076271D01*
X138423584Y-83080680D01*
X138502512Y-84184248D01*
X138502749Y-84188668D01*
X138542249Y-85294641D01*
X138542327Y-85298514D01*
X138544796Y-85851775D01*
X138544797Y-85852328D01*
X138544797Y-139703000D01*
X138525112Y-139770039D01*
X138472308Y-139815794D01*
X138420797Y-139827000D01*
X76438797Y-139827000D01*
X76371758Y-139807315D01*
X76326003Y-139754511D01*
X76314797Y-139703000D01*
X76314797Y-85852328D01*
X76314798Y-85852000D01*
X82394337Y-85852000D01*
X82414123Y-86040256D01*
X82414124Y-86040259D01*
X82472615Y-86220277D01*
X82472618Y-86220284D01*
X82567264Y-86384216D01*
X82610569Y-86432310D01*
X82642447Y-86467715D01*
X82672677Y-86530706D01*
X82674297Y-86550687D01*
X82674297Y-114488611D01*
X82698332Y-114609444D01*
X82698337Y-114609461D01*
X82745482Y-114723280D01*
X82745487Y-114723289D01*
X82779711Y-114774507D01*
X82779712Y-114774509D01*
X82813938Y-114825733D01*
X82905383Y-114917178D01*
X82905405Y-114917198D01*
X91510813Y-123522606D01*
X91510842Y-123522637D01*
X91601061Y-123612856D01*
X91601064Y-123612858D01*
X91652287Y-123647084D01*
X91703511Y-123681312D01*
X91784004Y-123714652D01*
X91817345Y-123728463D01*
X91877768Y-123740481D01*
X91938190Y-123752500D01*
X91938191Y-123752500D01*
X104400297Y-123752500D01*
X104467336Y-123772185D01*
X104513091Y-123824989D01*
X104524297Y-123876500D01*
X104524297Y-124050541D01*
X104524297Y-124050543D01*
X104524296Y-124050543D01*
X104562744Y-124243829D01*
X104562747Y-124243839D01*
X104638161Y-124425907D01*
X104638168Y-124425920D01*
X104747657Y-124589781D01*
X104747660Y-124589785D01*
X104887011Y-124729136D01*
X104887015Y-124729139D01*
X105050876Y-124838628D01*
X105050889Y-124838635D01*
X105232957Y-124914049D01*
X105232962Y-124914051D01*
X105232966Y-124914051D01*
X105232967Y-124914052D01*
X105426253Y-124952500D01*
X105426256Y-124952500D01*
X106329015Y-124952500D01*
X106396054Y-124972185D01*
X106416696Y-124988819D01*
X109189532Y-127761655D01*
X109189561Y-127761686D01*
X109332014Y-127904139D01*
X109459427Y-127989273D01*
X109495883Y-128013632D01*
X109592945Y-128053836D01*
X109677961Y-128089051D01*
X109736595Y-128100714D01*
X109770260Y-128107410D01*
X109871253Y-128127500D01*
X109871256Y-128127500D01*
X109871257Y-128127500D01*
X110068337Y-128127500D01*
X113314015Y-128127500D01*
X113381054Y-128147185D01*
X113401696Y-128163819D01*
X113777012Y-128539137D01*
X113777016Y-128539140D01*
X113940876Y-128648628D01*
X113940882Y-128648631D01*
X113940883Y-128648632D01*
X114122962Y-128724052D01*
X114316252Y-128762500D01*
X114316255Y-128762501D01*
X114316257Y-128762501D01*
X114513340Y-128762501D01*
X114513341Y-128762500D01*
X114706633Y-128724052D01*
X114888712Y-128648632D01*
X115052579Y-128539140D01*
X115191937Y-128399782D01*
X115301429Y-128235915D01*
X115376849Y-128053836D01*
X115384847Y-128013628D01*
X115389692Y-127989273D01*
X115422077Y-127927362D01*
X115482793Y-127892788D01*
X115552562Y-127896527D01*
X115598990Y-127925783D01*
X116015835Y-128342628D01*
X116049320Y-128403951D01*
X116051475Y-128417347D01*
X116058936Y-128488338D01*
X116069123Y-128585256D01*
X116069124Y-128585259D01*
X116127615Y-128765277D01*
X116127618Y-128765284D01*
X116222264Y-128929216D01*
X116348926Y-129069888D01*
X116502062Y-129181148D01*
X116502067Y-129181151D01*
X116674989Y-129258142D01*
X116674994Y-129258144D01*
X116860151Y-129297500D01*
X116860152Y-129297500D01*
X117049441Y-129297500D01*
X117049443Y-129297500D01*
X117234600Y-129258144D01*
X117407527Y-129181151D01*
X117560668Y-129069888D01*
X117687330Y-128929216D01*
X117781976Y-128765284D01*
X117840471Y-128585256D01*
X117860257Y-128397000D01*
X117840471Y-128208744D01*
X117781976Y-128028716D01*
X117687330Y-127864784D01*
X117560668Y-127724112D01*
X117560667Y-127724111D01*
X117407531Y-127612851D01*
X117407526Y-127612848D01*
X117234604Y-127535857D01*
X117234599Y-127535855D01*
X117088798Y-127504865D01*
X117049443Y-127496500D01*
X117049442Y-127496500D01*
X116990249Y-127496500D01*
X116923210Y-127476815D01*
X116902568Y-127460181D01*
X114866568Y-125424181D01*
X114833083Y-125362858D01*
X114838067Y-125293166D01*
X114879939Y-125237233D01*
X114945403Y-125212816D01*
X114954249Y-125212500D01*
X118549345Y-125212500D01*
X118616384Y-125232185D01*
X118637026Y-125248819D01*
X121730835Y-128342629D01*
X121764320Y-128403952D01*
X121766475Y-128417348D01*
X121774765Y-128496227D01*
X121784123Y-128585256D01*
X121784124Y-128585259D01*
X121842615Y-128765277D01*
X121842618Y-128765284D01*
X121937264Y-128929216D01*
X122063926Y-129069888D01*
X122217062Y-129181148D01*
X122217067Y-129181151D01*
X122389989Y-129258142D01*
X122389994Y-129258144D01*
X122575151Y-129297500D01*
X122575152Y-129297500D01*
X122764441Y-129297500D01*
X122764443Y-129297500D01*
X122949600Y-129258144D01*
X123122527Y-129181151D01*
X123275668Y-129069888D01*
X123402330Y-128929216D01*
X123496976Y-128765284D01*
X123555471Y-128585256D01*
X123575257Y-128397000D01*
X123555471Y-128208744D01*
X123496976Y-128028716D01*
X123402330Y-127864784D01*
X123275668Y-127724112D01*
X123275667Y-127724111D01*
X123122531Y-127612851D01*
X123122526Y-127612848D01*
X122949604Y-127535857D01*
X122949599Y-127535855D01*
X122803798Y-127504865D01*
X122764443Y-127496500D01*
X122764442Y-127496500D01*
X122705250Y-127496500D01*
X122638211Y-127476815D01*
X122617569Y-127460181D01*
X121283572Y-126126184D01*
X119946567Y-124789180D01*
X119913083Y-124727858D01*
X119918067Y-124658166D01*
X119959939Y-124602233D01*
X120025403Y-124577816D01*
X120034249Y-124577500D01*
X123629345Y-124577500D01*
X123696384Y-124597185D01*
X123717026Y-124613819D01*
X127445835Y-128342628D01*
X127479320Y-128403951D01*
X127481475Y-128417347D01*
X127488936Y-128488338D01*
X127499123Y-128585256D01*
X127499124Y-128585259D01*
X127557615Y-128765277D01*
X127557618Y-128765284D01*
X127652264Y-128929216D01*
X127778926Y-129069888D01*
X127932062Y-129181148D01*
X127932067Y-129181151D01*
X128104989Y-129258142D01*
X128104994Y-129258144D01*
X128290151Y-129297500D01*
X128290152Y-129297500D01*
X128479441Y-129297500D01*
X128479443Y-129297500D01*
X128664600Y-129258144D01*
X128837527Y-129181151D01*
X128990668Y-129069888D01*
X129117330Y-128929216D01*
X129211976Y-128765284D01*
X129270471Y-128585256D01*
X129290257Y-128397000D01*
X129270471Y-128208744D01*
X129211976Y-128028716D01*
X129117330Y-127864784D01*
X128990668Y-127724112D01*
X128990667Y-127724111D01*
X128837531Y-127612851D01*
X128837526Y-127612848D01*
X128664604Y-127535857D01*
X128664599Y-127535855D01*
X128518798Y-127504865D01*
X128479443Y-127496500D01*
X128479442Y-127496500D01*
X128420249Y-127496500D01*
X128353210Y-127476815D01*
X128332568Y-127460181D01*
X125026568Y-124154181D01*
X124993083Y-124092858D01*
X124998067Y-124023166D01*
X125039939Y-123967233D01*
X125105403Y-123942816D01*
X125114249Y-123942500D01*
X128709345Y-123942500D01*
X128776384Y-123962185D01*
X128797026Y-123978819D01*
X133160835Y-128342628D01*
X133194320Y-128403951D01*
X133196475Y-128417347D01*
X133203936Y-128488338D01*
X133214123Y-128585256D01*
X133214124Y-128585259D01*
X133272615Y-128765277D01*
X133272618Y-128765284D01*
X133367264Y-128929216D01*
X133493926Y-129069888D01*
X133647062Y-129181148D01*
X133647067Y-129181151D01*
X133819989Y-129258142D01*
X133819994Y-129258144D01*
X134005151Y-129297500D01*
X134005152Y-129297500D01*
X134194441Y-129297500D01*
X134194443Y-129297500D01*
X134379600Y-129258144D01*
X134552527Y-129181151D01*
X134705668Y-129069888D01*
X134832330Y-128929216D01*
X134926976Y-128765284D01*
X134985471Y-128585256D01*
X135005257Y-128397000D01*
X134985471Y-128208744D01*
X134926976Y-128028716D01*
X134832330Y-127864784D01*
X134705668Y-127724112D01*
X134705667Y-127724111D01*
X134552531Y-127612851D01*
X134552526Y-127612848D01*
X134379604Y-127535857D01*
X134379599Y-127535855D01*
X134233798Y-127504865D01*
X134194443Y-127496500D01*
X134194442Y-127496500D01*
X134135249Y-127496500D01*
X134068210Y-127476815D01*
X134047568Y-127460181D01*
X129509995Y-122922608D01*
X129509975Y-122922586D01*
X129418532Y-122831143D01*
X129396667Y-122816533D01*
X129353525Y-122787707D01*
X129353526Y-122787707D01*
X129353524Y-122787705D01*
X129316087Y-122762690D01*
X129316083Y-122762688D01*
X129232982Y-122728267D01*
X129232980Y-122728265D01*
X129202252Y-122715538D01*
X129202250Y-122715537D01*
X129202249Y-122715537D01*
X129141826Y-122703518D01*
X129081407Y-122691500D01*
X129081404Y-122691500D01*
X129081403Y-122691500D01*
X119170249Y-122691500D01*
X119103210Y-122671815D01*
X119082568Y-122655181D01*
X118251616Y-121824229D01*
X118218131Y-121762906D01*
X118215297Y-121736548D01*
X118215297Y-110292452D01*
X118234982Y-110225413D01*
X118251616Y-110204771D01*
X121203011Y-107253376D01*
X121264334Y-107219891D01*
X121334026Y-107224875D01*
X121389959Y-107266747D01*
X121414376Y-107332211D01*
X121412310Y-107365247D01*
X121409297Y-107380395D01*
X121409297Y-112458312D01*
X121389612Y-112525351D01*
X121377447Y-112541284D01*
X121302263Y-112624784D01*
X121207618Y-112788715D01*
X121207615Y-112788722D01*
X121149124Y-112968740D01*
X121149123Y-112968744D01*
X121129337Y-113157000D01*
X121149123Y-113345256D01*
X121149124Y-113345259D01*
X121207615Y-113525277D01*
X121207618Y-113525284D01*
X121302264Y-113689216D01*
X121428926Y-113829888D01*
X121582062Y-113941148D01*
X121582067Y-113941151D01*
X121754989Y-114018142D01*
X121754994Y-114018144D01*
X121940151Y-114057500D01*
X121940152Y-114057500D01*
X122129441Y-114057500D01*
X122129443Y-114057500D01*
X122314600Y-114018144D01*
X122487527Y-113941151D01*
X122640668Y-113829888D01*
X122767330Y-113689216D01*
X122861976Y-113525284D01*
X122920471Y-113345256D01*
X122940257Y-113157000D01*
X122920471Y-112968744D01*
X122861976Y-112788716D01*
X122767330Y-112624784D01*
X122692147Y-112541284D01*
X122661917Y-112478292D01*
X122660297Y-112458312D01*
X122660297Y-107752451D01*
X122679982Y-107685412D01*
X122696611Y-107664775D01*
X126878526Y-103482860D01*
X126878530Y-103482858D01*
X126965655Y-103395733D01*
X127034108Y-103293286D01*
X127081260Y-103179452D01*
X127105297Y-103058606D01*
X127105297Y-71396147D01*
X127124982Y-71329108D01*
X127177786Y-71283353D01*
X127246944Y-71273409D01*
X127310500Y-71302434D01*
X127316978Y-71308466D01*
X132167978Y-76159466D01*
X132201463Y-76220789D01*
X132204297Y-76247147D01*
X132204297Y-84963814D01*
X132184612Y-85030853D01*
X132131808Y-85076608D01*
X132062650Y-85086552D01*
X132019369Y-85069005D01*
X132018160Y-85071101D01*
X132012526Y-85067848D01*
X131839604Y-84990857D01*
X131839599Y-84990855D01*
X131693798Y-84959865D01*
X131654443Y-84951500D01*
X131465151Y-84951500D01*
X131432694Y-84958398D01*
X131279994Y-84990855D01*
X131279989Y-84990857D01*
X131107067Y-85067848D01*
X131107062Y-85067851D01*
X130953926Y-85179111D01*
X130827263Y-85319785D01*
X130732618Y-85483715D01*
X130732615Y-85483722D01*
X130674124Y-85663740D01*
X130674123Y-85663744D01*
X130654337Y-85852000D01*
X130674123Y-86040256D01*
X130674124Y-86040259D01*
X130732615Y-86220277D01*
X130732618Y-86220284D01*
X130827264Y-86384216D01*
X130870569Y-86432310D01*
X130902447Y-86467715D01*
X130932677Y-86530706D01*
X130934297Y-86550687D01*
X130934297Y-109918312D01*
X130914612Y-109985351D01*
X130902447Y-110001284D01*
X130827263Y-110084784D01*
X130732618Y-110248715D01*
X130732615Y-110248722D01*
X130674124Y-110428740D01*
X130674123Y-110428744D01*
X130654337Y-110617000D01*
X130674123Y-110805256D01*
X130674124Y-110805259D01*
X130732615Y-110985277D01*
X130732618Y-110985284D01*
X130827264Y-111149216D01*
X130915297Y-111246986D01*
X130953926Y-111289888D01*
X131107062Y-111401148D01*
X131107067Y-111401151D01*
X131279989Y-111478142D01*
X131279994Y-111478144D01*
X131465151Y-111517500D01*
X131465152Y-111517500D01*
X131654441Y-111517500D01*
X131654443Y-111517500D01*
X131839600Y-111478144D01*
X132012527Y-111401151D01*
X132012530Y-111401148D01*
X132018160Y-111397899D01*
X132019701Y-111400569D01*
X132072745Y-111381415D01*
X132140859Y-111396980D01*
X132189745Y-111446900D01*
X132204297Y-111505185D01*
X132204297Y-112846548D01*
X132184612Y-112913587D01*
X132167978Y-112934229D01*
X127802026Y-117300181D01*
X127740703Y-117333666D01*
X127714345Y-117336500D01*
X127655151Y-117336500D01*
X127622694Y-117343398D01*
X127469994Y-117375855D01*
X127469989Y-117375857D01*
X127297067Y-117452848D01*
X127297062Y-117452851D01*
X127143926Y-117564111D01*
X127017263Y-117704785D01*
X126922618Y-117868715D01*
X126922615Y-117868722D01*
X126864124Y-118048740D01*
X126864123Y-118048744D01*
X126844337Y-118237000D01*
X126864123Y-118425256D01*
X126864124Y-118425259D01*
X126922615Y-118605277D01*
X126922618Y-118605284D01*
X127017264Y-118769216D01*
X127143926Y-118909888D01*
X127297062Y-119021148D01*
X127297067Y-119021151D01*
X127469989Y-119098142D01*
X127469994Y-119098144D01*
X127655151Y-119137500D01*
X127655152Y-119137500D01*
X127844441Y-119137500D01*
X127844443Y-119137500D01*
X128029600Y-119098144D01*
X128202527Y-119021151D01*
X128355668Y-118909888D01*
X128482330Y-118769216D01*
X128576976Y-118605284D01*
X128635471Y-118425256D01*
X128653118Y-118257345D01*
X128679702Y-118192732D01*
X128688749Y-118182636D01*
X133221461Y-113649925D01*
X133221468Y-113649919D01*
X133228528Y-113642858D01*
X133228530Y-113642858D01*
X133262616Y-113608772D01*
X133323939Y-113575287D01*
X133393631Y-113580271D01*
X133449564Y-113622143D01*
X133473981Y-113687607D01*
X133474297Y-113696453D01*
X133474297Y-117213950D01*
X133454612Y-117280989D01*
X133401808Y-117326744D01*
X133376078Y-117335240D01*
X133184994Y-117375855D01*
X133184989Y-117375857D01*
X133012067Y-117452848D01*
X133012062Y-117452851D01*
X132858926Y-117564111D01*
X132732263Y-117704785D01*
X132637618Y-117868715D01*
X132637615Y-117868722D01*
X132579124Y-118048740D01*
X132579123Y-118048744D01*
X132559337Y-118237000D01*
X132579123Y-118425256D01*
X132579124Y-118425259D01*
X132637615Y-118605277D01*
X132637618Y-118605284D01*
X132732264Y-118769216D01*
X132858926Y-118909888D01*
X133012062Y-119021148D01*
X133012067Y-119021151D01*
X133184989Y-119098142D01*
X133184994Y-119098144D01*
X133370151Y-119137500D01*
X133370152Y-119137500D01*
X133559441Y-119137500D01*
X133559443Y-119137500D01*
X133744600Y-119098144D01*
X133917527Y-119021151D01*
X134070668Y-118909888D01*
X134197330Y-118769216D01*
X134291976Y-118605284D01*
X134350471Y-118425256D01*
X134368118Y-118257344D01*
X134394701Y-118192734D01*
X134403738Y-118182648D01*
X134585655Y-118000733D01*
X134654109Y-117898285D01*
X134701260Y-117784451D01*
X134725298Y-117663606D01*
X134725298Y-117540393D01*
X134725298Y-117535283D01*
X134725297Y-117535257D01*
X134725297Y-74995393D01*
X134725296Y-74995389D01*
X134701261Y-74874555D01*
X134701260Y-74874548D01*
X134654108Y-74760714D01*
X134654107Y-74760713D01*
X134654104Y-74760707D01*
X134585655Y-74658267D01*
X134585652Y-74658263D01*
X134495434Y-74568045D01*
X134495403Y-74568016D01*
X118714995Y-58787608D01*
X118714975Y-58787586D01*
X118623530Y-58696141D01*
X118572306Y-58661915D01*
X118521083Y-58627688D01*
X118521080Y-58627686D01*
X118521077Y-58627685D01*
X118440589Y-58594347D01*
X118407250Y-58580537D01*
X118397224Y-58578543D01*
X118346826Y-58568518D01*
X118286407Y-58556500D01*
X118286404Y-58556500D01*
X118286403Y-58556500D01*
X99871404Y-58556500D01*
X99748190Y-58556500D01*
X99748186Y-58556500D01*
X99687768Y-58568518D01*
X99644540Y-58577116D01*
X99627343Y-58580537D01*
X99513513Y-58627687D01*
X99513504Y-58627692D01*
X99411065Y-58696140D01*
X99367502Y-58739703D01*
X99323939Y-58783267D01*
X99323936Y-58783270D01*
X90337026Y-67770181D01*
X90275703Y-67803666D01*
X90249345Y-67806500D01*
X90190151Y-67806500D01*
X90157694Y-67813398D01*
X90004994Y-67845855D01*
X90004989Y-67845857D01*
X89832067Y-67922848D01*
X89832062Y-67922851D01*
X89678926Y-68034111D01*
X89552263Y-68174785D01*
X89457618Y-68338715D01*
X89457615Y-68338722D01*
X89399124Y-68518740D01*
X89399123Y-68518744D01*
X89379337Y-68707000D01*
X89399123Y-68895256D01*
X89399124Y-68895259D01*
X89457615Y-69075277D01*
X89457618Y-69075284D01*
X89552264Y-69239216D01*
X89678926Y-69379888D01*
X89832062Y-69491148D01*
X89832067Y-69491151D01*
X90004989Y-69568142D01*
X90004994Y-69568144D01*
X90190151Y-69607500D01*
X90190152Y-69607500D01*
X90379441Y-69607500D01*
X90379443Y-69607500D01*
X90564600Y-69568144D01*
X90737527Y-69491151D01*
X90890668Y-69379888D01*
X91017330Y-69239216D01*
X91111976Y-69075284D01*
X91170471Y-68895256D01*
X91188118Y-68727345D01*
X91214702Y-68662732D01*
X91223749Y-68652636D01*
X100032568Y-59843819D01*
X100093891Y-59810334D01*
X100120249Y-59807500D01*
X117914345Y-59807500D01*
X117981384Y-59827185D01*
X118002026Y-59843819D01*
X133437978Y-75279771D01*
X133471463Y-75341094D01*
X133474297Y-75367452D01*
X133474297Y-75397241D01*
X133454612Y-75464280D01*
X133401808Y-75510035D01*
X133332650Y-75519979D01*
X133269094Y-75490954D01*
X133262617Y-75484924D01*
X133228530Y-75450837D01*
X133228529Y-75450836D01*
X119100962Y-61323269D01*
X119100960Y-61323267D01*
X119013835Y-61236142D01*
X119013834Y-61236141D01*
X119013833Y-61236140D01*
X118962611Y-61201915D01*
X118911388Y-61167688D01*
X118911385Y-61167686D01*
X118911382Y-61167685D01*
X118830894Y-61134347D01*
X118797555Y-61120537D01*
X118787529Y-61118543D01*
X118737131Y-61108518D01*
X118676712Y-61096500D01*
X118676709Y-61096500D01*
X118676708Y-61096500D01*
X108133545Y-61096500D01*
X108066506Y-61076815D01*
X108041397Y-61055474D01*
X108035670Y-61049114D01*
X108035666Y-61049110D01*
X107882531Y-60937851D01*
X107882526Y-60937848D01*
X107709604Y-60860857D01*
X107709599Y-60860855D01*
X107563798Y-60829865D01*
X107524443Y-60821500D01*
X107335151Y-60821500D01*
X107302694Y-60828398D01*
X107149994Y-60860855D01*
X107149989Y-60860857D01*
X106977067Y-60937848D01*
X106977062Y-60937851D01*
X106823926Y-61049111D01*
X106697263Y-61189785D01*
X106602618Y-61353715D01*
X106602615Y-61353722D01*
X106544124Y-61533740D01*
X106544123Y-61533744D01*
X106524337Y-61722000D01*
X106544123Y-61910256D01*
X106544124Y-61910259D01*
X106602615Y-62090277D01*
X106602618Y-62090284D01*
X106697264Y-62254216D01*
X106798982Y-62367185D01*
X106823926Y-62394888D01*
X106977062Y-62506148D01*
X106977067Y-62506151D01*
X107149989Y-62583142D01*
X107149994Y-62583144D01*
X107335151Y-62622500D01*
X107335152Y-62622500D01*
X107524441Y-62622500D01*
X107524443Y-62622500D01*
X107709600Y-62583144D01*
X107882527Y-62506151D01*
X108035668Y-62394888D01*
X108038585Y-62391647D01*
X108041397Y-62388526D01*
X108100884Y-62351879D01*
X108133545Y-62347500D01*
X118304650Y-62347500D01*
X118371689Y-62367185D01*
X118392331Y-62383819D01*
X123920637Y-67912125D01*
X123954122Y-67973448D01*
X123949138Y-68043140D01*
X123925106Y-68082778D01*
X123842263Y-68174784D01*
X123747618Y-68338715D01*
X123747615Y-68338722D01*
X123689124Y-68518740D01*
X123689123Y-68518744D01*
X123669337Y-68707000D01*
X123689123Y-68895256D01*
X123689124Y-68895259D01*
X123747615Y-69075277D01*
X123747618Y-69075284D01*
X123842264Y-69239216D01*
X123968926Y-69379888D01*
X124122062Y-69491148D01*
X124122067Y-69491151D01*
X124294989Y-69568142D01*
X124294994Y-69568144D01*
X124480151Y-69607500D01*
X124539345Y-69607500D01*
X124606384Y-69627185D01*
X124627026Y-69643819D01*
X125817978Y-70834771D01*
X125851463Y-70896094D01*
X125854297Y-70922452D01*
X125854297Y-102686547D01*
X125834612Y-102753586D01*
X125817978Y-102774229D01*
X125675016Y-102917190D01*
X125613693Y-102950674D01*
X125544001Y-102945690D01*
X125488068Y-102903818D01*
X125464015Y-102842471D01*
X125460471Y-102808744D01*
X125440972Y-102748734D01*
X125401978Y-102628722D01*
X125401977Y-102628721D01*
X125401976Y-102628716D01*
X125307330Y-102464784D01*
X125180668Y-102324112D01*
X125180667Y-102324111D01*
X125027531Y-102212851D01*
X125027526Y-102212848D01*
X124854604Y-102135857D01*
X124854599Y-102135855D01*
X124708798Y-102104865D01*
X124669443Y-102096500D01*
X124480151Y-102096500D01*
X124447694Y-102103398D01*
X124294994Y-102135855D01*
X124294989Y-102135857D01*
X124122067Y-102212848D01*
X124122062Y-102212851D01*
X123968926Y-102324111D01*
X123842263Y-102464785D01*
X123747618Y-102628715D01*
X123747615Y-102628722D01*
X123689124Y-102808740D01*
X123689123Y-102808744D01*
X123685579Y-102842467D01*
X123671476Y-102976649D01*
X123644891Y-103041263D01*
X123635836Y-103051368D01*
X117191066Y-109496140D01*
X117103941Y-109583264D01*
X117103935Y-109583272D01*
X117035487Y-109685708D01*
X117035485Y-109685713D01*
X116988337Y-109799538D01*
X116988335Y-109799545D01*
X116965075Y-109916487D01*
X116965071Y-109916503D01*
X116964297Y-109920388D01*
X116964297Y-113887547D01*
X116944612Y-113954586D01*
X116891808Y-114000341D01*
X116822650Y-114010285D01*
X116759094Y-113981260D01*
X116752616Y-113975228D01*
X114907725Y-112130338D01*
X114907722Y-112130334D01*
X114907722Y-112130335D01*
X114900655Y-112123268D01*
X114900655Y-112123267D01*
X114813530Y-112036142D01*
X114813529Y-112036141D01*
X114813528Y-112036140D01*
X114762306Y-112001915D01*
X114711083Y-111967688D01*
X114711080Y-111967686D01*
X114711077Y-111967685D01*
X114630589Y-111934347D01*
X114597250Y-111920537D01*
X114587224Y-111918543D01*
X114536826Y-111908518D01*
X114476407Y-111896500D01*
X114476404Y-111896500D01*
X114476403Y-111896500D01*
X108133545Y-111896500D01*
X108066506Y-111876815D01*
X108041397Y-111855474D01*
X108035670Y-111849114D01*
X108035666Y-111849110D01*
X107882531Y-111737851D01*
X107882526Y-111737848D01*
X107709604Y-111660857D01*
X107709599Y-111660855D01*
X107563798Y-111629865D01*
X107524443Y-111621500D01*
X107335151Y-111621500D01*
X107302694Y-111628398D01*
X107149994Y-111660855D01*
X107149989Y-111660857D01*
X106977067Y-111737848D01*
X106977062Y-111737851D01*
X106823926Y-111849111D01*
X106697263Y-111989785D01*
X106602618Y-112153715D01*
X106602615Y-112153722D01*
X106544124Y-112333740D01*
X106544123Y-112333744D01*
X106524337Y-112522000D01*
X106544123Y-112710256D01*
X106544124Y-112710259D01*
X106602615Y-112890277D01*
X106602618Y-112890284D01*
X106697264Y-113054216D01*
X106798982Y-113167185D01*
X106823926Y-113194888D01*
X106977062Y-113306148D01*
X106977067Y-113306151D01*
X107149989Y-113383142D01*
X107149994Y-113383144D01*
X107335151Y-113422500D01*
X107335152Y-113422500D01*
X107524441Y-113422500D01*
X107524443Y-113422500D01*
X107709600Y-113383144D01*
X107882527Y-113306151D01*
X108035668Y-113194888D01*
X108038585Y-113191647D01*
X108041397Y-113188526D01*
X108100884Y-113151879D01*
X108133545Y-113147500D01*
X114104345Y-113147500D01*
X114171384Y-113167185D01*
X114192026Y-113183819D01*
X115842978Y-114834771D01*
X115876463Y-114896094D01*
X115879297Y-114922452D01*
X115879297Y-122295007D01*
X115903332Y-122415840D01*
X115903337Y-122415857D01*
X115950482Y-122529677D01*
X115950484Y-122529681D01*
X115950485Y-122529682D01*
X115979222Y-122572688D01*
X116005581Y-122612138D01*
X116018940Y-122632131D01*
X116110383Y-122723574D01*
X116110405Y-122723594D01*
X117136630Y-123749819D01*
X117170115Y-123811142D01*
X117165131Y-123880834D01*
X117123259Y-123936767D01*
X117057795Y-123961184D01*
X117048949Y-123961500D01*
X109543371Y-123961500D01*
X109476332Y-123941815D01*
X109455690Y-123925181D01*
X107813117Y-122282608D01*
X107813097Y-122282586D01*
X107721652Y-122191141D01*
X107670428Y-122156915D01*
X107619206Y-122122689D01*
X107619205Y-122122688D01*
X107619202Y-122122686D01*
X107619199Y-122122685D01*
X107538711Y-122089347D01*
X107505372Y-122075537D01*
X107495346Y-122073543D01*
X107444948Y-122063518D01*
X107384529Y-122051500D01*
X107384526Y-122051500D01*
X107384525Y-122051500D01*
X93765249Y-122051500D01*
X93698210Y-122031815D01*
X93677568Y-122015181D01*
X90946616Y-119284229D01*
X90913131Y-119222906D01*
X90910297Y-119196548D01*
X90910297Y-103695687D01*
X90929982Y-103628648D01*
X90942147Y-103612715D01*
X90960688Y-103592122D01*
X91017330Y-103529216D01*
X91111976Y-103365284D01*
X91170471Y-103185256D01*
X91190257Y-102997000D01*
X91170471Y-102808744D01*
X91111976Y-102628716D01*
X91017330Y-102464784D01*
X90890668Y-102324112D01*
X90890667Y-102324111D01*
X90737531Y-102212851D01*
X90737526Y-102212848D01*
X90564604Y-102135857D01*
X90564599Y-102135855D01*
X90418798Y-102104865D01*
X90379443Y-102096500D01*
X90190151Y-102096500D01*
X90157694Y-102103398D01*
X90004994Y-102135855D01*
X90004989Y-102135857D01*
X89832067Y-102212848D01*
X89832062Y-102212851D01*
X89678926Y-102324111D01*
X89552263Y-102464785D01*
X89457618Y-102628715D01*
X89457615Y-102628722D01*
X89399124Y-102808740D01*
X89399123Y-102808744D01*
X89379337Y-102997000D01*
X89399123Y-103185256D01*
X89399124Y-103185259D01*
X89457615Y-103365277D01*
X89457618Y-103365284D01*
X89552264Y-103529216D01*
X89595569Y-103577310D01*
X89627447Y-103612715D01*
X89657677Y-103675706D01*
X89659297Y-103695687D01*
X89659297Y-119568611D01*
X89662309Y-119583752D01*
X89656082Y-119653344D01*
X89613219Y-119708521D01*
X89547329Y-119731765D01*
X89479332Y-119715697D01*
X89453011Y-119695624D01*
X83961616Y-114204229D01*
X83928131Y-114142906D01*
X83925297Y-114116548D01*
X83925297Y-86550687D01*
X83944982Y-86483648D01*
X83957147Y-86467715D01*
X83975688Y-86447122D01*
X84032330Y-86384216D01*
X84126976Y-86220284D01*
X84185471Y-86040256D01*
X84205257Y-85852000D01*
X84185471Y-85663744D01*
X84126976Y-85483716D01*
X84032330Y-85319784D01*
X83905668Y-85179112D01*
X83905667Y-85179111D01*
X83752531Y-85067851D01*
X83752526Y-85067848D01*
X83579604Y-84990857D01*
X83579599Y-84990855D01*
X83433798Y-84959865D01*
X83394443Y-84951500D01*
X83205151Y-84951500D01*
X83172694Y-84958398D01*
X83019994Y-84990855D01*
X83019989Y-84990857D01*
X82847067Y-85067848D01*
X82847062Y-85067851D01*
X82693926Y-85179111D01*
X82567263Y-85319785D01*
X82472618Y-85483715D01*
X82472615Y-85483722D01*
X82414124Y-85663740D01*
X82414123Y-85663744D01*
X82394337Y-85852000D01*
X76314798Y-85852000D01*
X76314798Y-85851775D01*
X76317266Y-85298514D01*
X76317344Y-85294641D01*
X76321471Y-85179111D01*
X76356844Y-84188662D01*
X76357081Y-84184248D01*
X76436014Y-83080623D01*
X76436397Y-83076327D01*
X76554679Y-81976155D01*
X76555228Y-81971788D01*
X76712684Y-80876659D01*
X76713392Y-80872289D01*
X76909847Y-79783414D01*
X76910698Y-79779135D01*
X77145890Y-78697973D01*
X77146903Y-78693690D01*
X77420533Y-77621616D01*
X77421682Y-77617427D01*
X77733413Y-76555772D01*
X77734732Y-76551562D01*
X77836051Y-76247147D01*
X78084142Y-75501752D01*
X78085575Y-75497685D01*
X78472277Y-74460898D01*
X78473852Y-74456894D01*
X78897285Y-73434639D01*
X78899036Y-73430615D01*
X79358663Y-72424174D01*
X79360561Y-72420207D01*
X79855822Y-71430802D01*
X79857874Y-71426880D01*
X80388123Y-70455800D01*
X80390288Y-70451997D01*
X80954890Y-69500411D01*
X80957170Y-69496721D01*
X81555379Y-68565890D01*
X81557814Y-68562247D01*
X82188864Y-67653361D01*
X82191388Y-67649862D01*
X82854473Y-66764084D01*
X82857145Y-66760643D01*
X83551427Y-65899092D01*
X83554237Y-65895730D01*
X84278823Y-65059513D01*
X84281719Y-65056288D01*
X85035711Y-64246443D01*
X85038730Y-64243315D01*
X85821112Y-63460933D01*
X85824240Y-63457914D01*
X86634085Y-62703922D01*
X86637310Y-62701026D01*
X87473527Y-61976440D01*
X87476889Y-61973630D01*
X88338440Y-61279348D01*
X88341881Y-61276676D01*
X89227659Y-60613591D01*
X89231158Y-60611067D01*
X90140056Y-59980008D01*
X90143687Y-59977582D01*
X91074518Y-59379373D01*
X91078208Y-59377093D01*
X92029794Y-58812491D01*
X92033597Y-58810326D01*
X93004695Y-58280067D01*
X93008581Y-58278033D01*
X93998008Y-57782761D01*
X94001971Y-57780866D01*
X95008412Y-57321239D01*
X95012443Y-57319485D01*
X96034691Y-56896055D01*
X96038695Y-56894480D01*
X97075482Y-56507778D01*
X97079549Y-56506345D01*
X98129372Y-56156930D01*
X98133569Y-56155616D01*
X99195224Y-55843885D01*
X99199413Y-55842736D01*
X100271512Y-55569100D01*
X100275770Y-55568093D01*
X101356932Y-55332901D01*
X101361211Y-55332050D01*
X102450108Y-55135591D01*
X102454433Y-55134890D01*
X103549610Y-54977427D01*
X103553952Y-54976882D01*
X104654124Y-54858600D01*
X104658420Y-54858217D01*
X105762052Y-54779283D01*
X105766459Y-54779047D01*
X106872169Y-54739556D01*
X106876595Y-54739478D01*
X107982999Y-54739478D01*
X107987424Y-54739556D01*
G37*
%TD.AperFunction*%
%TD*%
M02*
