797
3 8 6 5 5 9 10 2 14 2 4 6 3 13 4 3 4 5 11 11 7 7 3 3 4 1 2 4 5 8 6 8 3 6 4 4 7 10 3 3 4 3 12 6 3 5 9 6 3 1 7 9 5 3 3 11 6 5 4 4 4 8 8 3 1 5 3 6 6 8 2 9 4 3 10 2 5 8 3 9 3 6 5 13 4 3 7 5 3 2 7 6 6 3 4 4 4 11 2 7 4 16 2 6 3 4 17 8 2 3 11 11 2 5 6 3 10 4 4 6 2 5 4 11 6 4 10 2 8 5 3 7 5 4 8 5 5 8 14 4 2 16 3 10 6 16 8 4 3 9 16 3 11 3 2 9 4 8 4 5 5 3 3 14 4 4 5 2 3 6 9 2 5 3 5 3 7 3 5 2 6 2 3 8 5 4 13 4 2 5 3 6 4 9 8 8 7 9 6 18 3 11 8 3 2 5 11 12 4 3 12 8 3 9 3 3 9 2 8 4 3 3 9 5 5 3 13 3 11 13 5 5 5 5 3 5 11 9 5 3 7 6 8 2 6 2 6 5 7 2 4 2 5 7 4 7 12 7 7 4 2 7 2 2 7 10 4 4 4 13 2 9 5 4 6 6 2 6 5 9 9 4 8 9 3 9 4 2 5 3 7 8 6 4 2 3 8 4 5 3 3 6 5 2 9 2 9 5 4 8 10 3 5 6 2 7 5 9 2 4 4 2 8 2 5 4 9 3 7 8 8 5 7 5 4 6 2 7 5 9 5 5 5 3 5 12 10 5 3 4 7 4 7 9 2 7 6 5 7 4 9 2 4 4 2 5 7 4 7 6 6 11 8 8 4 2 7 2 2 7 10 4 5 3 3 6 5 2 9 2 9 5 4 8 10 3 5 6 2 7 5 9 2 4 4 2 8 2 5 4 9 3 7 8 8 5 7 5 4 6 2 7 5 9 3 5 6 3 6 5 8 6 6 5 9 6 2 4 5 8 5 6 6 5 5 5 3 5 12 10 5 3 4 7 4 7 9 2 7 6 5 7 4 9 2 4 4 2 5 7 4 7 6 6 11 8 8 4 2 7 2 2 7 10 4 5 3 3 6 5 2 9 2 9 5 4 8 10 3 5 6 2 7 5 10 2 4 3 2 7 2 5 3 7 2 2 6 4 5 4 10 2 3 8 7 3 5 5 5 3 5 5 5 5 3 5 10 10 6 3 4 6 6 6 8 2 6 2 6 5 8 5 3 4 9 2 4 3 2 7 2 5 3 7 2 2 6 4 5 4 10 2 3 8 7 3 5 5 5 3 5 5 5 5 3 5 10 10 6 2 7 8 4 4 6 7 3 6 3 5 2 6 3 6 2 2 8 5 6 4 5 2 2 10 4 5 2 6 7 3 3 8 2 4 9 3 5 5 5 3 5 5 5 5 3 5 10 10 6 3 4 6 6 6 8 2 6 2 6 5 8 5 10 10 6 3 4 6 6 6 8 2 6 2 6 5 8 5 3 4 9 2 4 3 2 7 2 5 3 7 2 2 6 4 5 4 10 2 3 8 7 3 5 5 5 3 5 5 5 5 3 5 10 10 6 3 4 6 6 6 8 2 6 2 6 5 8 5 3 4 9 2 4 3 2 7 2 5 3 7 2 2 6 4 5 4 10 2 3 8 7 3 5 5 5 3 5 5 5 5 3 5 10 10 6 3 4 6 6 6 8 2 6 2 6 5 8 5 3 4 9 2 4 3 2 7 2 5 3 7 2 2 6 4 5 4 10 2 3 8 7 3 5 5 5 3 5
11
50
55
60
65
70
75
80
85
90
95
100
