5
8
14 853
15 1132
44 903
67 641
70 598
71 1144
81 335
104 560
7
14 853
15 1132
44 903
67 641
70 598
71 1144
81 335
6
14 853
15 1132
44 903
67 641
70 598
71 1144
5
14 853
15 1132
44 903
67 641
70 598
4
14 853
15 1132
44 903
67 641
