64
19
15
21
16
2926
4866
5040
2610
6933
9224
4837
7702
6886
4383
3327
5813
9679
11422
3356
6729
3105
525
442
13227
13152
11568
11573
11697
13046
11660
10695
11488
11793
13936
10877
12822
11369
11809
10727
12398
12416
12446
12033
11236
9305
9710
8434
9397
12413
9857
10090
9628
9683
10170
12251
8604
10524
12570
9273
12263
9984
12773
7971
9479
