[gd_scene format=2]

[node name="Node2D" type="Node2D"]

[node name="CanvasLayer" type="CanvasLayer" parent="."]

[node name="Label" type="Label" parent="CanvasLayer"]
margin_left = 3.57493
margin_top = 3.57493
margin_right = 61.5749
margin_bottom = 17.5749
text = "Health: 0"
