[gd_scene load_steps=3 format=2]

[ext_resource path="res://levels/TileSet.tres" type="TileSet" id=1]
[ext_resource path="res://characters/Genbu.tscn" type="PackedScene" id=2]

[node name="Level" type="Node2D"]

[node name="Level" type="TileMap" parent="."]
tile_set = ExtResource( 1 )
format = 1
tile_data = PoolIntArray( 65533, 1, 7, 65534, 1, 5, 131069, 1, 65543, 131070, 1, 65541, 65580, 1, 7, 65581, 1, 0, 65582, 1, 0, 65583, 1, 5, 196605, 1, 65543, 196606, 1, 65541, 131116, 1, 65543, 131117, 1, 65536, 131118, 1, 65536, 131119, 1, 65541, 262141, 1, 65543, 262142, 1, 65541, 196649, 1, 7, 196650, 1, 2, 196651, 1, 2, 196652, 1, 65536, 196653, 1, 65536, 196654, 1, 65536, 196655, 1, 65541, 327677, 1, 65543, 327678, 1, 65541, 262183, 1, 7, 262184, 1, 0, 262185, 1, 65536, 262186, 1, 65536, 262187, 1, 65536, 262188, 1, 65536, 262189, 1, 65536, 262190, 1, 65536, 262191, 1, 65541, 393212, 1, 7, 393213, 1, 65536, 393214, 1, 65536, 393215, 1, 0, 327680, 1, 3, 327681, 1, 2, 327682, 1, 2, 327683, 1, 0, 327684, 1, 0, 327685, 1, 4, 327686, 1, 2, 327687, 1, 1, 327688, 1, 1, 327689, 1, 1, 327690, 1, 2, 327691, 1, 3, 327692, 1, 4, 327693, 1, 1, 327694, 1, 0, 327695, 1, 2, 327696, 1, 4, 327697, 1, 1, 327698, 1, 0, 327699, 1, 1, 327700, 1, 5, 327704, 1, 7, 327705, 1, 2, 327706, 1, 4, 327707, 1, 0, 327708, 1, 2, 327709, 1, 1, 327710, 1, 4, 327711, 1, 4, 327712, 1, 0, 327713, 1, 4, 327714, 1, 4, 327715, 1, 4, 327716, 1, 2, 327717, 1, 0, 327718, 1, 1, 327719, 1, 65536, 327720, 1, 65536, 327721, 1, 65536, 327722, 1, 65536, 327723, 1, 65536, 327724, 1, 65536, 327725, 1, 65536, 327726, 1, 65536, 327727, 1, 65541, 458748, 1, 65543, 458749, 1, 65536, 458750, 1, 65536, 458751, 1, 65536, 393216, 1, 65536, 393217, 1, 65536, 393218, 1, 65536, 393219, 1, 65536, 393220, 1, 65536, 393221, 1, 65536, 393222, 1, 65536, 393223, 1, 65536, 393224, 1, 65536, 393225, 1, 65536, 393226, 1, 65536, 393227, 1, 65536, 393228, 1, 65536, 393229, 1, 65536, 393230, 1, 65536, 393231, 1, 65536, 393232, 1, 65536, 393233, 1, 65536, 393234, 1, 65536, 393235, 1, 65536, 393236, 1, 65541, 393240, 1, 65543, 393241, 1, 65536, 393242, 1, 65536, 393243, 1, 65536, 393244, 1, 65536, 393245, 1, 65536, 393246, 1, 65536, 393247, 1, 65536, 393248, 1, 65536, 393249, 1, 65536, 393250, 1, 65536, 393251, 1, 65536, 393252, 1, 65536, 393253, 1, 65536, 393254, 1, 65536, 393255, 1, 65536, 393256, 1, 65536, 393257, 1, 65536, 393258, 1, 65536, 393259, 1, 65536, 393260, 1, 65536, 393261, 1, 65536, 393262, 1, 65536, 393263, 1, 65541, 524284, 1, 131079, 524285, 1, 65536, 524286, 1, 65536, 524287, 1, 65536, 458752, 1, 65536, 458753, 1, 65536, 458754, 1, 65536, 458755, 1, 65536, 458756, 1, 65536, 458757, 1, 65536, 458758, 1, 65536, 458759, 1, 65536, 458760, 1, 65536, 458761, 1, 65536, 458762, 1, 65536, 458763, 1, 65536, 458764, 1, 65536, 458765, 1, 65536, 458766, 1, 65536, 458767, 1, 65536, 458768, 1, 65536, 458769, 1, 65536, 458770, 1, 65536, 458771, 1, 65536, 458772, 1, 131077, 458776, 1, 131079, 458777, 1, 65536, 458778, 1, 65536, 458779, 1, 65536, 458780, 1, 65536, 458781, 1, 65536, 458782, 1, 65536, 458783, 1, 65536, 458784, 1, 65536, 458785, 1, 65536, 458786, 1, 65536, 458787, 1, 65536, 458788, 1, 65536, 458789, 1, 65536, 458790, 1, 65536, 458791, 1, 65536, 458792, 1, 65536, 458793, 1, 65536, 458794, 1, 65536, 458795, 1, 65536, 458796, 1, 65536, 458797, 1, 65536, 458798, 1, 65536, 458799, 1, 131077 )

[node name="Background" type="TileMap" parent="."]
tile_set = ExtResource( 1 )
format = 1
tile_data = PoolIntArray( -196601, 3, 0, -65536, 2, 0, -65523, 4, 0 )

[node name="Genbu" parent="." instance=ExtResource( 2 )]
position = Vector2( 602.819, 263.663 )

[node name="Camera2D" type="Camera2D" parent="Genbu"]
position = Vector2( -52.5098, 28.2758 )
current = true
limit_left = 0
limit_bottom = 500

[node name="Foreground" type="TileMap" parent="."]
position = Vector2( -9.15527e-05, 0 )
tile_set = ExtResource( 1 )
format = 1
tile_data = PoolIntArray( -65533, 3, 0, 24, 2, 0, 65566, 2, 0 )
