{
    "AWSEBDockerrunVersion": "1",
    "Image": {
        "Name": "${CI_REGISTRY_IMAGE}:${CI_PIPELINE_IID}"
    },
    "Authentication": {
        "Bucket": "elasticbeanstalk-${AWS_DEFAULT_REGION}-${AWS_ACCOUNT_ID}",
        "Key": "auth.json"
    },
    "Ports": [
        {
            "ContainerPort": 80
        }
    ],
    "Volumes": [
    {
      "HostDirectory": "/boards",
      "ContainerDirectory": "/var/www/html/vichan/boards"
    }
  ]
}