[
  {
    "0": "0",
    "1": "0",
    "2": "88880000000",
    "3": "0",
    "4": "0",
    "5": "0",
    "6": "0",
    "7": "0",
    "8": "0x91011Aca104aDbC884ec79734E2cC80838B4452A",
    "9": "0x6D908F34bCBC722fe30d377AE16ea888BA5010bb",
    "10": "",
    "11": [],
    "period": "第一期111",
    "contractAddr": "0x305F52A96A5b91C7d397F9f808f1502Bf83188F8"
  },
  {
    "0": "0",
    "1": "0",
    "2": "50000000000",
    "3": "0",
    "4": "0",
    "5": "0",
    "6": "0",
    "7": "0",
    "8": "0x91011Aca104aDbC884ec79734E2cC80838B4452A",
    "9": "0x6D908F34bCBC722fe30d377AE16ea888BA5010bb",
    "10": "",
    "11": [],
    "period": "第二期",
    "contractAddr": "0x33853567cE452E3218F00771664a55ac7c2eD800"
  },
  {
    "0": "0",
    "1": "0",
    "2": "50000000000",
    "3": "0",
    "4": "0",
    "5": "0",
    "6": "0",
    "7": "0",
    "8": "0x91011Aca104aDbC884ec79734E2cC80838B4452A",
    "9": "0x6D908F34bCBC722fe30d377AE16ea888BA5010bb",
    "10": "",
    "11": [],
    "period": "第三期",
    "contractAddr": "0xd3296597FFD0e9275133404906daBa6Ab55A69Cc"
  }
]
