{
  "openapi": "3.0.1",
  "info": {
    "title": "Tbox.Api",
    "version": "1.0"
  },
  "paths": {
    "/api/app/GetCarName/{vin}/{oneId}": {
      "get": {
        "tags": [
          "App"
        ],
        "summary": "由 VIN 碼取得 CARNM 車型名稱、及綁定狀態",
        "description": "使用 <strong>VIN</strong> 碼取得<br>CARNM 車型名稱、<br>及綁定狀態",
        "operationId": "GetCarName",
        "parameters": [
          {
            "name": "vin",
            "in": "path",
            "required": true,
            "schema": {
              "type": "string"
            }
          },
          {
            "name": "oneId",
            "in": "path",
            "required": true,
            "schema": {
              "type": "string"
            }
          }
        ],
        "responses": {
          "200": {
            "description": "Success"
          }
        }
      }
    },
    "/api/app/GetNotificationSettings/{vin}/{oneId}/{dxid}": {
      "get": {
        "tags": [
          "App"
        ],
        "summary": "取得推播收取設定（依裝置不同，故須使用 Dxid）",
        "description": "",
        "operationId": "GetNotificationSettings",
        "parameters": [
          {
            "name": "vin",
            "in": "path",
            "required": true,
            "schema": {
              "type": "string"
            }
          },
          {
            "name": "oneId",
            "in": "path",
            "required": true,
            "schema": {
              "type": "string"
            }
          },
          {
            "name": "dxid",
            "in": "path",
            "required": true,
            "schema": {
              "type": "string"
            }
          }
        ],
        "responses": {
          "200": {
            "description": "Success"
          }
        }
      }
    },
    "/api/app/RevokeVinTOS/{vin}/{oneId}": {
      "put": {
        "tags": [
          "App"
        ],
        "summary": "徹銷同意狀態綁定",
        "description": "",
        "operationId": "RevokeVinTOS",
        "parameters": [
          {
            "name": "vin",
            "in": "path",
            "required": true,
            "schema": {
              "type": "string"
            }
          },
          {
            "name": "oneId",
            "in": "path",
            "required": true,
            "schema": {
              "type": "string"
            }
          }
        ],
        "responses": {
          "200": {
            "description": "Success"
          }
        }
      }
    },
    "/api/app/SetupNotification": {
      "put": {
        "tags": [
          "App"
        ],
        "summary": "App 設定車況推播收取開關",
        "description": "",
        "operationId": "SetupNotification",
        "requestBody": {
          "content": {
            "application/json": {
              "schema": {
                "$ref": "#/components/schemas/TBoxNotificationSettingRequestData"
              }
            }
          },
          "required": true
        },
        "responses": {
          "200": {
            "description": "Success"
          }
        }
      }
    },
    "/api/app/SetVersionAgreement": {
      "put": {
        "tags": [
          "App"
        ],
        "summary": "App 使用者操作 Tbox 前，同意使用者條款",
        "description": "IsAgree = true 同意條款，<br/>IsAgree != true 則徹銷同意條款",
        "operationId": "SetVersionAgreement",
        "requestBody": {
          "content": {
            "application/json": {
              "schema": {
                "$ref": "#/components/schemas/SetVersionAgreementRequestModel"
              }
            }
          },
          "required": true
        },
        "responses": {
          "200": {
            "description": "Success"
          }
        }
      }
    },
    "/api/app/fuel/{vin}/{id}": {
      "delete": {
        "tags": [
          "App"
        ],
        "summary": "刪除加油日記記錄",
        "description": "",
        "operationId": "DeleteFuelReport",
        "parameters": [
          {
            "name": "vin",
            "in": "path",
            "required": true,
            "schema": {
              "type": "string"
            }
          },
          {
            "name": "id",
            "in": "path",
            "required": true,
            "schema": {
              "type": "string"
            }
          }
        ],
        "responses": {
          "200": {
            "description": "Success"
          }
        }
      }
    },
    "/api/app/fuel": {
      "put": {
        "tags": [
          "App"
        ],
        "summary": "編輯加油記錄",
        "description": "",
        "operationId": "EditFuelReport",
        "requestBody": {
          "content": {
            "application/json": {
              "schema": {
                "$ref": "#/components/schemas/EditFuelReportRequestModel"
              }
            }
          },
          "required": true
        },
        "responses": {
          "200": {
            "description": "Success"
          }
        }
      }
    },
    "/api/app/fuel/setting/{vin}/{oneId}": {
      "get": {
        "tags": [
          "App"
        ],
        "summary": "取得油品設定",
        "operationId": "GetFuelSetting",
        "parameters": [
          {
            "name": "vin",
            "in": "path",
            "required": true,
            "schema": {
              "type": "string"
            }
          },
          {
            "name": "oneId",
            "in": "path",
            "required": true,
            "schema": {
              "type": "string"
            }
          }
        ],
        "responses": {
          "200": {
            "description": "Success"
          }
        }
      }
    },
    "/api/app/fuel/{vin}/{oneId}": {
      "get": {
        "tags": [
          "App"
        ],
        "summary": "取得加油記錄",
        "description": "",
        "operationId": "GetFuelReports",
        "parameters": [
          {
            "name": "vin",
            "in": "path",
            "required": true,
            "schema": {
              "type": "string"
            }
          },
          {
            "name": "oneId",
            "in": "path",
            "required": true,
            "schema": {
              "type": "string"
            }
          },
          {
            "name": "p",
            "in": "query",
            "schema": {
              "type": "integer",
              "format": "int32",
              "default": 1
            }
          },
          {
            "name": "max",
            "in": "query",
            "schema": {
              "type": "integer",
              "format": "int32",
              "default": 100
            }
          }
        ],
        "responses": {
          "200": {
            "description": "Success"
          }
        }
      }
    },
    "/api/app/fuel/setting/{vin}/{oneId}/{oilType}": {
      "put": {
        "tags": [
          "App"
        ],
        "summary": "設定油品",
        "description": "oil type：0 Oil92, 1 Oil95, 2 Oil98, 3 Diesel",
        "operationId": "SetFuelSetting",
        "parameters": [
          {
            "name": "vin",
            "in": "path",
            "required": true,
            "schema": {
              "type": "string"
            }
          },
          {
            "name": "oneId",
            "in": "path",
            "required": true,
            "schema": {
              "type": "string"
            }
          },
          {
            "name": "oilType",
            "in": "path",
            "required": true,
            "schema": {
              "type": "integer",
              "format": "int32"
            }
          }
        ],
        "responses": {
          "200": {
            "description": "Success"
          }
        }
      }
    },
    "/api/app/price-sync": {
      "get": {
        "tags": [
          "App"
        ],
        "summary": "油價同步 only for webjob console",
        "description": "",
        "operationId": "SyncPrice",
        "responses": {
          "200": {
            "description": "Success"
          }
        }
      }
    },
    "/api/car/report-info/{vin}/{trackId}": {
      "delete": {
        "tags": [
          "CarInfo"
        ],
        "summary": "實作 CMX04-2:刪除車輛行駛報告內容",
        "description": "",
        "operationId": "DeleteDriveReportInfo",
        "parameters": [
          {
            "name": "vin",
            "in": "path",
            "required": true,
            "schema": {
              "type": "string"
            }
          },
          {
            "name": "trackId",
            "in": "path",
            "required": true,
            "schema": {
              "type": "integer",
              "format": "int64"
            }
          }
        ],
        "responses": {
          "200": {
            "description": "Success"
          }
        }
      },
      "post": {
        "tags": [
          "CarInfo"
        ],
        "summary": "實作 CMX04-2:刪除車輛行駛報告內容（多筆）",
        "description": "",
        "operationId": "DeleteDriveReportInfos",
        "responses": {
          "200": {
            "description": "Success"
          }
        }
      },
      "get": {
        "tags": [
          "CarInfo"
        ],
        "summary": "實作 CMX04:查詢車輛行駛報告內容",
        "description": "",
        "operationId": "GetDriveReportInfo",
        "parameters": [
          {
            "name": "vin",
            "in": "path",
            "required": true,
            "schema": {
              "type": "string"
            }
          },
          {
            "name": "trackId",
            "in": "path",
            "required": true,
            "schema": {
              "type": "integer",
              "format": "int32"
            }
          }
        ],
        "responses": {
          "200": {
            "description": "Success"
          }
        }
      }
    },
    "/api/car/tracking-info/{vin}/{trackId}": {
      "delete": {
        "tags": [
          "CarInfo"
        ],
        "summary": "實作 CMX06-2:刪除車輛異常移位內容",
        "description": "",
        "operationId": "DeleteTrackingInfo",
        "parameters": [
          {
            "name": "vin",
            "in": "path",
            "required": true,
            "schema": {
              "type": "string"
            }
          },
          {
            "name": "trackId",
            "in": "path",
            "required": true,
            "schema": {
              "type": "integer",
              "format": "int64"
            }
          }
        ],
        "responses": {
          "200": {
            "description": "Success"
          }
        }
      },
      "get": {
        "tags": [
          "CarInfo"
        ],
        "summary": "實作 CMX06:查詢車輛異常移位內容",
        "description": "",
        "operationId": "GetTrackingInfo",
        "responses": {
          "200": {
            "description": "Success"
          }
        }
      }
    },
    "/api/car/tracking-info": {
      "post": {
        "tags": [
          "CarInfo"
        ],
        "summary": "實作 CMX06-2:刪除車輛異常移位內容（多筆）",
        "description": "",
        "operationId": "DeleteTrackingInfos",
        "responses": {
          "200": {
            "description": "Success"
          }
        }
      }
    },
    "/api/car/end-lending/{vin}": {
      "post": {
        "tags": [
          "CarInfo"
        ],
        "summary": "實作 CMX12:關閉借車模式",
        "operationId": "EndLendingMode",
        "parameters": [
          {
            "name": "vin",
            "in": "path",
            "required": true,
            "schema": {
              "type": "string"
            }
          }
        ],
        "responses": {
          "200": {
            "description": "Success"
          }
        }
      }
    },
    "/api/car/can/{vin}": {
      "get": {
        "tags": [
          "CarInfo"
        ],
        "summary": "實作 CMX02:查詢車輛CAN狀態",
        "description": "",
        "operationId": "GetCANInfo",
        "parameters": [
          {
            "name": "vin",
            "in": "path",
            "required": true,
            "schema": {
              "type": "string"
            }
          }
        ],
        "responses": {
          "200": {
            "description": "Success"
          }
        }
      }
    },
    "/api/car/device-info/{vin}": {
      "get": {
        "tags": [
          "CarInfo"
        ],
        "summary": "實作 CMX08:查詢裝置資訊",
        "operationId": "GetDeviceInfo",
        "parameters": [
          {
            "name": "vin",
            "in": "path",
            "required": true,
            "schema": {
              "type": "string"
            }
          }
        ],
        "responses": {
          "200": {
            "description": "Success"
          }
        }
      }
    },
    "/api/car/report-list/{vin}/{epochstart}/{epochend}": {
      "get": {
        "tags": [
          "CarInfo"
        ],
        "summary": "實作 CMX03:查詢車輛行駛報告列表",
        "description": "",
        "operationId": "GetDriveReportList",
        "parameters": [
          {
            "name": "vin",
            "in": "path",
            "required": true,
            "schema": {
              "type": "string"
            }
          },
          {
            "name": "epochstart",
            "in": "path",
            "required": true,
            "schema": {
              "type": "integer",
              "format": "int64"
            }
          },
          {
            "name": "epochend",
            "in": "path",
            "required": true,
            "schema": {
              "type": "integer",
              "format": "int64"
            }
          }
        ],
        "responses": {
          "200": {
            "description": "Success"
          }
        }
      }
    },
    "/api/car/gps/{vin}": {
      "get": {
        "tags": [
          "CarInfo"
        ],
        "summary": "實作 CMX01:查詢車輛GPS位置",
        "description": "",
        "operationId": "GetGpsInfo",
        "parameters": [
          {
            "name": "vin",
            "in": "path",
            "required": true,
            "schema": {
              "type": "string"
            }
          }
        ],
        "responses": {
          "200": {
            "description": "Success"
          }
        }
      }
    },
    "/api/car/lists/{vin}/{epochstart}/{epochend}": {
      "get": {
        "tags": [
          "CarInfo"
        ],
        "summary": "實作 CMX03456：整合查詢（正常異常）",
        "operationId": "GetIntegrationList",
        "parameters": [
          {
            "name": "vin",
            "in": "path",
            "required": true,
            "schema": {
              "type": "string"
            }
          },
          {
            "name": "epochstart",
            "in": "path",
            "required": true,
            "schema": {
              "type": "integer",
              "format": "int64"
            }
          },
          {
            "name": "epochend",
            "in": "path",
            "required": true,
            "schema": {
              "type": "integer",
              "format": "int64"
            }
          }
        ],
        "responses": {
          "200": {
            "description": "Success"
          }
        }
      }
    },
    "/api/car/lending-status/{vin}": {
      "get": {
        "tags": [
          "CarInfo"
        ],
        "summary": "實作 CMX15:取得借車模式設定",
        "operationId": "GetLendingStatus",
        "parameters": [
          {
            "name": "vin",
            "in": "path",
            "required": true,
            "schema": {
              "type": "string"
            }
          }
        ],
        "responses": {
          "200": {
            "description": "Success"
          }
        }
      }
    },
    "/api/car/merged-lists/{vin}/{epochstart}/{epochend}": {
      "get": {
        "tags": [
          "CarInfo"
        ],
        "summary": "實作 CMX310456 整合查詢（正常異常/一般/借車）",
        "operationId": "GetMergedReports",
        "parameters": [
          {
            "name": "vin",
            "in": "path",
            "required": true,
            "schema": {
              "type": "string"
            }
          },
          {
            "name": "epochstart",
            "in": "path",
            "required": true,
            "schema": {
              "type": "integer",
              "format": "int64"
            }
          },
          {
            "name": "epochend",
            "in": "path",
            "required": true,
            "schema": {
              "type": "integer",
              "format": "int64"
            }
          }
        ],
        "responses": {
          "200": {
            "description": "Success"
          }
        }
      }
    },
    "/api/car/tracking-list/{vin}/{epochstart}/{epochend}": {
      "get": {
        "tags": [
          "CarInfo"
        ],
        "summary": "實作 CMX05:查詢車輛異常移位列表",
        "description": "",
        "operationId": "GetTrackingList",
        "parameters": [
          {
            "name": "vin",
            "in": "path",
            "required": true,
            "schema": {
              "type": "string"
            }
          },
          {
            "name": "epochstart",
            "in": "path",
            "required": true,
            "schema": {
              "type": "integer",
              "format": "int64"
            }
          },
          {
            "name": "epochend",
            "in": "path",
            "required": true,
            "schema": {
              "type": "integer",
              "format": "int64"
            }
          }
        ],
        "responses": {
          "200": {
            "description": "Success"
          }
        }
      }
    },
    "/api/car/start-lending/{vin}": {
      "post": {
        "tags": [
          "CarInfo"
        ],
        "summary": "實作 CMX11:開啟借車模式",
        "operationId": "StartLendingMode",
        "parameters": [
          {
            "name": "vin",
            "in": "path",
            "required": true,
            "schema": {
              "type": "string"
            },
            "content": {
              "application/json": { }
            }
          }
        ],
        "requestBody": {
          "content": {
            "application/json": {
              "schema": {
                "$ref": "#/components/schemas/StartLendingModeRequestModel"
              }
            }
          },
          "required": true
        },
        "responses": {
          "200": {
            "description": "Success"
          }
        }
      }
    },
    "/api/query/GetSettings/{vin}/{oneId}": {
      "get": {
        "tags": [
          "Query"
        ],
        "summary": "查詢車況開關",
        "description": "APP 請不要使用此 Api",
        "operationId": "GetSettings",
        "parameters": [
          {
            "name": "vin",
            "in": "path",
            "required": true,
            "schema": {
              "type": "string"
            }
          },
          {
            "name": "oneId",
            "in": "path",
            "required": true,
            "schema": {
              "type": "string"
            }
          }
        ],
        "responses": {
          "200": {
            "description": "Success"
          }
        }
      }
    },
    "/api/veh/add-fuel": {
      "post": {
        "tags": [
          "VehicleInfo"
        ],
        "summary": "實作 HT04:接收加油記錄",
        "operationId": "CreateFuelReport",
        "requestBody": {
          "content": {
            "application/json": {
              "schema": {
                "$ref": "#/components/schemas/CreateFuelReportRequestModel"
              }
            }
          },
          "required": true
        },
        "responses": {
          "200": {
            "description": "Success"
          }
        }
      }
    },
    "/api/veh/get_vehicle_info_a/{obd2vin}": {
      "get": {
        "tags": [
          "VehicleInfo"
        ],
        "summary": "實作 HT01-A：查詢車籍資料",
        "description": "直接查詢 ECHO.MCLUB/Lexus Server，<br/>順便存 IoV Flag",
        "operationId": "GetVehicleInfoA",
        "parameters": [
          {
            "name": "obd2vin",
            "in": "path",
            "required": true,
            "schema": {
              "type": "string"
            }
          }
        ],
        "responses": {
          "200": {
            "description": "Success"
          }
        }
      }
    },
    "/api/veh/get_vehicle_info_b/{obd2vin}": {
      "get": {
        "tags": [
          "VehicleInfo"
        ],
        "summary": "實作 HT01-B：查詢交車與綁定資料",
        "description": "查詢Lexus Server，從 ECHO 每日轉檔到 Lexus Server，<br/>當 Lexus Server 查無交車資料，再往 ECHO 查詢",
        "operationId": "GetVehicleInfoB",
        "parameters": [
          {
            "name": "obd2vin",
            "in": "path",
            "required": true,
            "schema": {
              "type": "string"
            }
          }
        ],
        "responses": {
          "200": {
            "description": "Success"
          }
        }
      }
    },
    "/api/veh/send_vehicle_event": {
      "post": {
        "tags": [
          "VehicleInfo"
        ],
        "summary": "實作 HT02：發送車況推播通知",
        "operationId": "SendVehicleEvent",
        "requestBody": {
          "content": {
            "application/json": {
              "schema": {
                "$ref": "#/components/schemas/VehicleEventRequestModel"
              }
            }
          },
          "required": true
        },
        "responses": {
          "200": {
            "description": "Success"
          }
        }
      }
    }
  },
  "components": {
    "schemas": {
      "CreateFuelReportRequestModel": {
        "type": "object",
        "properties": {
          "vin": {
            "type": "string",
            "nullable": true
          },
          "epoch": {
            "type": "integer",
            "format": "int64"
          },
          "avgFuelConsum": {
            "type": "number",
            "format": "double"
          },
          "fuelConsumption": {
            "type": "number",
            "format": "double"
          },
          "travelDistance": {
            "type": "number",
            "format": "double"
          },
          "fuelDiff": {
            "type": "number",
            "format": "double"
          },
          "lat": {
            "type": "integer",
            "format": "int32",
            "nullable": true
          },
          "lon": {
            "type": "integer",
            "format": "int32",
            "nullable": true
          }
        },
        "additionalProperties": false
      },
      "EditFuelReportRequestModel": {
        "type": "object",
        "properties": {
          "vin": {
            "type": "string",
            "nullable": true
          },
          "oneId": {
            "type": "string",
            "nullable": true
          },
          "id": {
            "type": "string",
            "nullable": true
          },
          "amount": {
            "type": "number",
            "format": "double"
          },
          "fuelDiff": {
            "type": "number",
            "format": "double"
          },
          "fuelType": {
            "type": "integer",
            "format": "int32"
          }
        },
        "additionalProperties": false
      },
      "SetVersionAgreementRequestModel": {
        "type": "object",
        "properties": {
          "vin": {
            "type": "string",
            "nullable": true
          },
          "oneId": {
            "type": "string",
            "nullable": true
          },
          "custId": {
            "type": "string",
            "nullable": true
          },
          "isAgree": {
            "nullable": true
          },
          "versionAgreed": {
            "type": "string",
            "nullable": true
          },
          "licsno": {
            "type": "string",
            "nullable": true
          },
          "ip": {
            "type": "string",
            "nullable": true
          }
        },
        "additionalProperties": false
      },
      "StartLendingModeRequestModel": {
        "type": "object",
        "properties": {
          "scenariomode": {
            "type": "integer",
            "format": "int32"
          },
          "lat": {
            "type": "integer",
            "format": "int32"
          },
          "lon": {
            "type": "integer",
            "format": "int32"
          },
          "radius": {
            "type": "integer",
            "format": "int32"
          }
        },
        "additionalProperties": false
      },
      "TBoxNotificationSettingRequestData": {
        "type": "object",
        "properties": {
          "oneId": {
            "type": "string",
            "nullable": true
          },
          "dxid": {
            "type": "string",
            "nullable": true
          },
          "vin": {
            "type": "string",
            "nullable": true
          },
          "startupNotification": {
            "nullable": true
          },
          "lowBatteryNotification": {
            "nullable": true
          },
          "stopWithoutLockNotification": {
            "nullable": true
          },
          "antiThieftFailureNotification": {
            "nullable": true
          },
          "movingFailureNotification": {
            "nullable": true
          }
        },
        "additionalProperties": false
      },
      "VehicleEventRequestModel": {
        "type": "object",
        "properties": {
          "vin": {
            "type": "string",
            "nullable": true
          },
          "epoch": {
            "type": "integer",
            "format": "int64"
          },
          "status": {
            "type": "string",
            "nullable": true
          },
          "scenariomode": {
            "type": "integer",
            "format": "int32"
          }
        },
        "additionalProperties": false
      }
    }
  }
}