{
  "profiles": {
    "Tbox.Core.Crypto": {
      "commandName": "Project",
      "launchBrowser": true,
      "environmentVariables": {
        "ASPNETCORE_ENVIRONMENT": "Development"
      },
      "applicationUrl": "https://localhost:58009;http://localhost:58012"
    }
  }
}