<?xml version="1.0"?>
<opencv_storage>
<stage0>
  <maxWeakCount>9</maxWeakCount>
  <stageThreshold>-1.5998488664627075e+000</stageThreshold>
  <weakClassifiers>
    <_>
      <internalNodes>
        0 -1 9191 -1.0226973891258240e-001</internalNodes>
      <leafValues>
        8.7209904193878174e-001 -7.6152664422988892e-001</leafValues></_>
    <_>
      <internalNodes>
        0 -1 5497 -1.4405317604541779e-002</internalNodes>
      <leafValues>
        9.9713248014450073e-001 -2.2680817544460297e-001</leafValues></_>
    <_>
      <internalNodes>
        0 -1 3071 -2.9822282493114471e-002</internalNodes>
      <leafValues>
        8.8167041540145874e-001 -2.7170276641845703e-001</leafValues></_>
    <_>
      <internalNodes>
        0 -1 220395 -1.4621639624238014e-002</internalNodes>
      <leafValues>
        6.8028658628463745e-001 -3.2524675130844116e-001</leafValues></_>
    <_>
      <internalNodes>
        0 -1 36826 -4.2193021625280380e-002</internalNodes>
      <leafValues>
        8.6215269565582275e-001 -1.7409560084342957e-001</leafValues></_>
    <_>
      <internalNodes>
        0 -1 186756 -2.4292439222335815e-002</internalNodes>
      <leafValues>
        6.1332392692565918e-001 -2.7855026721954346e-001</leafValues></_>
    <_>
      <internalNodes>
        0 -1 133941 -2.7314355596899986e-002</internalNodes>
      <leafValues>
        9.8066270351409912e-001 -1.8172508478164673e-001</leafValues></_>
    <_>
      <internalNodes>
        0 -1 30102 -2.3756299167871475e-002</internalNodes>
      <leafValues>
        -1.0352710485458374e+000 1.7626899480819702e-001</leafValues></_>
    <_>
      <internalNodes>
        0 -1 182488 5.8048530481755733e-003</internalNodes>
      <leafValues>
        -2.4233013391494751e-001 5.5113512277603149e-001</leafValues></_></weakClassifiers></stage0>
</opencv_storage>
