<?xml version="1.0"?>
<opencv_storage>
<stage9>
  <maxWeakCount>31</maxWeakCount>
  <stageThreshold>-1.3813183307647705e+000</stageThreshold>
  <weakClassifiers>
    <_>
      <internalNodes>
        0 -1 100402 -1.7693161964416504e-001</internalNodes>
      <leafValues>
        -1.2110137194395065e-001 -5.8515208959579468e-001</leafValues></_>
    <_>
      <internalNodes>
        0 -1 142194 5.2970312535762787e-003</internalNodes>
      <leafValues>
        -1.2104555219411850e-001 3.7279260158538818e-001</leafValues></_>
    <_>
      <internalNodes>
        0 -1 29 -1.1195523664355278e-002</internalNodes>
      <leafValues>
        -5.3659540414810181e-001 8.3475358784198761e-002</leafValues></_>
    <_>
      <internalNodes>
        0 -1 34888 -3.3251065760850906e-002</internalNodes>
      <leafValues>
        5.0701022148132324e-001 -8.7053634226322174e-002</leafValues></_>
    <_>
      <internalNodes>
        0 -1 114381 1.2746246531605721e-002</internalNodes>
      <leafValues>
        -2.0271223783493042e-001 3.4316861629486084e-001</leafValues></_>
    <_>
      <internalNodes>
        0 -1 4357 2.7155004441738129e-002</internalNodes>
      <leafValues>
        -6.7804984748363495e-002 6.6186577081680298e-001</leafValues></_>
    <_>
      <internalNodes>
        0 -1 182321 -6.2768338248133659e-003</internalNodes>
      <leafValues>
        -5.0991231203079224e-001 8.2516774535179138e-002</leafValues></_>
    <_>
      <internalNodes>
        0 -1 164640 1.1591274233069271e-004</internalNodes>
      <leafValues>
        1.6849179565906525e-001 -2.8177383542060852e-001</leafValues></_>
    <_>
      <internalNodes>
        0 -1 155998 -1.6380881424993277e-003</internalNodes>
      <leafValues>
        3.3417031168937683e-001 -1.5038880705833435e-001</leafValues></_>
    <_>
      <internalNodes>
        0 -1 261570 4.1179917752742767e-003</internalNodes>
      <leafValues>
        6.5319262444972992e-002 -7.8863751888275146e-001</leafValues></_>
    <_>
      <internalNodes>
        0 -1 222688 -2.0013493485748768e-003</internalNodes>
      <leafValues>
        3.7139359116554260e-001 -1.2240792065858841e-001</leafValues></_>
    <_>
      <internalNodes>
        0 -1 209933 1.0140918195247650e-002</internalNodes>
      <leafValues>
        -1.3782010972499847e-001 3.2170397043228149e-001</leafValues></_>
    <_>
      <internalNodes>
        0 -1 142875 -5.3901124745607376e-002</internalNodes>
      <leafValues>
        2.5346603989601135e-001 -1.7348170280456543e-001</leafValues></_>
    <_>
      <internalNodes>
        0 -1 33871 2.8573137242347002e-003</internalNodes>
      <leafValues>
        7.0697046816349030e-002 -6.9641691446304321e-001</leafValues></_>
    <_>
      <internalNodes>
        0 -1 71994 -2.4943521246314049e-002</internalNodes>
      <leafValues>
        4.0480366349220276e-001 -1.0950697213411331e-001</leafValues></_>
    <_>
      <internalNodes>
        0 -1 221994 -1.4225766062736511e-003</internalNodes>
      <leafValues>
        3.0672296881675720e-001 -1.4865508675575256e-001</leafValues></_>
    <_>
      <internalNodes>
        0 -1 53292 -1.7153583467006683e-002</internalNodes>
      <leafValues>
        4.1076743602752686e-001 -1.1067139357328415e-001</leafValues></_>
    <_>
      <internalNodes>
        0 -1 142617 8.4227938205003738e-003</internalNodes>
      <leafValues>
        8.2235559821128845e-002 -5.9854722023010254e-001</leafValues></_>
    <_>
      <internalNodes>
        0 -1 43065 1.8456190824508667e-002</internalNodes>
      <leafValues>
        4.6106681227684021e-002 -9.1550034284591675e-001</leafValues></_>
    <_>
      <internalNodes>
        0 -1 21622 -1.3759190216660500e-002</internalNodes>
      <leafValues>
        2.8854891657829285e-001 -1.4353494346141815e-001</leafValues></_>
    <_>
      <internalNodes>
        0 -1 252704 7.3261908255517483e-004</internalNodes>
      <leafValues>
        -1.0381936281919479e-001 3.9616736769676208e-001</leafValues></_>
    <_>
      <internalNodes>
        0 -1 17488 1.4137931866571307e-003</internalNodes>
      <leafValues>
        5.3920868784189224e-002 -9.2228788137435913e-001</leafValues></_>
    <_>
      <internalNodes>
        0 -1 102762 3.3413100242614746e-001</internalNodes>
      <leafValues>
        5.4490558803081512e-002 -8.5017502307891846e-001</leafValues></_>
    <_>
      <internalNodes>
        0 -1 261412 2.7804870624095201e-003</internalNodes>
      <leafValues>
        1.3394753634929657e-001 -3.6542496085166931e-001</leafValues></_>
    <_>
      <internalNodes>
        0 -1 222563 2.0171978976577520e-003</internalNodes>
      <leafValues>
        -2.0905168354511261e-001 2.1035671234130859e-001</leafValues></_>
    <_>
      <internalNodes>
        0 -1 243729 1.6258707270026207e-002</internalNodes>
      <leafValues>
        -9.9522158503532410e-002 5.7936471700668335e-001</leafValues></_>
    <_>
      <internalNodes>
        0 -1 5361 2.2386088967323303e-003</internalNodes>
      <leafValues>
        5.9755824506282806e-002 -9.4181841611862183e-001</leafValues></_>
    <_>
      <internalNodes>
        0 -1 261489 -1.0108117014169693e-002</internalNodes>
      <leafValues>
        -5.4940515756607056e-001 8.8841408491134644e-002</leafValues></_>
    <_>
      <internalNodes>
        0 -1 130035 5.4724109359085560e-003</internalNodes>
      <leafValues>
        -1.2043732404708862e-001 4.2178526520729065e-001</leafValues></_>
    <_>
      <internalNodes>
        0 -1 169327 1.4671026729047298e-003</internalNodes>
      <leafValues>
        7.1102149784564972e-002 -7.7035295963287354e-001</leafValues></_>
    <_>
      <internalNodes>
        0 -1 239583 8.0850318772718310e-004</internalNodes>
      <leafValues>
        -1.1630608886480331e-001 4.0314516425132751e-001</leafValues></_></weakClassifiers></stage9>
</opencv_storage>
