<?xml version="1.0"?>
<opencv_storage>
<stage1>
  <maxWeakCount>16</maxWeakCount>
  <stageThreshold>-1.9329625368118286e+000</stageThreshold>
  <weakClassifiers>
    <_>
      <internalNodes>
        0 -1 9186 -8.8879220187664032e-002</internalNodes>
      <leafValues>
        3.0765810608863831e-001 -9.3140250444412231e-001</leafValues></_>
    <_>
      <internalNodes>
        0 -1 4275 -2.5118958204984665e-002</internalNodes>
      <leafValues>
        6.7263150215148926e-001 -1.7531925439834595e-001</leafValues></_>
    <_>
      <internalNodes>
        0 -1 218656 -3.5084374248981476e-002</internalNodes>
      <leafValues>
        6.1973345279693604e-001 -1.9197888672351837e-001</leafValues></_>
    <_>
      <internalNodes>
        0 -1 67977 7.4192322790622711e-003</internalNodes>
      <leafValues>
        -2.4249848723411560e-001 5.2692520618438721e-001</leafValues></_>
    <_>
      <internalNodes>
        0 -1 252794 -6.6893603652715683e-003</internalNodes>
      <leafValues>
        6.6778105497360229e-001 -1.5884827077388763e-001</leafValues></_>
    <_>
      <internalNodes>
        0 -1 20295 -2.2951267659664154e-002</internalNodes>
      <leafValues>
        7.1291148662567139e-001 -1.6178978979587555e-001</leafValues></_>
    <_>
      <internalNodes>
        0 -1 102520 -4.3684963136911392e-002</internalNodes>
      <leafValues>
        3.5387811064720154e-001 -2.5534090399742126e-001</leafValues></_>
    <_>
      <internalNodes>
        0 -1 167471 -8.3430362865328789e-003</internalNodes>
      <leafValues>
        4.6711328625679016e-001 -2.0295804738998413e-001</leafValues></_>
    <_>
      <internalNodes>
        0 -1 219763 -2.5990668684244156e-002</internalNodes>
      <leafValues>
        7.4089515209197998e-001 -1.2085670232772827e-001</leafValues></_>
    <_>
      <internalNodes>
        0 -1 69105 -1.2253178283572197e-002</internalNodes>
      <leafValues>
        6.3474005460739136e-001 -1.5886652469635010e-001</leafValues></_>
    <_>
      <internalNodes>
        0 -1 225921 -3.9509400725364685e-002</internalNodes>
      <leafValues>
        6.1529141664505005e-001 -1.5888978540897369e-001</leafValues></_>
    <_>
      <internalNodes>
        0 -1 12397 -5.8837477117776871e-003</internalNodes>
      <leafValues>
        -7.2825437784194946e-001 1.5321329236030579e-001</leafValues></_>
    <_>
      <internalNodes>
        0 -1 216600 -7.6867669820785522e-002</internalNodes>
      <leafValues>
        4.7587993741035461e-001 -1.8346197903156281e-001</leafValues></_>
    <_>
      <internalNodes>
        0 -1 33851 -5.2809817716479301e-003</internalNodes>
      <leafValues>
        -1.1445952653884888e+000 9.1007366776466370e-002</leafValues></_>
    <_>
      <internalNodes>
        0 -1 17500 7.2156451642513275e-003</internalNodes>
      <leafValues>
        1.4768858253955841e-001 -8.8505065441131592e-001</leafValues></_>
    <_>
      <internalNodes>
        0 -1 250676 -4.5000333338975906e-003</internalNodes>
      <leafValues>
        6.8233382701873779e-001 -1.5554226934909821e-001</leafValues></_></weakClassifiers></stage1>
</opencv_storage>
