%YAML 1.1
%TAG !u! tag:unity3d.com,2011:
--- !u!1 &6838502275817159291
GameObject:
  m_ObjectHideFlags: 0
  m_CorrespondingSourceObject: {fileID: 0}
  m_PrefabInstance: {fileID: 0}
  m_PrefabAsset: {fileID: 0}
  serializedVersion: 6
  m_Component:
  - component: {fileID: 1654362411402891468}
  - component: {fileID: 8964397652034255525}
  - component: {fileID: 6376139152346339552}
  m_Layer: 0
  m_Name: AudioManager
  m_TagString: Untagged
  m_Icon: {fileID: 0}
  m_NavMeshLayer: 0
  m_StaticEditorFlags: 4294967295
  m_IsActive: 1
--- !u!4 &1654362411402891468
Transform:
  m_ObjectHideFlags: 0
  m_CorrespondingSourceObject: {fileID: 0}
  m_PrefabInstance: {fileID: 0}
  m_PrefabAsset: {fileID: 0}
  m_GameObject: {fileID: 6838502275817159291}
  m_LocalRotation: {x: 0, y: 0, z: 0, w: 1}
  m_LocalPosition: {x: 0, y: 0, z: 0}
  m_LocalScale: {x: 1, y: 1, z: 1}
  m_Children: []
  m_Father: {fileID: 0}
  m_RootOrder: 0
  m_LocalEulerAnglesHint: {x: 0, y: 0, z: 0}
--- !u!114 &8964397652034255525
MonoBehaviour:
  m_ObjectHideFlags: 0
  m_CorrespondingSourceObject: {fileID: 0}
  m_PrefabInstance: {fileID: 0}
  m_PrefabAsset: {fileID: 0}
  m_GameObject: {fileID: 6838502275817159291}
  m_Enabled: 1
  m_EditorHideFlags: 0
  m_Script: {fileID: 11500000, guid: 452f789e3447ac44c9c0f7b2e28f843b, type: 3}
  m_Name: 
  m_EditorClassIdentifier: 
  audioSourcePoolSize: 30
  defaultAudioSource: {fileID: 295157994593591646, guid: d60e9eb5c63ffc647a33d4764f200b8b,
    type: 3}
  audioSourceParent: {fileID: 0}
  audioClipContainers:
  - {fileID: 11400000, guid: 26470d33bef1b724a82829474e8df469, type: 2}
--- !u!81 &6376139152346339552
AudioListener:
  m_ObjectHideFlags: 0
  m_CorrespondingSourceObject: {fileID: 0}
  m_PrefabInstance: {fileID: 0}
  m_PrefabAsset: {fileID: 0}
  m_GameObject: {fileID: 6838502275817159291}
  m_Enabled: 1
