500	281	3
500	366	3
500	333	3
500	343	3
500	375	3
500	333	3
500	332	3
500	342	3
500	366	3
400	400	3
500	333	3
500	375	3
500	375	3
500	375	3
500	369	3
500	373	3
500	333	3
380	500	3
500	333	3
500	382	3
500	366	3
500	319	3
500	375	3
500	375	3
500	342	3
500	254	3
500	375	3
500	335	3
500	335	3
500	291	3
500	373	3
500	333	3
500	333	3
500	375	3
500	333	3
500	333	3
500	333	3
500	375	3
500	375	3
500	400	3
500	375	3
500	333	3
500	444	3
375	500	3
500	375	3
500	333	3
500	336	3
500	333	3
500	357	3
500	375	3
500	278	3
500	322	3
500	375	3
500	375	3
500	342	3
500	333	3
500	375	3
500	375	3
500	375	3
500	274	3
500	375	3
500	297	3
500	241	3
500	375	3
500	375	3
500	375	3
500	375	3
500	335	3
500	333	3
500	375	3
500	375	3
500	265	3
500	371	3
500	375	3
500	333	3
500	333	3
500	375	3
500	375	3
500	375	3
500	333	3
500	333	3
500	375	3
500	146	3
500	333	3
500	335	3
500	375	3
500	375	3
500	400	3
500	333	3
500	375	3
500	333	3
500	333	3
500	314	3
500	375	3
500	375	3
500	332	3
500	334	3
500	375	3
500	337	3
500	230	3
500	375	3
500	375	3
500	333	3
500	375	3
500	333	3
500	333	3
500	313	3
500	345	3
500	333	3
500	402	3
500	332	3
500	375	3
500	329	3
500	240	3
500	347	3
500	375	3
500	332	3
500	375	3
500	375	3
500	333	3
500	327	3
500	333	3
500	333	3
500	333	3
500	333	3
500	322	3
500	333	3
500	333	3
500	313	3
500	333	3
500	375	3
500	375	3
500	333	3
500	375	3
500	333	3
500	333	3
375	500	3
500	333	3
500	333	3
500	334	3
500	375	3
500	375	3
500	375	3
500	332	3
500	375	3
500	332	3
500	333	3
500	332	3
500	333	3
500	375	3
500	333	3
500	333	3
500	388	3
500	333	3
500	333	3
500	333	3
500	375	3
375	500	3
375	500	3
500	375	3
500	357	3
500	363	3
500	375	3
293	500	3
500	333	3
500	333	3
348	500	3
500	357	3
500	333	3
500	375	3
375	500	3
500	333	3
500	335	3
500	375	3
500	167	3
500	375	3
500	333	3
500	375	3
500	333	3
500	375	3
500	344	3
500	375	3
500	333	3
500	334	3
500	334	3
500	375	3
500	333	3
500	333	3
500	333	3
500	338	3
500	343	3
500	333	3
500	333	3
500	333	3
500	333	3
500	375	3
500	375	3
500	375	3
500	331	3
500	333	3
500	321	3
500	375	3
500	333	3
500	334	3
500	317	3
500	317	3
500	375	3
500	370	3
500	375	3
500	375	3
500	332	3
500	375	3
500	274	3
500	334	3
500	333	3
500	333	3
500	333	3
500	333	3
500	333	3
500	332	3
500	357	3
266	400	3
500	375	3
500	375	3
333	500	3
500	333	3
500	333	3
333	500	3
500	333	3
500	375	3
500	333	3
500	375	3
500	333	3
500	332	3
500	318	3
500	375	3
500	375	3
500	236	3
500	375	3
500	375	3
500	375	3
500	375	3
500	338	3
500	333	3
500	500	3
500	375	3
500	387	3
500	333	3
500	333	3
471	284	3
500	333	3
500	333	3
500	335	3
500	375	3
500	333	3
500	375	3
500	482	3
500	333	3
500	333	3
500	333	3
500	400	3
500	223	3
500	354	3
500	363	3
500	375	3
500	333	3
500	375	3
500	333	3
500	362	3
500	333	3
500	375	3
500	375	3
500	333	3
500	232	3
500	229	3
500	375	3
500	357	3
500	333	3
500	375	3
375	500	3
500	375	3
3	334	500
3	333	500
3	334	500
3	333	500
3	273	500
3	333	500
3	375	500
3	334	500
3	325	500
3	333	500
3	334	500
3	325	500
3	324	500
3	335	500
3	206	500
3	366	500
3	357	500
3	338	500
3	333	500
3	334	500
3	375	500
3	377	500
3	240	360
3	332	500
3	333	500
3	345	500
3	334	500
3	333	500
3	334	500
3	375	500
3	333	500
3	333	500
3	334	500
3	310	500
3	335	500
3	375	500
3	333	500
3	333	500
3	333	500
3	333	500
3	333	500
3	333	500
3	375	500
3	229	500
3	333	500
3	344	500
3	343	500
3	333	500
3	333	500
3	375	500
3	333	500
3	334	500
3	182	500
3	169	500
3	336	500
3	375	500
3	333	500
3	357	500
3	500	396
3	296	500
3	333	500
3	339	500
3	375	500
3	500	346
3	334	500
3	269	500
3	333	500
3	375	500
3	375	500
3	333	500
3	304	500
3	317	500
3	333	500
3	334	500
3	500	375
3	333	500
3	333	500
3	319	500
3	333	500
3	500	333
3	281	500
3	333	500
3	334	500
3	334	500
3	333	500
3	347	500
3	375	500
3	333	500
3	333	500
3	375	500
3	333	500
3	500	333
3	333	500
3	327	500
3	333	500
3	333	500
3	333	500
3	333	500
3	333	500
3	372	500
3	335	500
3	333	500
3	333	500
3	333	500
3	335	500
3	276	500
3	333	500
3	375	500
3	333	500
3	375	500
3	333	500
3	375	500
3	313	500
3	500	333
3	333	500
3	333	500
3	333	500
3	317	500
3	333	500
3	334	500
3	333	500
3	377	500
3	333	500
3	333	500
3	334	500
3	375	500
3	333	500
3	375	500
3	500	375
3	337	500
3	333	500
3	375	500
3	333	500
3	333	500
3	375	500
3	333	500
3	335	500
3	372	500
3	334	500
3	333	500
3	333	500
3	350	500
3	375	500
3	335	500
3	375	500
3	319	500
3	333	500
3	375	500
3	175	500
3	375	500
3	375	500
3	375	500
3	376	500
3	333	500
3	333	500
3	355	500
3	375	500
3	335	500
3	223	500
3	313	500
3	375	500
3	333	500
3	333	500
3	323	500
3	333	500
3	333	500
3	334	500
3	333	500
3	332	500
3	375	500
3	388	500
3	333	500
3	333	500
3	375	500
3	335	500
3	333	500
3	333	500
3	333	500
3	375	500
3	334	500
3	375	500
3	357	500
3	375	500
3	375	500
3	375	500
3	333	500
3	335	500
3	234	500
3	336	500
3	353	500
3	347	500
3	332	500
3	375	500
3	375	500
3	375	500
3	338	500
3	375	500
3	375	500
3	318	500
3	433	500
3	333	500
3	332	500
3	333	500
3	500	375
3	317	500
3	333	500
3	263	394
3	333	500
3	332	500
3	500	375
3	333	500
3	266	500
3	375	500
3	369	492
3	375	500
3	335	500
3	333	500
3	333	500
3	375	500
3	326	500
3	341	500
3	306	500
3	369	500
3	333	500
3	333	500
3	375	500
3	333	500
3	333	500
3	375	500
3	253	500
3	333	500
3	375	500
3	333	500
3	375	500
3	333	500
3	313	500
3	348	500
3	332	500
3	268	500
3	349	500
3	331	500
3	375	500
3	375	500
3	375	500
3	375	500
3	333	500
3	143	500
3	333	500
3	196	500
3	333	500
3	333	500
3	206	500
3	333	500
3	375	500
3	375	500
3	333	500
3	375	500
3	333	500
3	500	334
3	250	500
3	332	500
3	333	500
3	293	500
3	401	500
3	333	500
3	333	500
3	333	500
3	333	500
3	331	500
3	375	500
3	333	500
3	332	500
3	339	500
3	375	500
3	333	500
3	375	500
3	375	500
3	192	500
3	425	500
3	334	500
3	333	500
3	375	500
3	334	500
3	375	500
3	375	500
3	333	500
3	332	500
3	281	500
3	387	500
3	375	500
3	375	500
3	333	500
3	500	333
3	375	500
3	333	500
3	333	500
3	349	500
3	333	500
3	375	500
3	375	500
3	375	500
3	333	500
3	375	500
3	321	500
3	500	333
3	356	500
3	333	500
3	350	500
3	375	500
3	358	500
3	333	500
3	375	500
3	333	500
3	375	500
3	375	500
3	375	500
3	375	500
3	375	500
3	333	500
3	500	349
3	335	500
3	338	500
3	375	500
3	258	500
3	333	500
3	333	500
3	299	450
3	375	500
3	333	500
3	333	500
3	335	500
3	375	500
3	375	500
3	375	500
3	375	500
3	333	500
3	375	500
3	375	500
3	313	500
3	330	500
3	334	500
3	375	500
3	255	500
3	332	500
3	333	500
3	375	500
3	333	500
3	258	500
3	375	500
3	375	500
3	400	500
3	375	500
3	333	500
3	333	500
3	375	500
3	333	500
3	333	500
3	289	500
3	397	500
3	375	500
3	375	500
3	344	500
3	500	333
3	336	500
3	313	500
3	500	334
3	287	437
3	375	500
3	333	500
3	334	500
3	333	500
3	335	500
3	382	500
3	500	375
3	333	500
3	333	500
3	332	500
3	375	500
3	333	500
3	332	500
3	333	500
3	333	500
3	500	333
3	333	500
3	281	500
3	333	500
3	289	500
3	375	500
3	375	500
3	333	500
3	332	500
3	287	500
3	500	375
3	333	500
3	399	500
3	333	500
3	375	500
3	333	500
3	375	500
3	333	500
3	475	500
3	375	500
3	337	500
3	333	500
3	375	500
3	376	500
3	324	500
3	375	500
3	333	500
3	333	500
3	263	500
3	333	500
3	364	500
3	333	500
3	375	500
3	333	500
3	332	500
3	333	500
3	375	500
3	252	500
3	331	500
3	375	500
3	375	500
3	375	500
3	333	500
3	332	500
3	335	500
3	352	500
3	375	500
3	356	500
3	333	500
3	375	500
3	332	500
3	343	500
3	403	500
