#!groovy

String basePath = 'jobsdsl'

String repo = System.getenv("PROJECT_REPO_PROTOCOL")+System.getenv("PROJECT_REPO_HOST")+"/"+System.getenv("PROJECT_REPO_USER")+"/"+System.getenv("PROJECT_REPO_NAME")
String pipeline = System.getenv("PROJECT_NAME")+"-pipeline"

folder(basePath) {

  description 'Pipepine do projeto'

}

pipelineJob(pipeline) {

  definition {   

    cpsScm {
      

      scm {

        git {

          remote {

            url(repo)
            
            branches('master')
            
            //credentials('repo')

          }

        }

      }


      scriptPath('Jenkinsfile')

    }

  }

  triggers {

      cron('@midnight')

  }

}
