M48
INCH,TZ
VER,1
FMAT,2
DETECT,ON
ATC,ON
T1C0.02362
T2C0.03500
T3C0.03917
T4C0.03543
T5C0.11833
T6C0.03333
%
T1
X2.53000Y2.47000
X2.51000Y1.81000
X2.49000Y2.86000
X1.73000Y2.52000
X1.46000Y2.53000
X1.24000Y2.35000
X1.81000Y1.82000
Y2.11000
X1.63000Y2.34000
X2.16000Y1.83000
X2.41000Y1.81000
X2.34000Y1.94000
X2.33000Y2.46000
X1.24000Y2.60000
X1.13000Y3.52000
X1.87000Y2.94000
X1.46000Y2.95000
X1.55000Y3.51000
X1.42000Y3.71000
X1.85000Y3.47000
X1.74000Y3.51000
X2.42000Y2.86000
X2.32000Y2.60000
X2.40000Y2.70000
X1.94000Y3.53000
X2.36000Y3.54000
X2.29000Y3.51000
X2.65000Y2.52000
X2.77000Y2.51000
X2.84000Y1.82000
X2.57000Y1.63000
X2.76000Y1.82000
X2.74000Y2.46000
X2.66000Y2.63000
X2.79000Y3.18000
T2
X2.56000Y3.62000
X2.06000
X2.16000
X2.36000
X2.26000
X2.46000
X2.66000
X2.56000Y1.72000
X2.36000
X2.26000
X2.46000
X2.66000
X2.17000Y3.07000
X2.07000
X1.97000
X2.37000
X2.27000
X2.47000
X2.17000Y3.37000
X2.07000
X1.97000
X2.37000
X2.27000
X2.47000
X2.67000Y3.07000
X2.57000
X2.67000Y3.37000
X2.57000
X2.52000Y2.03000
Y2.33000
X2.22000Y2.03000
Y2.33000
X2.12000Y2.03000
Y2.33000
X2.32000Y2.03000
X2.42000
X2.32000Y2.33000
X2.42000
X2.72000Y2.03000
X2.62000
X2.72000Y2.33000
X2.62000
X1.86000Y1.72000
X1.56000
X1.36000
X1.46000
X1.76000
X1.66000
X1.96000
X1.30000Y3.62000
X1.10000
X1.00000
X1.20000
X1.60000
X1.40000
X1.50000
X1.70000
X1.80000
X1.29000Y3.07000
Y3.37000
X1.09000Y3.07000
X1.19000
X1.09000Y3.37000
X1.19000
X1.59000Y3.07000
X1.39000
X1.49000
X1.69000
X1.79000
X1.59000Y3.37000
X1.39000
X1.49000
X1.69000
X1.79000
X0.92000Y3.30000
X3.04000Y2.50833
Y2.18333
Y2.07500
Y2.40000
Y2.29167
Y3.15833
Y2.83333
Y2.61667
Y2.72500
Y2.94167
Y3.05000
Y3.26667
X2.94000Y2.23667
Y2.02000
Y2.12833
Y2.34500
Y2.45333
Y2.67000
Y2.56167
Y2.77833
Y2.99500
Y2.88667
Y3.10333
Y3.21167
T3
X1.96000Y3.62000
X2.16000Y1.72000
X1.26000
X0.90000Y3.62000
X0.92000Y3.20000
T4
X1.87507Y2.81598
Y2.67818
X1.50000Y2.80903
Y2.67124
T5
X2.99000Y1.74333
Y3.59333
T6
X2.94000Y3.32000
M30
