G04 Generated by Ultiboard 11.0 *
%FSLAX25Y25*%
%MOIN*%

%ADD10C,0.00500*%
%ADD11R,0.04567X0.07165*%


G04 ColorRGB 009966 for the following layer *
%LNPaste Mask Bottom*%
%LPD*%
%FSLAX25Y25*%
%MOIN*%
G54D10*
X62488Y144126D02*
X62488Y173714D01*
X62488Y144126D02*
X93940Y144126D01*
X377003Y144126D02*
X345551Y144126D01*
X377003Y144126D02*
X377003Y173714D01*
X377003Y440003D02*
X377003Y410415D01*
X377003Y440003D02*
X345551Y440003D01*
X62488Y440003D02*
X93940Y440003D01*
X62488Y440003D02*
X62488Y410415D01*
X42803Y144126D02*
X3433Y144126D01*
X23118Y124441D02*
X23118Y163811D01*
X8354Y144126D02*
G75*
D01*
G02X8354Y144126I14764J0*
G01*
X396688Y144126D02*
X436058Y144126D01*
X416373Y124441D02*
X416373Y163811D01*
X401609Y144126D02*
G75*
D01*
G02X401609Y144126I14764J0*
G01*
X411451Y144126D02*
G75*
D01*
G02X411451Y144126I4921J0*
G01*
X42803Y440003D02*
X3433Y440003D01*
X23118Y420317D02*
X23118Y459688D01*
X8354Y440003D02*
G75*
D01*
G02X8354Y440003I14764J0*
G01*
X13276Y440003D02*
G75*
D01*
G02X13276Y440003I9843J0*
G01*
X18197Y440003D02*
G75*
D01*
G02X18197Y440003I4921J0*
G01*
G54D11*
X152193Y296858D03*
X163807Y296858D03*
X204193Y350000D03*
X215807Y350000D03*

M00*
