216,Campus Kitchens,Brittain Dining Hall,Packed left over food from Brittain.,2018-01-19,1.0,0.0,Nicholas,Trinh,2018-01-19 20:20:18.527522,Approved
217,Campus Kitchens,Campus Kitchens,A typical campus Kitchens venture. Packaged food at Brittain for the GT food pantry. ,2018-01-19,1.0,0.0,Ethan,Cain,2018-01-22 21:02:52.207367,Approved
219,King of Hearts,Alpha Phi,Raise Money for Alpha Phi's philanthrophy,2018-01-24,0.0,15.0,Michael,Chen,2018-01-24 16:20:10.04946,Approved
220,Blood Drive,Red Cross,Donated that good good blood!,2018-01-30,2.0,0.0,Alex,Gibson,2018-01-30 18:53:32.748316,Approved
222,Campus Kitchen,Campus Kitchen,Hi Jae Hee,2018-01-19,1.0,0.0,Jason,Lieb,2018-01-30 22:11:44.16272,Approved
223,King of Hearts Donation,Alpha Phi,Gave Aaron $30 for his King of Hearts Campaign,2018-01-24,2.0,0.0,Zaeem,Adamjee,2018-01-31 17:43:26.68452,Approved
224,Red-Cross Blood Drive,Red Cross,RedCross Blood Drive,2018-01-31,1.0,0.0,Zaeem,Adamjee,2018-01-31 17:44:17.438937,Approved
225,Money Donation,Special Olympics,"Every lease signed at Sq5 during the past couple of weeks had $50 go to a charity of my choice, and I chose the special olympics",2018-02-02,0.0,50.0,Michael,Chen,2018-02-02 19:42:10.305931,Approved
221,Blood drive ,Red cross,I gave blood. ,2018-01-30,1.0,0.0,Evan,Shellow,2018-01-30 19:55:10.46658,Approved
226,King of Hearts ,Alpha Phi,Donated to Aaron's fund,2018-02-02,0.0,40.0,Joseph,Stamm,2018-02-03 00:48:06.232809,Approved
227,Campus Kitchen - Hi JP,Campus Kitchen,Hi,2018-02-02,1.0,0.0,Jason,Lieb,2018-02-03 08:28:27.60743,Approved
228,Strawberry Fundraiser,ZTA at Georgia Tech,Bought strawberries for breast cancer philanthropy,2018-02-05,0.0,22.0,Will,Mitchell,2018-02-05 16:27:00.233617,Approved
229,Campus Kitchens ,Brittain Dining Hall,Packaged leftover food,2018-02-02,1.0,0.0,Nicholas,Trinh,2018-02-06 04:34:48.335251,Approved
231,Campus Kitchen,Campus Kitchens,For campus Kitchens,2018-02-07,1.0,0.0,Justin,Wong,2018-02-08 00:15:31.687855,Approved
232,King of Hearts,Alpha Phi,I donated 15$ for Aaron King of Hearts,2018-02-08,0.0,15.0,Evan,Shellow,2018-02-08 06:16:25.426111,Approved
233,Making Soap,4-H,We made little soaps for the people at the homeless shelter and under priveledged kids in Athens. ,2018-02-03,2.0,0.0,Jack,Jehle,2018-02-08 17:10:26.017881,Approved
234,Campus Kitchens,Brittain Dining Hall,Packed food for hungry people,2018-02-09,1.0,0.0,Nicholas,Trinh,2018-02-09 20:27:05.339133,Approved
235,Campus Kitchen,Phi Sigma Kappa,Volunteering at Brittain packing food,2018-02-09,2.0,0.0,Justin,Wong,2018-02-10 02:10:11.438706,Approved
236,Swim meet timing ,ASA,Times at a swim meet,2018-02-10,5.0,0.0,Justin,Wong,2018-02-10 20:16:13.150718,Approved
240,Swim meet timing ,ASA,Timed for a swim meet day from 9 to 1,2018-02-11,4.0,0.0,Justin,Wong,2018-02-11 18:48:57.770041,Approved
237,EWH Repair Session,Engineering World Health,Go to Medshare and repair broken medical equipment to be sent to countries in need,2018-02-10,3.0,0.0,George,McAlear,2018-02-11 01:19:32.937001,Approved
238,Campus Kitchen,Campus Kitchen,Campus Kitchen,2018-02-10,1.0,0.0,Jason,Lieb,2018-02-11 01:38:35.242242,Approved
239,Repair Session,Engineering World Health,Repaired electrosurgical units and troubleshooted them on actual humans. Just kidding we used hot dogs.,2018-02-10,3.0,0.0,Winston,Wu,2018-02-11 03:45:45.802775,Approved
241,Red Rose Project,IFC/CPC,Bought roses,2018-02-11,0.0,15.0,Alex,Gibson,2018-02-11 20:29:12.356211,Approved
243,Girl scouts,Girl scouts,I bought 4 boxes of Samoas,2018-02-12,0.0,16.0,Evan,Shellow,2018-02-12 14:22:42.281925,Approved
242,Medical Device Repairs,Engineering World Health,Helped test medical devices for defects before they are sent to be used. Ask Winston for verification if needed. He is the club president,2018-02-10,3.0,0.0,Nathan,Webster,2018-02-12 03:35:38.889431,Approved
244,Aaron Young King of Hearts,Alpha Phi,Sent him that slick cash,2018-02-13,0.0,30.0,Preben,Are,2018-02-13 13:41:01.04851,Approved
245,Hoops for Hunger,Alpha Gamma Delta,March Madness bracket challenge for AGD,2018-02-15,0.0,7.0,Will,Mitchell,2018-02-15 15:01:37.290028,Approved
246,Money Donation,FTK,FTK Donation,2018-02-15,0.0,5.0,Michael,Chen,2018-02-15 19:29:04.668797,Approved
248,Campus Kitchens,Brittain Dining Hall,Packed food bitch,2018-02-16,1.0,0.0,Nicholas,Trinh,2018-02-16 20:08:05.361642,Approved
249,Girl Scout Cookies,Girl Scouts of America,I love trefoils,2018-02-20,0.0,12.75,Will,Mitchell,2018-02-20 18:26:51.803154,Approved
247,Puppy party,For the kids,Pay to pet puppers,2018-02-16,0.0,3.0,Evan,Shellow,2018-02-16 18:36:25.902518,Approved
250,Girl Scout Cookies,Girl Scouts,Bought 2 boxes of girl scout cookies,2018-02-21,0.0,0.0,Junwoo,Park,2018-02-21 22:33:17.958983,Approved
251,I was sober,Campus Kitchen,Campus kitchen,2018-02-23,1.0,0.0,Jason,Lieb,2018-02-23 20:37:55.047568,Approved
252,Food packing ,Campus Kitchens,Packed food for campus Kitchens ,2018-02-23,1.0,0.0,Justin,Wong,2018-02-23 20:41:45.774516,Approved
254,Grant Park,Grant Park Conservancy,Park,2018-02-24,3.0,0.0,Jason,Lieb,2018-02-24 16:56:37.866227,Approved
253,Campus Kitchen ,Campus Kitchen,We packed crates full with leftover food for students/people in need. ,2018-02-23,1.0,0.0,Arjun,Khadse,2018-02-24 00:01:10.309336,Approved
255,Experiment Subject,Psychology SONA Systems,volunteered to participate in a study for SONA,2018-02-26,1.5,0.0,Ken,Baynes,2018-02-26 13:15:21.463012,Approved
256,Repair Session,Engineering World Health,Repair broken/used medical devices to be shipped to countries in Africa/hurricane relief,2018-02-24,3.0,0.0,Winston,Wu,2018-02-27 14:14:23.941585,Approved
258,Grant Park Cleanup,Hands on Atlanta,Removed invasive species in Grant Park with Loprinzo and Jason. Got poison ivy. ,2018-02-24,3.0,0.0,Ethan,Cain,2018-02-27 18:57:18.264579,Approved
257,Girl Scout Cookies,idk Girl Scouts?,Bought 4 boxes ($16) of cookies,2018-02-27,0.0,16.0,Winston,Wu,2018-02-27 14:16:37.551711,Approved
259,EWH Repair Session,Engineering World Health,Repaired medical equipment at Medshare,2018-02-24,3.0,0.0,George,McAlear,2018-03-01 18:18:49.624861,Approved
262,Campus Kitchens,Campus Kitchens,Packed food per norm,2018-03-02,1.0,0.0,Justin,Wong,2018-03-05 19:48:41.203857,Approved
260,Campus Kitchen ,Campus Kitchen,Wrapped and packed up leftover food for those in need,2018-03-02,1.0,0.0,Arjun,Khadse,2018-03-02 20:40:57.939779,Approved
261,MobilePack,Feed My Starving Children,"Made meals  for the Feed My Starving Children program (fmsc.org). We made 32,000 meals as a group. Side note, if we could get this group involved with the ifc that would be lit it was a really cool event to be a part of. ",2018-03-03,2.0,0.0,Ethan,Cain,2018-03-03 20:26:59.695794,Approved
264,Campus Kitchens,Brittain Dining Hall,Sexual favors,2018-03-06,2.0,0.0,Nicholas,Trinh,2018-03-07 01:17:19.55374,Approved
265,Campus Kitchens,Brittain Dining Hall,Sexual favors,2018-02-27,1.0,0.0,Nicholas,Trinh,2018-03-07 18:12:04.331783,Approved
266,Girl Scout Cookies,Girl Scouts,Girl Scout Cookies,2018-02-28,0.0,16.0,Eli,Gerhard,2018-03-07 18:51:30.040978,Approved
267,Campus Kitchen,Campus Kitchen,Packaged leftover food for those in need,2018-03-09,1.0,0.0,Arjun,Khadse,2018-03-09 20:59:46.861402,Approved
268,Ryan and Liam Molina Gofundme,Gofundme,My good high school friend and 3 year soccer teammate's parents were recently killed and a Gofundme has been created to help fund his and his brothers college tuition and other expenses,2018-03-11,0.0,100.0,Evan,Shellow,2018-03-11 05:51:39.146595,Approved
269,Swim Met Timing,ASA,Timing for a swim meet,2018-03-10,3.25,0.0,Justin,Wong,2018-03-12 14:17:05.50507,Approved
270,Swim Meet Timing,ASA,Swim Meet timing,2018-03-11,4.0,0.0,Justin,Wong,2018-03-12 14:17:56.575413,Approved
276,Campus Kitchens,Brittain Dining Hall,"Did stuff
",2018-03-12,1.0,0.0,Nicholas,Trinh,2018-03-12 19:59:01.794091,Disapproved
277,Campus Kitchens,Brittain Dining Hall,Stuff,2018-03-09,1.0,0.0,Nicholas,Trinh,2018-03-12 20:00:05.748536,Approved
271,Crisis Counselor,Crisis Text Line,2 hr shift of working on a crisis line,2018-03-05,2.0,0.0,Rohan,Patel,2018-03-12 19:43:41.867057,Approved
272,Crisis Counselor,Crisis Text Line,"2 hr shift of working the crisis line, respond to texts/calls",2018-03-14,2.0,0.0,Rohan,Patel,2018-03-12 19:44:15.459491,Approved
273,Crisis Counselor,Crisis Text Line,"2 hr shift of working the crisis line, respond to texts/calls",2018-03-09,2.0,0.0,Rohan,Patel,2018-03-12 19:46:16.072363,Approved
274,Crisis Counselor,Crisis Text Line,"2 hr shift of working the crisis line, respond to texts/calls",2018-03-10,2.0,0.0,Rohan,Patel,2018-03-12 19:47:10.0363,Approved
275,Crisis Counselor,Crisis Text Line,"2 hr shift of working the crisis line, respond to texts/calls",2018-03-11,2.0,0.0,Rohan,Patel,2018-03-12 19:47:25.702806,Approved
278,EWH Repair Session,Engineering World Health,Repair broken medical equipment to be sent to countries in need,2018-03-10,3.0,0.0,George,McAlear,2018-03-12 22:02:50.783804,Approved
279,Campus Kitchen,Campus Kitchen,Campus Kitchen,2018-03-13,1.0,0.0,Gilberto,Barcellos,2018-03-14 00:13:48.799921,Approved
280,Campus Kitchens,Brittain Dining Hall,Did shit,2018-03-13,1.0,0.0,Nicholas,Trinh,2018-03-14 00:13:56.758444,Approved
281,Campus Kitchens,Campus Kitchens,The usual,2018-03-13,1.0,0.0,Ethan,Cain,2018-03-14 00:14:16.039479,Approved
282,Campus Kitchen,Campus Kitchen,Packaged leftover food for those in need,2018-03-13,1.0,0.0,Arjun,Khadse,2018-03-14 00:16:01.060597,Approved
283,Campus Kitchen,Campus Kitchen,C,2018-03-13,1.0,0.0,Jason,Lieb,2018-03-14 00:49:39.576744,Approved
285,Grilled cheese with Agd,Alpha gamma delta,Got some grilled cheese with agds,2018-03-15,0.0,6.0,Evan,Shellow,2018-03-16 03:48:45.426156,Approved
284,PSK Day of Giving,PSK Nationals,Slick cash donation to the Phi Sigma Kappa Foundation,2018-03-15,0.0,30.0,Preben,Are,2018-03-15 18:43:55.725385,Approved
286,Grilled Cheeses with ADGS,ADG,Got some food,2018-03-15,0.0,6.0,Justin,Wong,2018-03-16 14:03:44.757813,Approved
287,Foodpacking Shift,Campus Kitchens,feed the streets,2018-03-16,1.0,0.0,Dan,Charanis,2018-03-16 19:32:13.440363,Approved
289,Campus Kitchen ,Campus Kitchen,Packaged leftover food for those in need,2018-03-16,1.0,0.0,Arjun,Khadse,2018-03-18 00:48:04.427449,Approved
290,Campus Kitchen Cleaning,GaTech,We had to clean up leftovers from Brittain at 8pm.,2018-01-30,1.0,0.0,Jae Hee,Lee Lee,2018-03-21 02:43:55.099086,Approved
291,Campus Kitchen Cleaning,GaTech,We had to clean up leftovers from Brittain at 8pm.,2018-02-16,1.0,0.0,Jae Hee,Lee Lee,2018-03-21 02:44:36.370193,Approved
292,Campus Kitchen Cleaning,GaTech,We had to clean up leftovers from Brittain at 8pm.,2018-02-21,1.0,0.0,Jae Hee,Lee Lee,2018-03-21 02:45:19.222317,Approved
293,Campus Kitchen Cleaning,GaTech,We had to clean up leftovers from Brittain at 8pm.,2018-03-02,1.0,0.0,Jae Hee,Lee Lee,2018-03-21 02:45:54.38967,Approved
294,Campus Kitchen Cleaning,GaTech,We had to clean up leftovers from Brittain at 8pm.,2018-03-16,1.0,0.0,Jae Hee,Lee Lee,2018-03-21 02:46:11.849127,Approved
288,Iced Coffee,Phi Mu,They sold me coffee,2018-03-09,0.0,3.0,Will,Mitchell,2018-03-16 20:14:37.603562,Approved
295,Lets Taco Bout It,AXO,Ordered 3 tickets to the Taco philanthropy event.,2018-03-25,0.0,15.0,Dan,Charanis,2018-03-25 20:29:15.520947,Approved
296,grilled cheese and AGDs,AGD,"ate some bread with melted cheese on it, paid some money",2018-03-15,0.0,6.0,Thomas,Malchodi,2018-03-26 01:48:58.17248,Approved
297,hoops for hunger,agd,bought a march madness bracket,2018-03-25,0.0,7.0,Thomas,Malchodi,2018-03-26 01:50:01.906094,Approved
298,AXO Let's Taco About It,AXO,Philanth taco purchase to support domestic violence awareness,2018-03-29,0.0,15.0,Preben,Are,2018-03-26 02:01:41.131764,Approved
299,Taco Night,AXO,I eat tacos cuz they good,2018-03-29,0.0,15.0,Will,Mitchell,2018-03-26 02:11:17.361592,Approved
300,Taco Bout It,AXO,Tacos for philanthropy,2018-03-26,0.0,5.0,Nathan,Webster,2018-03-27 00:56:57.737577,Approved
301,DVA cookies AXO,AXO,I have paid 10 dollars for DVA cookies for charity cause organized by GT AXO!,2018-03-27,0.0,10.0,Jae Hee,Lee Lee,2018-03-27 18:16:55.818554,Approved
302,Campus Kitchens,Campus Kitchens,Packed leftover food for those in need,2018-03-27,1.0,0.0,Arjun,Khadse,2018-03-28 00:28:24.383918,Approved
303,Grilled Cheese with AGD's,Alpha Gamma Delta,Grilled cheeses,2018-03-15,0.0,6.0,Alex,Gibson,2018-03-29 03:58:50.639722,Approved
304,Let's Taco Bout It,Alpha Chi Omega,Tacos and tanks,2018-03-29,0.0,20.0,Alex,Gibson,2018-03-29 04:00:36.746836,Approved
305,Atlanta Humane Society,Atlanta Humane Society,Community service at the Atlanta Humane Society.,2018-03-29,2.0,0.0,Marcelo,Costa,2018-03-29 04:35:42.196062,Approved
306,ASB Oakland,ASB,"Monday-local trail and planting justice
Tuesday- planting justice
Wednesday- Elderly Homeless Center and planting justice
Thursday-Alameda Food Bank",2018-03-19,32.0,0.0,matthew,stout,2018-03-29 11:47:10.16713,Approved
307,Crisis Counselor,Crisis Text Line,On call crisis counselor,2018-03-14,2.0,0.0,Rohan,Patel,2018-03-30 12:43:28.796173,Approved
308,Crisis Counselor,Crisis Text Line,On call crisis counselor,2018-03-15,4.0,0.0,Rohan,Patel,2018-03-30 12:44:07.607076,Approved
309,Crisis Counselor,Crisis Text Line,On call crisis counselor,2018-03-19,2.0,0.0,Rohan,Patel,2018-03-30 12:44:26.928296,Approved
310,Crisis Counselor,On call crisis counselor,On call crisis counselor,2018-03-21,4.0,0.0,Rohan,Patel,2018-03-30 12:44:48.708287,Approved
311,Crisis Counselor,Crisis Text Line,On call crisis counselor,2018-03-23,2.0,0.0,Rohan,Patel,2018-03-30 12:45:20.483179,Approved
312,Crisis Counselor,Crisis Text Line,On call crisis counselor,2018-03-26,2.0,0.0,Rohan,Patel,2018-03-30 12:45:52.422049,Approved
313,Crisis Counselor,Crisis Text Line,On call crisis counselor,2018-03-28,4.0,0.0,Rohan,Patel,2018-03-30 12:46:09.067367,Approved
314,Let's Taco Bout It,AXO,Ate Tacos and Got a Tank Top,2018-03-29,0.0,20.0,Justin,Wong,2018-03-30 14:13:09.253297,Approved
315,Atlanta Humane Society,Atlanta Humane Society,We were cleaning the place including the pens where dogs stay for around 2 hours.,2018-03-28,2.0,0.0,Jae Hee,Lee Lee,2018-03-30 16:34:09.756623,Approved
316,Campus Kitchens,Brittain Dining Hall,Shit,2018-03-30,1.0,0.0,Nicholas,Trinh,2018-03-30 20:10:59.243213,Approved
317,Campus Kitchen,Campus Kitchen,Attended Campus Kitchen,2018-03-30,1.0,0.0,Marcelo,Costa,2018-03-31 05:00:41.298186,Approved
318,Campus Kitchens,Campus Kitchens,Packed leftover food for those in need,2018-03-30,1.0,0.0,Arjun,Khadse,2018-04-01 16:05:45.373802,Approved
319,Experiment Subject,Psychology SONA Systems,participated in a study,2018-04-01,3.5,0.0,Ken,Baynes,2018-04-01 17:28:34.408622,Approved
320,Life in the Garden @Collegetown,Hands on Atlanta,"From 10 am-4 pm on Sunday, I did gardening work and got a sunburn :).",2018-04-01,6.0,0.0,Dan,Charanis,2018-04-01 21:07:46.265608,Approved
321,Gave Blood,Greek Week,They drained my bodily fluids,2018-04-02,1.5,0.0,Will,Mitchell,2018-04-02 19:47:49.903669,Approved
322,Atlanta Humane Society,Atlanta Humane Society,Atlanta Humane Society,2018-03-28,2.0,0.0,Gilberto,Barcellos,2018-04-04 12:06:57.913727,Approved
323,Campus Kitchen,Campus Kitchen,Campus Kitchenette ,2018-03-30,1.0,0.0,Gilberto,Barcellos,2018-04-04 12:07:30.343171,Approved
324,Campus Kitchen,Campus Kitchen,Campus Kitchen ,2018-04-03,1.0,0.0,Gilberto,Barcellos,2018-04-04 12:08:05.136139,Approved
325,Blood Given,Red cross,Vampires got me,2018-04-04,1.0,0.0,Nathan,Webster,2018-04-04 17:06:51.595454,Approved
326,Blood Drive,Red Cross,Blood Drive,2018-04-04,1.0,0.0,Zaeem,Adamjee,2018-04-04 18:05:09.962423,Approved
327,Sting Hunger Now,GT,Sting Hunger Now,2018-04-04,1.0,0.0,Zaeem,Adamjee,2018-04-04 18:05:31.174409,Approved
328,Campus Kitchen,Campus Kitchen,Participated in the Campus Kitchen at Brittain at 8.,2018-04-03,1.0,0.0,Marcelo,Costa,2018-04-04 18:24:52.763609,Approved
329,Blood Drive,Red Cross,Greek week blood donation,2018-04-04,2.0,0.0,Alex,Gibson,2018-04-04 19:46:27.637422,Approved
330,Sting Hunger,Stop Hunger Now,packaging meals in Klaus,2018-04-04,1.25,0.0,Thomas,Malchodi,2018-04-04 20:35:26.788748,Approved
331,Food Packaging,Sting Hunger Now,Food packaging/prepping for Sting Hunger Now (Greek week activity),2018-04-05,3.0,0.0,Dylan,Jackson,2018-04-05 17:31:52.233949,Approved
332,Sting Hunger Now,Greek Week,"feed the streets, 12-2",2018-04-05,2.0,0.0,Dan,Charanis,2018-04-05 18:06:23.173557,Approved
333,Sting hunger,Stop hunger now,Packing meals,2018-04-05,1.75,0.0,Thomas,Malchodi,2018-04-05 19:51:04.808814,Approved
334,Food Packing ,Sting Hunger Now,Packed Food,2018-04-05,1.25,0.0,Michael,Chen,2018-04-06 02:04:08.700064,Approved
335,Let's Taco Bout It,Alpha Chi Omega,Tacos for DVA Awareness,2018-03-29,0.0,5.0,Michael,Chen,2018-04-06 02:05:26.509949,Approved
336,Alpha Gam Grilled Cheese,Alpha Gam,"Don't know the date, but I got grilled cheese for charity",2018-04-07,0.0,6.0,Eli,Gerhard,2018-04-07 17:27:24.090174,Approved
337,AXO Tacos,AXO,AXO Tacos for domestic violence awareness,2018-03-28,0.0,15.0,Eli,Gerhard,2018-04-07 17:28:06.959184,Approved
338,GoFundMe donation for Humbolt Broncos accident,Humbolt Broncos,GoFundMe donation to help families of a junior hockey team that was in a horrific bus crash.,2018-04-07,0.0,15.0,Eli,Gerhard,2018-04-07 17:30:01.855842,Approved
339,Grilled Cheese,Alpha Gam,AGD grilled cheese event thing,2018-03-16,0.0,6.17,Matt,Schoonover,2018-04-07 19:22:28.376424,Approved
340,Tech Beautification Day,GT,Tech Beautification Day,2018-04-07,5.0,0.0,Matt,Schoonover,2018-04-07 19:23:10.396513,Approved
341,TBD,Ga tech,Mulch and trees,2018-04-07,5.0,0.0,Sean,Fitzpatrick,2018-04-08 02:17:47.415315,Approved
342,TBD,Greek Week,"Tech Beautification Day Spring 2018 for Greek Week with Rohan Sr., Sean, Mouse, Omar, etc. ",2018-04-07,5.0,0.0,Dylan,Jackson,2018-04-09 04:29:30.792625,Approved
343,Runner for Meet Director,College Club Swimming,Ran papers and did results,2018-04-06,4.0,0.0,Justin,Wong,2018-04-09 14:32:44.755331,Approved
344,Timer,College Club Swimming,Timed for Finals,2018-04-08,1.5,0.0,Justin,Wong,2018-04-09 14:33:15.081613,Approved
348,Sting Hunger Now,Sting Hunger Now,Packed food,2018-04-05,1.5,0.0,Michael,Chen,2018-04-12 14:29:05.760404,Disapproved
345,Alumni Networking Dinner,BMES,Volunteered to help out during the BME student-alumni networking dinner.  Also helped set up and clean up.,2018-03-29,4.0,0.0,Brian,D'Agostino,2018-04-10 12:45:35.39646,Approved
346,BME Senior Sendoff,BMES,Helped set up and made sure the event was running smoothly,2018-04-05,2.0,0.0,Brian,D'Agostino,2018-04-10 12:50:05.407044,Approved
347,High School Swim Practice,Wall High School,Helped out my old high school team during swim practices in January,2018-01-03,5.0,0.0,Brian,D'Agostino,2018-04-10 21:02:53.618923,Approved
349,Campus Kitchen,Campus Kitchen,Campus Kitchen,2018-04-10,1.0,0.0,Gilberto,Barcellos,2018-04-12 20:08:13.676647,Approved
350,Greek Week Overall Chair,Greek Week,"As the head of Greek Week I gave countless hours to see that the organization had a successful week. As part of Greek Week there are 3 major philanthropies, Sting Hunger Now, TBD, and Red Cross Blood Drive. Through my administration of this organization the success of the philanthropy components was boosted, generating more good. I am merely asking for 8 hours even though my giving was beyond measure. ",2018-04-13,10.0,0.0,Joseph,Stamm,2018-04-12 20:10:08.582858,Approved
351,Campus Kitchen Cleaning ,GaTech,Helped collect food  left in Brittain.,2018-04-10,1.0,0.0,Jae Hee,Lee Lee,2018-04-13 16:23:40.387171,Approved
352,Campus Kitchen Cleaning ,GaTech,Helped clean up food from Brittain .,2018-04-06,1.0,0.0,Jae Hee,Lee Lee,2018-04-13 16:26:23.72527,Approved
353,Campus Kitchen,Campus Kitchen,Campus kitchen,2018-04-13,2.0,0.0,Jason,Lieb,2018-04-13 21:44:53.579246,Approved
354,Campus Kitchens,Campus Kitchens ,Packed up leftover food to give to food banks,2018-04-13,1.0,0.0,Arjun,Khadse,2018-04-13 22:09:48.029476,Approved
355,Packing Food,Campus Kitchens,PAcke dat FooD,2018-04-13,2.0,0.0,Justin,Wong,2018-04-15 17:31:17.732983,Approved
356,EWH Repair Session,Engineering World Health,Repair Session - Went to Medshare to test/repair medical devices to be sent to countries in need,2018-04-14,3.0,0.0,George,McAlear,2018-04-15 19:58:18.774458,Approved
357,Sickle Cell Anemia Race Registration,Registered through the Platt Lab,"I was unable to attend the race, but I still paid the registration fee which goes towards supporting sickle cell anemia research",2018-04-14,0.0,30.0,George,McAlear,2018-04-15 19:59:59.07042,Approved
358,Alpha Phi King of Hearts,Alpha Phi Philanthropy,Donated to Alpha Phi's King of Hearts philanthropy event.,2018-04-15,0.0,15.0,Nikhil,Deo,2018-04-15 20:25:00.490419,Approved
359,Blood Donation,Red Cross,Donated blood during greek week.,2018-04-10,1.0,0.0,Nikhil,Deo,2018-04-15 20:27:17.739123,Approved
360,Repair Session,Engineering World Health,Same as before. Repair medical devices that go to people that need it for free.,2018-04-14,3.0,0.0,Winston,Wu,2018-04-15 21:59:00.667229,Approved
362,Let's Taco About It,Alpha Chi Omega,Ticket for AXO's Taco event.,2018-04-16,0.0,7.0,Nikhil,Deo,2018-04-16 14:19:07.855766,Approved
363,Pie a Phi Mu,Phi Mu Philanthropy,Paid to pie a phi mu for philanthropy.,2018-02-16,0.0,4.0,Nikhil,Deo,2018-04-16 14:19:48.842333,Approved
364,Grilled Cheese with AGDs,AGD,Bought grilled cheese while very drunk. Sorry don't remember the date.,2018-03-15,0.0,7.0,Kevin,Kreulen,2018-04-16 18:30:39.747008,Approved
365,Tech Beautification Day,TBD,Spread mulch and planted trees,2018-04-07,4.5,0.0,Kevin,Kreulen,2018-04-16 18:31:17.055416,Approved
366,Crisis Counselor,Crisis Text Line,On line crisis counselor,2018-03-30,2.0,0.0,Rohan,Patel,2018-04-16 20:56:27.870276,Approved
361,Thetapalooza Ticket,Kappa Alpha Theta Philanthropy,Bought a ticket for KAT's philanthropy event.,2018-04-12,0.0,7.0,Nikhil,Deo,2018-04-16 14:17:35.135144,Approved
367,Volunteer,Starter Bikes,Helped fix bikes,2018-01-19,2.0,0.0,Nikita,Peker,2018-04-16 20:56:43.54926,Approved
368,Crisis Counselor,Crisis Text Line,On line crisis counselor,2018-04-02,2.0,0.0,Rohan,Patel,2018-04-16 20:56:45.826987,Approved
369,Volunteer,Starter Bikes,Helped fix bikes,2018-01-26,2.0,0.0,Nikita,Peker,2018-04-16 20:57:07.3691,Approved
370,Crisis Counselor,Crisis Text Line,On line crisis counselor,2018-04-04,4.0,0.0,Rohan,Patel,2018-04-16 20:57:09.841016,Approved
371,Crisis Counselor,Crisis Text Line,On line crisis counselor,2018-04-06,2.0,0.0,Rohan,Patel,2018-04-16 20:57:48.322599,Approved
372,Crisis Counselor,Crisis Text Line,On line crisis counselor,2018-04-07,2.0,0.0,Rohan,Patel,2018-04-16 20:59:17.545085,Approved
373,Campus Kitchens,The Campus Kitchen Project,Packed food in Brittain,2018-03-27,1.0,0.0,Simon,Fernandez,2018-04-17 18:05:05.190759,Approved
374,PigJig Tabling,Phi Sig,Tabled on Skilles from 12-1 on Tuesday,2018-04-17,1.0,0.0,Simon,Fernandez,2018-04-17 18:05:36.902579,Approved
375,Campus Kitchen,Campus Kitchen,Participated in Campus Kitchen at Brittain.,2018-04-06,1.0,0.0,Marcelo,Costa,2018-04-17 18:47:53.314844,Approved
376,Campus Kitchen,Campus Kitchen,Participated in Campus Kitchen at Brittain.,2018-04-10,1.0,0.0,Marcelo,Costa,2018-04-17 18:48:07.572905,Approved
377,Campus Kitchen,Campus Kitchen,Participated in Campus Kitchen at Brittain.,2018-04-13,1.0,0.0,Marcelo,Costa,2018-04-17 18:48:16.56338,Approved
378,Sting Hunger Now,Greek Week,Greek Week volunteering. Packaged food for an hour.,2018-04-05,1.0,0.0,Dhruv,Samdani,2018-04-17 20:13:01.925138,Approved
379,Pig Jig,Phi Sig,Donation to Pig Jig  from my parents,2018-03-27,0.0,100.0,Dhruv,Samdani,2018-04-17 20:22:42.429274,Approved
380,Pig Jig Tabling,Phi Sigma Kappa Philanthropy,Handed out flyers advertising Pig Jig.,2018-04-17,1.0,0.0,Nikhil,Deo,2018-04-17 20:38:36.160503,Approved
381,Experiment Subject,Psychology SONA Systems,participated in a psychological study,2018-04-18,1.0,0.0,Ken,Baynes,2018-04-18 16:36:04.09477,Approved
382,Alex's Lemonade Stand,Phi Kappa Psi Philanthropy,Bought lemonade to support Phi Psi's Philanthropy,2018-04-19,0.0,3.0,Nikhil,Deo,2018-04-19 19:09:56.951364,Approved
383,Pig Jig Tabling,Phi Sigma Kappa Philanthropy,Tables for pig jig,2018-04-19,3.0,0.0,Nikhil,Deo,2018-04-19 19:10:38.07775,Approved
384,Pig Jig,Phi Sig,Pig jig tickets ,2018-04-19,0.0,10.0,Evan,Shellow,2018-04-19 20:20:08.338537,Approved
385,Food Sorting,Atlanta Food Bank,We sorted food for the Atlanta Community Food Bank at my company,2018-04-13,6.0,0.0,Will,Mitchell,2018-04-20 00:31:48.992606,Approved
386,Pig Jig Tabling,Phi Sig,Handed out fliers for two hours,2018-04-20,2.0,0.0,Gilberto,Barcellos,2018-04-20 18:13:18.089331,Approved
387,Pig Jig Tabling,Phi Sig,Handing out flyers on Skiles,2018-04-20,1.5,0.0,Dhruv,Samdani,2018-04-20 18:51:06.268426,Approved
388,Campus Kitchen,Campus Kitchen,Attended Campus Kitchen at Brittain.,2018-04-20,1.0,0.0,Marcelo,Costa,2018-04-21 06:21:48.468719,Approved
389,Pig Jig Setup,Phi Sg,Helped with setup,2018-04-21,1.0,0.0,Nathan,Webster,2018-04-21 14:34:33.919861,Approved
390,Pig Jig Tix,Phi Sigma Kappa,"bought 3 tix for me, my dad, and my brother.",2018-04-21,0.0,30.0,Dylan,Jackson,2018-04-21 14:51:20.342439,Approved
391,Campus Kitchen,Campus Kitchen,Kitchens Campu,2018-04-20,1.0,0.0,Gilberto,Barcellos,2018-04-21 19:00:20.309415,Approved
392,Pig Jig,PHi Sigma Kappa,"$30 - Meals
$4 - Pied 4 people
1 hour - Getting Pied
1 hour - serving food",2018-04-21,2.0,34.0,Michael,Chen,2018-04-21 20:28:43.023475,Approved
393,Pig jig tabling,Phi sig,Tabled and bought food,2018-04-21,3.0,10.0,Sean,Fitzpatrick,2018-04-21 20:29:48.205126,Approved
394,Pig Jig ,Phi Sigma Kappa,Sold 5 tickets to Pig Jig + 1 pie in the face,2018-04-21,0.0,51.0,Ethan,Cain,2018-04-21 22:30:21.633674,Approved
395,Pig Jig Pie Board,Phi Sigma Kappa,"Created the pig jig pie board, went to the store and bought supplies, helped run it during pig jig, and cleaned up afterwards. I spent an hour making it, about 30 mins grocery shopping,  2 hours of on and off helping to run the event, and about 30 mins cleaning it. I think 3 service hours is fair, let me know if you have any discrepancies. ",2018-04-21,3.0,0.0,Ethan,Cain,2018-04-21 22:33:17.520489,Approved
396,Relay for life,Relay for life,Went to their philanthropy event ,2018-04-21,0.0,10.0,Evan,Shellow,2018-04-21 23:57:10.775606,Approved
397,Pig Jig Donation,Phi Sig,Parents' donation to our event,2018-04-21,0.0,200.0,Nathan,Webster,2018-04-22 00:09:05.769124,Approved
398,Pig Jig,Phi sigma Kappa,"Cooked, Prepped",2018-04-21,15.0,0.0,Justin,Wong,2018-04-22 01:19:21.803133,Approved
399,Pig Jig,Phi sigma Kappa,Donation,2018-04-21,0.0,20.0,Justin,Wong,2018-04-22 01:19:52.584293,Approved
400,Pig Jig Donation,Phi Sigma Kappa Philanthropy,Parents donated money to Pig Jig.,2018-03-27,0.0,100.0,Nikhil,Deo,2018-04-22 08:34:35.787325,Approved
401,pig jig,phi sig/special olympics,"serving, cleanup, plates bought, late plates bought",2018-04-21,2.5,20.0,Thomas,Malchodi,2018-04-22 16:06:58.35788,Approved
402,Pig Jig Smoker Pick-Up,PSK,Picked up that good good smoker,2018-04-20,2.5,0.0,Preben,Are,2018-04-22 17:38:24.339758,Approved
403,Pig Jig Tickets + Parent Donation,PSK,"$10 - My Ticket
$20 - Allison's Tickets
$50 - Parent Donation",2018-04-21,0.0,80.0,Preben,Are,2018-04-22 17:39:20.709571,Approved
404,Pig Jig,PSK,"woo special olympics

i was also tabling for a bit but i didn't sign up to table",2018-04-21,0.0,10.0,Ken,Baynes,2018-04-22 23:51:04.023495,Approved
405,Pig Jig cleanup,Phi Sigma Kappa,Cleaned up the kitchen and smoker,2018-04-21,4.0,0.0,Liam,Wilson,2018-04-23 00:49:00.456663,Approved
406,Pig Jig food,Phi Sigma Kappa,Bought food,2018-04-22,0.0,10.0,Liam,Wilson,2018-04-23 00:49:32.39338,Approved
407,Grilled Cheese with AGDs,Alpha Gamma Delta,Bought some friggen grilled cheeses,2018-03-01,0.0,10.0,Liam,Wilson,2018-04-23 00:50:19.353461,Approved
408,Campus Kitchens,Campus Kitchens,Packaged leftover food for those in need,2018-04-20,1.0,0.0,Arjun,Khadse,2018-04-23 14:23:14.844003,Approved
409,Pig Jig,PSK,Admission to Pig Jig + $5 in donations,2018-04-23,1.0,0.0,Zaeem,Adamjee,2018-04-23 16:35:42.231494,Approved
410,Pig Jig Volunteering,PSK,Tabling and Clean-Up,2018-04-21,3.0,0.0,Zaeem,Adamjee,2018-04-23 16:36:12.914214,Approved
411,Cornhole Tournament,Pig Jig,we lost,2018-04-23,0.0,15.0,Dan,Charanis,2018-04-23 16:55:46.584173,Approved
412,Pig Jig,Phi Sig,"Pork, pies and cornhole",2018-04-21,1.0,40.0,Alex,Gibson,2018-04-23 20:44:39.798924,Approved
414,pig jig tabling,special olympics,tabling,2018-04-18,1.0,0.0,Tyler,Lochan,2018-04-23 20:46:57.304402,Approved
416,Pig Jig,Special Olympics,Donated $100 and I completed two hours of service as seen on the spread sheet for volunteering that day.,2018-04-24,8.0,100.0,Dustin,Johnson,2018-04-24 15:22:15.892258,Approved
413,campus kitchens,campus kitchens,campus kitchens,2018-04-23,1.0,0.0,Tyler,Lochan,2018-04-23 20:46:25.10352,Disapproved
417,Greek Week Blood Donation,Red Cross,Donated Blood during greek week as can be seen on spread sheet.,2018-04-24,1.0,0.0,Dustin,Johnson,2018-04-24 15:24:03.059354,Approved
415,Volunteering,Pig Jig,"Volunteered with the setup and clean up of Pig Jig on the day of the event. Bought a pig jig ticket, and got pied 12 times",2018-04-24,5.0,22.0,Keian,Mohammadi,2018-04-24 01:28:10.773539,Approved
418,Sting Hunger Now,idk,Spent an hour at Sting Hunger Now setup during greek week as can be seen on the spread sheet.,2018-04-24,1.0,0.0,Dustin,Johnson,2018-04-24 15:25:07.629336,Approved
419,Pig Jig,Phi Sig,Cleaned the smoker. Checkable with Mouse.,2018-04-21,3.0,0.0,Simon,Fernandez,2018-04-24 16:11:24.555793,Approved
420,Atlanta Humane Society,Atlanta Humane Society,I went to help take care of puppies like cleaning them and playing with them.,2018-04-18,2.0,0.0,Jae Hee,Lee Lee,2018-04-24 17:29:36.551102,Approved
421,Crisis Counselor,Crisis Text Line,Crisis counselor,2018-04-16,2.0,0.0,Rohan,Patel,2018-04-25 21:47:51.030702,Approved
422,Crisis Counselor,Crisis Text Line,Crisis counselor,2018-04-17,4.0,0.0,Rohan,Patel,2018-04-25 21:48:13.31077,Approved
423,Crisis Counselor,Crisis Text Line,Crisis counselor,2018-04-18,2.0,0.0,Rohan,Patel,2018-04-25 21:48:35.272737,Approved
424,Crisis Counselor,Crisis Text Line,Crisis counselor,2018-04-19,4.0,0.0,Rohan,Patel,2018-04-25 21:49:01.37951,Approved
425,Crisis Counselor,Crisis Text Line,Crisis counselor,2018-04-22,2.0,0.0,Rohan,Patel,2018-04-25 21:49:25.187346,Disapproved
426,Crisis Counselor,Crisis Text Line,Crisis counselor,2018-04-23,2.0,0.0,Rohan,Patel,2018-04-25 21:50:34.280723,Approved
427,Campus Kitchen,Campus Kitchen,Participated in Campus Kitchen at Brittain.,2018-04-24,1.0,0.0,Marcelo,Costa,2018-04-26 05:45:42.656271,Approved
431,Campus Kitchens,Campus Kitchens,Packed lots of leftover food for those in need ,2018-04-27,0.0,0.0,Arjun,Khadse,2018-04-27 20:24:45.941145,Disapproved
432,Campus Kitchens,Campus Kitchens,I’m an idiot and didn’t put hours for my last submission,2018-04-27,1.0,0.0,Arjun,Khadse,2018-04-27 20:25:34.739656,Approved
430,Knoxville Trip,Phi Sigma Kappa,I really wanted to go :(,2018-04-28,5.0,0.0,Eli,Gerhard,2018-04-27 18:37:12.764513,Approved
429,Knoxville Trip,Phi Sigma Kappa,Press F to pay respects for the pledges not getting initiated at UT Knoxville,2018-04-27,5.0,0.0,Liam,Wilson,2018-04-27 18:36:48.185269,Approved
428,Pig Jig,Phi Sig,I bought food,2018-04-21,0.0,10.0,Eli,Gerhard,2018-04-27 18:36:22.506972,Approved
433,Campus Kitchens,Campus Kitchens,PAcked food,2018-04-27,1.0,0.0,Justin,Wong,2018-04-27 20:33:14.824022,Approved
434,Tabling for Pig Jig,Phi Sigma Kappa,"Tabled for pig jig. Did 4/16, 17, and 18",2018-04-16,6.0,0.0,Vaishak,Lalsangi,2018-04-28 20:14:04.35712,Approved
435,Pig Jig Serving,Phi Sig,Serving food at Pig Jig,2018-04-21,1.0,0.0,Dhruv,Samdani,2018-04-29 05:49:40.580098,Approved
436,Campus Kitchen,Campus Kitchen,Campus Kitchen,2018-04-24,1.0,0.0,Gilberto,Barcellos,2018-04-29 23:07:47.047299,Approved
437,Pig jig late plate,Phi sig,"Bought a late plate, can confirm thru venmo",2018-04-22,0.0,5.0,Sean,Fitzpatrick,2018-04-30 03:19:52.073323,Approved
438,Experiment Subject,Psychology SONA Systems,participated in a psych study,2018-04-30,1.0,0.0,Ken,Baynes,2018-04-30 16:50:47.550569,Approved
439,Umpiring,Bangladesh Cricket Federation of Georgia,Umpired two matches,2018-04-28,5.0,0.0,Asif,Islam,2018-05-01 03:20:24.664401,Approved
440,Umpiring,Bangladesh Cricket Federation of Georgia,Volunteered to be an umpire for two consecutive games.,2018-05-02,3.0,0.0,Asif,Islam,2018-05-02 05:01:52.503941,Approved
441,Umpiring ,Bangladesh Cricket Federation of Georgia,Volunteered to be an umpire,2018-02-25,3.0,0.0,Asif,Islam,2018-05-02 05:02:44.216539,Approved
442,Heifer Foundation,Heifer Foundation,Donated $30,2018-05-02,2.0,0.0,Zaeem,Adamjee,2018-05-02 13:12:09.676644,Approved
443,Pig Jig,Phi Sig,Bought the food necessary for the event which took several hours and stayed by the smoker through most of the night making sure the heat was at appropriate levels,2018-04-27,5.5,0.0,Kevin,Kreulen,2018-05-02 16:03:29.945835,Approved
458,Pig Jig Serving,Phi Sig ,Pig jig serving,2018-05-02,1.0,0.0,Rohan,Manathkar,2018-05-02 17:11:21.773513,Approved
445,Campus Kitchens,Foo,Packaged Food,2018-03-09,1.0,0.0,David,Simiele,2018-05-02 16:58:29.514634,Approved
446,Pig Jig,Special Olympics,Raised money through outside donations,2018-04-21,0.0,200.0,David,Simiele,2018-05-02 16:59:18.185251,Approved
447,Pig Jig,Special Olympics,Money I donated to Pig Jig,2018-04-21,0.0,22.5,David,Simiele,2018-05-02 17:00:19.849862,Approved
448,Campus Kitchen,Campus Kitchen,Helped pack food,2018-05-02,1.0,0.0,Andrej,Sulek,2018-05-02 17:00:29.728326,Approved
449,Campus Kitchens,Campus Kitchen,Helped pack food,2018-03-14,1.0,0.0,Andrej,Sulek,2018-05-02 17:01:00.53931,Approved
450,Campus Kitchens,Campus Kitchen,Helped pack food,2018-05-02,1.0,0.0,Andrej,Sulek,2018-05-02 17:01:34.976353,Approved
451,Tree planting,Trees Atlanta,Helped plant trees with members of solar racing team before shop day.,2018-03-31,4.0,0.0,Andrej,Sulek,2018-05-02 17:03:13.388164,Approved
452,Tabling,Phi Sig Pig Jig Tabling,Passed out flyers for 2 hours with Vaishak.,2018-04-25,2.0,0.0,Andrej,Sulek,2018-05-02 17:04:48.400256,Approved
453,Pig Jig Philanthropy,Pig Jig Plate and Cornhole,Played cornhole (bought ticket to play). And payed for plate of food,2018-05-02,1.0,0.0,Andrej,Sulek,2018-05-02 17:05:52.541007,Approved
454,Phi Sig Pig Jig,"Food, Cornhole",Payed for cornhole tournament and food plate. Wrote wring date on last submission.,2018-04-21,1.0,0.0,Andrej,Sulek,2018-05-02 17:06:52.141078,Approved
455,Pig Jig,Phi Sig,"Plate, cornhole, late plate",2018-05-02,0.0,30.0,Matt,Schoonover,2018-05-02 17:10:01.01844,Approved
462,Grace house,Grace house,Donation to Grace house on campus,2018-05-02,0.0,10.0,Thomas,Malchodi,2018-05-03 02:51:06.405125,Approved
459,Pig Jig,Phi Sig,Cleaning,2018-05-02,3.0,0.0,Matt,Schoonover,2018-05-02 17:11:22.207979,Approved
456,Pig Jig,Phi Sig,Picking up and dropping off the smoker,2018-05-02,3.0,0.0,Matt,Schoonover,2018-05-02 17:10:34.322249,Approved
461,Atlanta Humane Society,Atlanta Humane Society,Volunteered at Atlanta Humane Society.,2018-04-18,2.0,0.0,Marcelo,Costa,2018-05-02 19:40:33.857552,Approved
444,Campus Kitchens,Campus ,Packaged Food,2018-05-03,1.0,0.0,David,Simiele,2018-05-02 16:57:56.531123,Approved
457,Tech Beautification Day,Greek Week,Tech Beautification Day,2018-05-02,5.0,0.0,Rohan,Manathkar,2018-05-02 17:10:58.182551,Approved
460,Volunteering,Habitat for Humanity,Built a house on westside Atlanta from 6:30 to 4:30.,2018-05-02,10.0,0.0,Bryan,Zhang,2018-05-02 17:55:30.176385,Approved
463,Pig Jig,Phi Sig,2 plates,2018-04-14,0.0,20.0,Scott,Berry,2018-05-04 01:18:45.599619,Approved
464,Refereeing,Westminster,Volunteer referee for a swim meet at Westminster,2018-01-13,9.0,0.0,Scott,Berry,2018-05-04 01:20:20.026423,Approved
466,Pig Jig Food Packing and Tabling,Phi Sigma Kappa,"Was tabling and volunteered to package late plates. Parents also donated money to event, along with my ticket. ",2018-04-21,2.0,60.0,Zachary,Wiberg,2018-05-04 01:58:03.241187,Approved
465,SHPE Junior,SHPE,Went to a high school and directed an activity on designing bridges with popsicle sticks.,2018-02-09,3.0,0.0,Zachary,Wiberg,2018-05-04 01:56:10.077152,Approved
467,Humane society ,Atlanta humane society ,"Went to the humane society with Marcelo Jae hee , junwoo etc... I drove them and then we went and attended an info session to help out. ",2018-03-28,2.0,0.0,Marco Carlomusto,Orlando,2018-05-04 17:00:02.818711,Approved
468,Cookies ,Girl Scouts ,I bout over 36 dollars of Girl Scout cookies .....,2018-03-24,2.0,36.0,Marco Carlomusto,Orlando,2018-05-04 17:01:42.607624,Approved
469,Atlanta humane society ,Atlanta humane society ,"Went with Marcelo to help out at the humane society, mostly shredded paper for the puppies play pin but also picked up some poop",2018-04-18,2.0,0.0,Marco Carlomusto,Orlando,2018-05-04 17:03:11.140302,Approved
470,Good will ,Goodwill,"Donated a lot of shoes and old cloths, I do this once a year, some of those cloths and shoes were expensive so I would think two hours would b good but I will also accept one ",2018-05-04,2.0,0.0,Marco Carlomusto,Orlando,2018-05-04 17:04:52.237297,Approved
471,BRASA Mentorship ,BRASA,"BRASA - Pre: I mentor a Brazilian high school student who wishes to come to college in the US, help with school stuff, college app and essays and scholarship apps and essays.
This day I spent 3.5h with her on Skype and Google drive going over the final version of the college essays we were about to submit. ",2018-01-01,3.5,0.0,Daniel,Silva,2018-05-04 18:54:33.080819,Approved
472,BRASA Mentorship ,BRASA,"Went over the college applications that were due January 15 (Skype, Whatsapp and google drive).",2018-01-13,1.0,0.0,Daniel,Silva,2018-05-04 18:56:54.763052,Approved
473,BRASA Mentorship ,BRASA,Helped my mentee and reviewed the college applications that were due February 1-3.,2018-01-28,1.5,0.0,Daniel,Silva,2018-05-04 18:58:15.005224,Approved
474,BRASA Mentorship ,BRASA,Helped my mentee with Scholarship research and financial aid stuff.,2018-02-10,0.5,0.0,Daniel,Silva,2018-05-04 19:00:26.598554,Approved
475,BRASA Mentorship ,BRASA,The first review of scholarship essays drafts and helped my mentee with some financial aid bureaucracy.,2018-02-17,1.5,0.0,Daniel,Silva,2018-05-04 19:02:57.011808,Approved
476,BRASA Mentorship ,BRASA,Whatsapp call with my mentee about Scholarship essays and recommendation letters. ,2018-02-28,0.5,0.0,Daniel,Silva,2018-05-04 19:04:17.49127,Approved
477,BRASA Mentorship ,BRASA,Helped my mentee with the final review of Scholarship essays to get them ready for submission.,2018-03-06,1.0,0.0,Daniel,Silva,2018-05-04 19:08:03.231236,Approved
478,BRASA Mentorship ,BRASA,Helped my mentee prepare for her scholarship interview and did a rehearsed interview with her.,2018-04-03,1.5,0.0,Daniel,Silva,2018-05-04 19:10:29.012592,Approved
479,BRASA Mentorship ,BRASA,"Met the new mentee I will be working with next semester, developed our goals and a tentative calendar for his college application development. ",2018-04-28,1.0,0.0,Daniel,Silva,2018-05-04 19:12:12.404513,Approved
480,Donation,Atlanta mission,Donation to Atlanta mission,2018-05-04,0.0,25.0,Thomas,Malchodi,2018-05-05 01:49:17.796525,Approved
481,Grant Park Calvary,Hands On Atlanta,Pulling invasive species from grant park ,2018-02-24,3.0,0.0,Nick,Loprinzo,2018-05-05 04:03:23.81707,Approved
482,WAWA Clean up,West Atlanta Watershed Alliance,Removing Debris and clearing paths. Removing some invasive/harmful species.,2018-03-10,3.0,0.0,Nick,Loprinzo,2018-05-05 04:05:25.364608,Approved
483,Pig Jig,Phi Sig Pig Jig,"- 1 Hour of set up and supply purchasing
- 45 spent on 3 ticket purchases and a cornhole tournament entry",2018-04-21,1.0,45.0,Nick,Loprinzo,2018-05-05 04:06:44.651844,Approved
484,Pig Jig,Phi sig,dishes,2018-04-21,3.0,0.0,David,Mercker,2018-05-05 21:53:08.605531,Approved
485,trees atlanta,trees atlanta,mulched trees,2018-05-05,4.0,0.0,David,Mercker,2018-05-05 22:05:32.511301,Approved
486,Chick-Fil-A Calendar Purchase (FTK Donation),For the Kids,Bought a CFA themed calendar where the funds went towards FTK,2018-01-16,0.0,10.0,Omar,Abed,2018-05-07 01:33:35.00602,Approved
487,Girl Scout Cookies,Girl Scouts of America,Bought Girl Scout cookies,2018-02-28,0.0,8.0,Omar,Abed,2018-05-07 01:34:04.871744,Approved
488,GT Spirit Poster,Georgia Tech Spirit Teams,Bought a GT Spirit poster that funds their journey to nationals,2018-01-12,0.0,20.0,Omar,Abed,2018-05-07 01:35:59.660406,Approved
489,Grilled Cheese with AGDs,Alpha Gamma Delta,Paid for entry to the event. Proceeds go towards ending hunger in ATL community.,2018-03-15,0.0,6.0,Omar,Abed,2018-05-07 01:37:48.266361,Approved
490,Pig Jig and Pie,Phi Sigma Kappa,Paid for entry and pie'ing twice. Funds go towards Special Olympics,2018-05-06,0.0,12.0,Omar,Abed,2018-05-07 01:40:41.047256,Approved
491,Buying a Taco Tank,Alpha Chi Omega,Bought a Tank top. Funds go towards supporting ATL Domestic Violence Shelter.,2018-04-06,0.0,15.0,Omar,Abed,2018-05-07 01:43:17.564273,Approved
492,Tech Beautification Day,Georgia Tech,Laid mulch in biotech quad area.,2018-05-06,3.5,0.0,Omar,Abed,2018-05-07 01:45:45.854891,Approved
493,Donating Platelets,American Red Cross,Donated platelets back home in alpharetta,2018-02-03,2.0,0.0,Kaivon,Mohseni,2018-05-07 04:32:06.345352,Approved
494,Pig Jig,Phi Sig,Bought tickets and donated money,2018-05-07,0.0,35.0,Kaivon,Mohseni,2018-05-07 04:32:38.467673,Approved
495,Donating Platelets,American Red Cross,Donated platelets in Alpharetta for cancer research,2018-05-07,2.0,0.0,Kaivon,Mohseni,2018-05-07 04:33:26.152881,Approved
496,Food Kitchen,North Fulton Community Charities,Helped to organize and hand out food baskets and hot meals for the homeless,2018-05-07,5.0,0.0,Kaivon,Mohseni,2018-05-07 04:36:05.505236,Approved
499,KCA Orchestra Volunteer,KCA Orchestra,Every Saturday set up stands and seats for the orchestra and then cleaned up after practice. Also helped the brass section get the needed music copies etc.,2018-02-05,7.5,0.0,Junwoo,Park,2018-05-08 00:37:17.705904,Approved
498,AXO Taco bout it,AXO,Tacos,2018-03-29,0.0,5.0,Junwoo,Park,2018-05-08 00:12:30.117395,Approved
497,Tech Beautification Day,Georgia Tech,Mulched,2018-04-07,4.0,0.0,Junwoo,Park,2018-05-08 00:09:46.888272,Approved
502,Volunteer for Research,Sulchek Lab,"I did not take for credit and rather volunteered. I used cantalievers beaded with polypropylene and polyethylene to run atomic force microscopy on various surfaces. I was able to generate force maps, force curves, etc.  This was 1 day that I went into lab among many. I can put in rest if requested.",2018-02-16,4.0,0.0,Varun,Rajagopal,2018-05-08 20:17:40.536262,Approved
501,Repair Session,Engineering World Health,"I went to Medshare, worked with Eben to look at some surgical devices and test/repair them.",2018-02-24,3.0,0.0,Varun,Rajagopal,2018-05-08 20:12:32.630154,Approved
500,Repair Session,Engineering World Health,I went to Medshare and tested and repaired some ecg devices.,2018-03-10,3.0,0.0,Varun,Rajagopal,2018-05-08 20:11:28.006385,Approved
505,Pig Jig,Phi Sig,Bought a BBQ plate ,2018-05-10,0.0,10.0,Young,Aaron,2018-05-10 16:53:28.850914,Approved
503,King of Hearts,Alpha Phi,Raised money and created a performance to support Women’s Heart Health,2018-05-10,12.0,0.0,Young,Aaron,2018-05-10 16:51:00.681925,Approved
504,Dog for a Day,Altlanta Humane Society,Took a dog for animal shelter out for the day to socialize it and generally get it out of the kennel,2018-05-10,4.0,0.0,Young,Aaron,2018-05-10 16:52:04.945868,Approved
506,Test,Test,Test,2018-08-05,6.5,0.0,Will,Mitchell,2018-08-06 00:58:12.598092,Pending
