<?xml version="1.0" encoding="UTF-8" standalone="no"?>
<svg
   xmlns:dc="http://purl.org/dc/elements/1.1/"
   xmlns:cc="http://creativecommons.org/ns#"
   xmlns:rdf="http://www.w3.org/1999/02/22-rdf-syntax-ns#"
   xmlns:svg="http://www.w3.org/2000/svg"
   xmlns="http://www.w3.org/2000/svg"
   xmlns:sodipodi="http://sodipodi.sourceforge.net/DTD/sodipodi-0.dtd"
   xmlns:inkscape="http://www.inkscape.org/namespaces/inkscape"
   inkscape:version="1.0 (4035a4fb49, 2020-05-01)"
   sodipodi:docname="new_note.svg"
   id="svg8"
   version="1.1"
   viewBox="0 0 16 16">
  <metadata
     id="metadata14">
    <rdf:RDF>
      <cc:Work
         rdf:about="">
        <dc:format>image/svg+xml</dc:format>
        <dc:type
           rdf:resource="http://purl.org/dc/dcmitype/StillImage" />
      </cc:Work>
    </rdf:RDF>
  </metadata>
  <defs
     id="defs12" />
  <sodipodi:namedview
     inkscape:document-rotation="0"
     inkscape:current-layer="g6"
     inkscape:window-maximized="1"
     inkscape:window-y="31"
     inkscape:window-x="0"
     inkscape:cy="8"
     inkscape:cx="-0.33128417"
     inkscape:zoom="14.75"
     showgrid="false"
     id="namedview10"
     inkscape:window-height="716"
     inkscape:window-width="1360"
     inkscape:pageshadow="2"
     inkscape:pageopacity="0"
     guidetolerance="10"
     gridtolerance="10"
     objecttolerance="10"
     borderopacity="1"
     bordercolor="#666666"
     pagecolor="#ffffff" />
  <g
     id="g6"
     style="display:inline"
     transform="translate(-373.00061,-168)">
    <path
       id="path2"
       style="fill:#bfbfbf;fill-opacity:1;stroke:none"
       d="m 385,178 v 2 h -2 v 2 h 2 v 2 h 2 v -2 h 2 v -2 h -2 v -2 z" />
    <path
       id="path4"
       style="color:#000000;visibility:visible;fill:#bfbfbf;fill-opacity:1;stroke:none"
       d="m 375,170 c -1,0 -1,1 -1,1 v 10 c 0,0.524 0.476,1 1,1 h 7 v -1 h -7 v -8 h 12 v 4 h 1 v -6 c 0,-0.524 -0.476,-1 -1,-1 z" />
  </g>
</svg>
