<?xml version="1.0" encoding="UTF-8" standalone="no"?>
<svg
   xmlns:dc="http://purl.org/dc/elements/1.1/"
   xmlns:cc="http://creativecommons.org/ns#"
   xmlns:rdf="http://www.w3.org/1999/02/22-rdf-syntax-ns#"
   xmlns:svg="http://www.w3.org/2000/svg"
   xmlns="http://www.w3.org/2000/svg"
   xmlns:sodipodi="http://sodipodi.sourceforge.net/DTD/sodipodi-0.dtd"
   xmlns:inkscape="http://www.inkscape.org/namespaces/inkscape"
   viewBox="0 0 16 16"
   version="1.1"
   id="svg4"
   sodipodi:docname="opacity_increase.svg"
   inkscape:version="1.0.1 (3bc2e813f5, 2020-09-07)">
  <metadata
     id="metadata10">
    <rdf:RDF>
      <cc:Work
         rdf:about="">
        <dc:format>image/svg+xml</dc:format>
        <dc:type
           rdf:resource="http://purl.org/dc/dcmitype/StillImage" />
      </cc:Work>
    </rdf:RDF>
  </metadata>
  <defs
     id="defs8" />
  <sodipodi:namedview
     pagecolor="#ffffff"
     bordercolor="#666666"
     borderopacity="1"
     objecttolerance="10"
     gridtolerance="10"
     guidetolerance="10"
     inkscape:pageopacity="0"
     inkscape:pageshadow="2"
     inkscape:window-width="1360"
     inkscape:window-height="716"
     id="namedview6"
     showgrid="false"
     inkscape:zoom="35.3125"
     inkscape:cx="8"
     inkscape:cy="8"
     inkscape:window-x="0"
     inkscape:window-y="31"
     inkscape:window-maximized="1"
     inkscape:current-layer="svg4" />
  <path
     d="m 8 3 c -2.759 0 -5 2.241 -5 5 c 0 2.759 2.241 5 5 5 c 2.759 0 5 -2.241 5 -5 c 0 -2.759 -2.241 -5 -5 -5 z m 0 1 c 2.207 0 4 1.793 4 4 c 0 2.207 -1.793 4 -4 4 l 0 -8 z"
     style="fill:#bebebe;color:#bebebe;opacity:0.7"
     id="path2" />
  <path
     id="path2-3"
     style="display:inline;fill:#bfbfbf;fill-opacity:1;stroke:none"
     d="M 11.516814,9.2902655 V 11.290265 H 9.5168142 v 2 h 1.9999998 v 2 h 2 v -2 h 2 v -2 h -2 V 9.2902655 Z" />
</svg>
