<?xml version="1.0" encoding="UTF-8" standalone="no"?>
<svg
   viewBox="0 0 16 16"
   version="1.1"
   id="svg10"
   sodipodi:docname="unlock.svg"
   inkscape:version="1.1.1 (3bf5ae0d25, 2021-09-20, custom)"
   xmlns:inkscape="http://www.inkscape.org/namespaces/inkscape"
   xmlns:sodipodi="http://sodipodi.sourceforge.net/DTD/sodipodi-0.dtd"
   xmlns="http://www.w3.org/2000/svg"
   xmlns:svg="http://www.w3.org/2000/svg"
   xmlns:rdf="http://www.w3.org/1999/02/22-rdf-syntax-ns#"
   xmlns:cc="http://creativecommons.org/ns#"
   xmlns:dc="http://purl.org/dc/elements/1.1/">
  <metadata
     id="metadata16">
    <rdf:RDF>
      <cc:Work
         rdf:about="">
        <dc:format>image/svg+xml</dc:format>
        <dc:type
           rdf:resource="http://purl.org/dc/dcmitype/StillImage" />
      </cc:Work>
    </rdf:RDF>
  </metadata>
  <defs
     id="defs14" />
  <sodipodi:namedview
     pagecolor="#ffffff"
     bordercolor="#666666"
     borderopacity="1"
     objecttolerance="10"
     gridtolerance="10"
     guidetolerance="10"
     inkscape:pageopacity="0"
     inkscape:pageshadow="2"
     inkscape:window-width="1311"
     inkscape:window-height="711"
     id="namedview12"
     showgrid="false"
     inkscape:zoom="14.75"
     inkscape:cx="-6.8135593"
     inkscape:cy="7.9661017"
     inkscape:window-x="53"
     inkscape:window-y="31"
     inkscape:window-maximized="0"
     inkscape:current-layer="svg10"
     inkscape:pagecheckerboard="0" />
  <path
     id="XMLID_5_"
     class="st0"
     d="M 12.256622,8.4579701 H 5.4453609 V 4.5804914 c 0,-1.179619 1.1524187,-2.1399683 2.5679614,-2.1399683 1.4155437,0 2.5679637,0.9603493 2.5679637,2.1399683 v 0.9770031 h 1.701982 V 4.5582874 C 12.283268,2.59318 10.371451,1 8.0133223,1 5.6551946,1 3.7433774,2.59318 3.7433774,4.5582874 v 3.8774778 c -0.9425843,0 -1.7019819,0.6328316 -1.7019819,1.4183188 v 3.727597 C 2.0413955,14.367169 2.8007931,15 3.7433774,15 h 8.5132446 c 0.942586,0 1.701983,-0.632831 1.701983,-1.418319 V 9.8762894 c 0,-0.7854877 -0.786043,-1.4183193 -1.701983,-1.4183193 z"
     style="fill:#bfbfbf;stroke-width:0.0304049"
     sodipodi:nodetypes="scsssccssscsssssss" />
</svg>
