<?xml version="1.0" encoding="UTF-8" standalone="no"?>
<svg
   xmlns:dc="http://purl.org/dc/elements/1.1/"
   xmlns:cc="http://creativecommons.org/ns#"
   xmlns:rdf="http://www.w3.org/1999/02/22-rdf-syntax-ns#"
   xmlns:svg="http://www.w3.org/2000/svg"
   xmlns="http://www.w3.org/2000/svg"
   xmlns:sodipodi="http://sodipodi.sourceforge.net/DTD/sodipodi-0.dtd"
   xmlns:inkscape="http://www.inkscape.org/namespaces/inkscape"
   viewBox="0 0 16 16"
   version="1.1"
   id="svg10"
   sodipodi:docname="capitalize.svg"
   inkscape:version="1.0.1 (3bc2e813f5, 2020-09-07)">
  <metadata
     id="metadata16">
    <rdf:RDF>
      <cc:Work
         rdf:about="">
        <dc:format>image/svg+xml</dc:format>
        <dc:type
           rdf:resource="http://purl.org/dc/dcmitype/StillImage" />
      </cc:Work>
    </rdf:RDF>
  </metadata>
  <defs
     id="defs14" />
  <sodipodi:namedview
     pagecolor="#ffffff"
     bordercolor="#666666"
     borderopacity="1"
     objecttolerance="10"
     gridtolerance="10"
     guidetolerance="10"
     inkscape:pageopacity="0"
     inkscape:pageshadow="2"
     inkscape:window-width="1360"
     inkscape:window-height="716"
     id="namedview12"
     showgrid="false"
     inkscape:zoom="14.75"
     inkscape:cx="10.315194"
     inkscape:cy="12.748378"
     inkscape:window-x="0"
     inkscape:window-y="31"
     inkscape:window-maximized="1"
     inkscape:current-layer="svg10"
     inkscape:document-rotation="0" />
  <g
     aria-label="b"
     id="text835"
     style="font-style:normal;font-variant:normal;font-weight:normal;font-stretch:normal;font-size:13.3333px;line-height:1.25;font-family:'Nimbus Roman';-inkscape-font-specification:'Nimbus Roman, ';letter-spacing:0px;word-spacing:0px;fill:#000000;fill-opacity:1;stroke:none" />
  <g
     aria-label="A"
     id="text835-3"
     style="font-style:normal;font-variant:normal;font-weight:normal;font-stretch:normal;font-size:14.6667px;line-height:1.25;font-family:'Nimbus Roman';-inkscape-font-specification:'Nimbus Roman, ';letter-spacing:0px;word-spacing:0px;fill:#000000;fill-opacity:1;stroke:none">
    <path
       id="path834"
       style="font-style:normal;font-variant:normal;font-weight:bold;font-stretch:normal;font-size:14.6667px;font-family:'Nimbus Roman';-inkscape-font-specification:'Nimbus Roman, Bold';fill:#bfbfbf"
       sodipodi:type="inkscape:offset"
       inkscape:radius="0"
       inkscape:original="M 4.8925781 2.5273438 L 1.6367188 10.564453 C 1.0793841 11.943123 0.90322037 12.14925 0.19921875 12.28125 L 0.19921875 12.648438 L 3.1757812 12.648438 L 3.1757812 12.28125 C 2.2957792 12.22258 1.9726563 12.061022 1.9726562 11.679688 C 1.9726562 11.489021 2.0757701 11.137705 2.3984375 10.345703 L 2.6191406 9.7578125 L 5.9179688 9.7578125 C 6.4166365 10.916482 6.59375 11.431239 6.59375 11.753906 C 6.59375 12.076574 6.4020064 12.206995 5.8886719 12.236328 C 5.8153389 12.250998 5.6252557 12.26658 5.4199219 12.28125 L 5.4199219 12.648438 L 10.171875 12.648438 L 10.171875 12.630859 L 11.205078 11.898438 C 11.81841 12.458436 12.298179 12.658203 12.964844 12.658203 C 14.738173 12.658203 15.978516 11.285151 15.978516 9.2851562 C 15.978516 7.4318276 14.952653 6.1660156 13.472656 6.1660156 C 12.819325 6.1660156 12.352368 6.3787774 11.845703 6.9121094 L 11.845703 3.4589844 L 9.2578125 3.4589844 L 9.2578125 3.7792969 C 9.8578109 3.8859633 9.9788542 4.0060691 9.9921875 4.5527344 L 9.9921875 12.201172 C 9.5132135 12.139356 9.2686644 11.854222 8.5722656 10.242188 L 5.3027344 2.5273438 L 4.8925781 2.5273438 z M 4.2167969 5.6230469 L 5.6992188 9.1855469 L 2.8378906 9.1855469 L 4.2167969 5.6230469 z M 12.779297 6.8847656 C 13.605961 6.8847656 14.017578 7.7653951 14.017578 9.5253906 C 14.017578 11.378719 13.618957 12.232422 12.765625 12.232422 C 12.205627 12.232422 11.845703 11.819686 11.845703 11.179688 L 11.845703 7.671875 C 12.085702 7.0985431 12.339298 6.8847656 12.779297 6.8847656 z "
       d="M 4.8925781,2.5273438 1.6367188,10.564453 C 1.0793841,11.943123 0.90322037,12.14925 0.19921875,12.28125 v 0.367188 H 3.1757812 V 12.28125 c -0.880002,-0.05867 -1.2031249,-0.220228 -1.203125,-0.601562 0,-0.190667 0.1031139,-0.541983 0.4257813,-1.333985 L 2.6191406,9.7578125 H 5.9179688 C 6.4166365,10.916482 6.59375,11.431239 6.59375,11.753906 c 0,0.322668 -0.1917436,0.453089 -0.7050781,0.482422 -0.073333,0.01467 -0.2634162,0.03025 -0.46875,0.04492 v 0.367188 h 4.7519531 v -0.01758 l 1.033203,-0.732421 c 0.613332,0.559998 1.093101,0.759765 1.759766,0.759765 1.773329,0 3.013672,-1.373052 3.013672,-3.3730468 0,-1.8533286 -1.025863,-3.1191406 -2.50586,-3.1191406 -0.653331,0 -1.120288,0.2127618 -1.626953,0.7460938 V 3.4589844 H 9.2578125 v 0.3203125 c 0.5999984,0.1066664 0.7210417,0.2267722 0.734375,0.7734375 V 12.201172 C 9.5132135,12.139356 9.2686644,11.854222 8.5722656,10.242188 L 5.3027344,2.5273438 Z m -0.6757812,3.0957031 1.4824219,3.5625 H 2.8378906 Z m 8.5625001,1.2617187 c 0.826664,0 1.238281,0.8806295 1.238281,2.640625 0,1.8533284 -0.398621,2.7070314 -1.251953,2.7070314 -0.559998,0 -0.919922,-0.412736 -0.919922,-1.052734 V 7.671875 c 0.239999,-0.5733319 0.493595,-0.7871094 0.933594,-0.7871094 z" />
  </g>
</svg>
