<?xml version="1.0" encoding="UTF-8" standalone="no"?>
<svg
   xmlns:dc="http://purl.org/dc/elements/1.1/"
   xmlns:cc="http://creativecommons.org/ns#"
   xmlns:rdf="http://www.w3.org/1999/02/22-rdf-syntax-ns#"
   xmlns:svg="http://www.w3.org/2000/svg"
   xmlns="http://www.w3.org/2000/svg"
   xmlns:sodipodi="http://sodipodi.sourceforge.net/DTD/sodipodi-0.dtd"
   xmlns:inkscape="http://www.inkscape.org/namespaces/inkscape"
   viewBox="0 0 16 16"
   version="1.1"
   id="svg6"
   sodipodi:docname="Charging_2.svg"
   inkscape:version="0.92.2 5c3e80d, 2017-08-06">
  <metadata
     id="metadata12">
    <rdf:RDF>
      <cc:Work
         rdf:about="">
        <dc:format>image/svg+xml</dc:format>
        <dc:type
           rdf:resource="http://purl.org/dc/dcmitype/StillImage" />
      </cc:Work>
    </rdf:RDF>
  </metadata>
  <defs
     id="defs10" />
  <sodipodi:namedview
     pagecolor="#ffffff"
     bordercolor="#666666"
     borderopacity="1"
     objecttolerance="10"
     gridtolerance="10"
     guidetolerance="10"
     inkscape:pageopacity="0"
     inkscape:pageshadow="2"
     inkscape:window-width="1366"
     inkscape:window-height="714"
     id="namedview8"
     showgrid="false"
     inkscape:zoom="29.5"
     inkscape:cx="3.7072393"
     inkscape:cy="5.8932398"
     inkscape:window-x="0"
     inkscape:window-y="31"
     inkscape:window-maximized="1"
     inkscape:current-layer="svg6" />
  <path
     d="M 5.5,1.5 V 3.125 H 3 V 14.5 H 13 V 3.125 H 10.5 V 1.5 Z M 9.6666667,3.9375 8.8333333,8 H 11.333333 L 6.3333333,13.6875 7.1666667,9.625 h -2.5 z"
     style="opacity:0.4;fill:#bebebe;stroke-width:0.82285076"
     id="path2"
     inkscape:connector-curvature="0" />
  <path
     d="m 3,12.8 v 1.7 h 10 v -1.7 l -5.9092721,0.01198 -0.7154476,0.827576 0.1239666,-0.831688 z"
     style="fill:#ff8000;stroke-width:0.59511906"
     id="path4"
     inkscape:connector-curvature="0"
     sodipodi:nodetypes="cccccccc" />
</svg>
