EESchema Schematic File Version 4
EELAYER 30 0
EELAYER END
$Descr A4 11693 8268
encoding utf-8
Sheet 1 1
Title ""
Date ""
Rev ""
Comp ""
Comment1 ""
Comment2 ""
Comment3 ""
Comment4 ""
$EndDescr
$Comp
L Device:LED_Dual_ACA D2
U 1 1 5E5B65A1
P 6900 5800
F 0 "D2" H 6900 6225 50  0001 C CNN
F 1 "5ARG9HWA" V 6400 6000 50  0000 R CNN
F 2 "" H 6900 5800 50  0001 C CNN
F 3 "~" H 6900 5800 50  0001 C CNN
	1    6900 5800
	0    1    -1   0   
$EndComp
$Comp
L Switch:SW_Push SW1
U 1 1 5E5C1071
P 7300 6000
F 0 "SW1" H 7300 6285 50  0001 C CNN
F 1 "Push Button" V 7600 5900 50  0000 L CNN
F 2 "" H 7300 6200 50  0001 C CNN
F 3 "~" H 7300 6200 50  0001 C CNN
	1    7300 6000
	0    1    1    0   
$EndComp
Wire Wire Line
	5100 6800 4400 6800
$Comp
L Device:LED_Dual_ACA D3
U 1 1 5E5BFDB6
P 6400 5800
F 0 "D3" H 6400 6225 50  0001 C CNN
F 1 "5ARG9HWA" V 5900 6000 50  0000 R CNN
F 2 "" H 6400 5800 50  0001 C CNN
F 3 "~" H 6400 5800 50  0001 C CNN
	1    6400 5800
	0    1    -1   0   
$EndComp
Wire Wire Line
	6300 5200 6300 5500
Wire Wire Line
	6400 5200 6400 5500
Wire Wire Line
	6400 5500 6500 5500
Wire Wire Line
	6500 5200 6500 5400
Wire Wire Line
	6500 5400 6800 5400
Wire Wire Line
	6800 5400 6800 5500
Wire Wire Line
	6600 5200 6600 5300
Wire Wire Line
	6600 5300 7000 5300
Wire Wire Line
	7000 5300 7000 5500
Wire Wire Line
	6700 5200 7300 5200
Wire Wire Line
	6700 4700 7500 4700
Wire Wire Line
	6300 4700 6100 4700
Wire Wire Line
	6100 4700 6100 6100
Wire Wire Line
	6100 6100 6400 6100
Wire Wire Line
	6500 4700 6500 4600
Wire Wire Line
	6500 4600 6000 4600
Wire Wire Line
	6000 4600 6000 6200
Wire Wire Line
	6000 6200 6900 6200
Wire Wire Line
	6900 6200 6900 6100
Wire Wire Line
	7300 6200 7500 6200
Wire Wire Line
	7500 4700 7500 6200
Wire Wire Line
	7300 5200 7300 5800
$Comp
L opt101:CJMCU-101 U?
U 1 1 5E641B98
P 4500 5600
F 0 "U?" H 3600 6100 50  0001 L BNN
F 1 "CJMCU-101" H 3800 6200 50  0000 C CNN
F 2 "" H 3800 5800 50  0001 L BNN
F 3 "" H 3800 5800 50  0001 C CNN
	1    4500 5600
	0    1    1    0   
$EndComp
$Comp
L Sensor_Temperature:DS18B20 U1
U 1 1 5E44EA75
P 7100 7000
F 0 "U1" H 6870 7046 50  0001 R CNN
F 1 "DS18B20" V 6800 7200 50  0000 R CNN
F 2 "Package_TO_SOT_THT:TO-92_Inline" H 6100 6750 50  0001 C CNN
F 3 "http://datasheets.maximintegrated.com/en/ds/DS18B20.pdf" H 6950 7250 50  0001 C CNN
	1    7100 7000
	-1   0    0    -1  
$EndComp
$Comp
L conn_interface:conn_interface J?
U 1 1 5E762D40
P 6500 5000
F 0 "J?" H 6550 5300 50  0001 C CNN
F 1 "Connector" V 6600 4700 50  0000 R CNN
F 2 "" H 6500 5000 50  0001 C CNN
F 3 "~" H 6500 5000 50  0001 C CNN
	1    6500 5000
	0    -1   -1   0   
$EndComp
Text Label 6200 6400 0    50   ~ 0
Saturation
Text Label 6700 6400 0    50   ~ 0
Calibration
Text Label 7200 6400 0    50   ~ 0
Zero
$Comp
L LED:LD271 D?
U 1 1 5E71458B
P 4900 7100
F 0 "D?" H 4850 7390 50  0001 C CNN
F 1 "B5B-436-30" H 5300 7000 50  0000 C CNN
F 2 "LED_THT:LED_D5.0mm_IRGrey" H 4900 7275 50  0001 C CNN
F 3 "http://www.alliedelec.com/m/d/40788c34903a719969df15f1fbea1056.pdf" H 4850 7100 50  0001 C CNN
	1    4900 7100
	-1   0    0    1   
$EndComp
Wire Wire Line
	4000 6600 4000 7200
Wire Wire Line
	4000 7200 5100 7200
Wire Wire Line
	4000 6600 4800 6600
Wire Wire Line
	4400 6500 4400 6800
Wire Wire Line
	4800 6500 4800 6600
Text Label 6800 5000 0    50   ~ 0
Interface
Text Label 4300 7100 0    50   ~ 0
660nm
Text Label 5200 6700 0    50   ~ 0
Sensor
Text Label 7000 5300 2    50   ~ 0
Green
Text Label 6800 5400 2    50   ~ 0
Red
Text Label 6700 6200 0    50   ~ 0
Gnd
$Comp
L conn_thermometer_m:Connector J?
U 1 1 5E90DB08
P 6400 7000
F 0 "J?" V 6600 7000 50  0001 C CNN
F 1 "Connector" V 6100 7000 50  0000 C CNN
F 2 "" V 6400 7000 50  0001 C CNN
F 3 "~" V 6400 7000 50  0001 C CNN
	1    6400 7000
	0    1    1    0   
$EndComp
Text Label 6200 6800 0    50   ~ 0
Thermometer
Wire Wire Line
	6600 6900 6800 6900
Wire Wire Line
	6800 6900 6800 6700
Wire Wire Line
	6800 6700 7100 6700
Wire Wire Line
	6600 7100 6800 7100
Wire Wire Line
	6800 7100 6800 7300
Wire Wire Line
	6800 7300 7100 7300
Wire Wire Line
	6600 7000 6800 7000
$Comp
L connector_sensor_1:Connector J?
U 1 1 5E956390
P 5300 7000
F 0 "J?" H 5300 7300 50  0001 C CNN
F 1 "Connector" H 5200 7400 50  0000 L CNN
F 2 "" H 5300 7000 50  0001 C CNN
F 3 "~" H 5300 7000 50  0001 C CNN
	1    5300 7000
	1    0    0    -1  
$EndComp
Wire Wire Line
	5100 6900 4800 6900
Wire Wire Line
	4800 6900 4800 7100
Wire Wire Line
	5100 7000 5000 7000
Wire Wire Line
	5000 7000 5000 6500
Wire Wire Line
	7500 1700 7500 3400
Connection ~ 7500 1700
Connection ~ 7200 1700
Wire Wire Line
	7200 1700 7500 1700
Connection ~ 6000 1600
Connection ~ 6600 1600
Wire Wire Line
	6600 1600 6000 1600
Wire Wire Line
	7200 1700 6600 1700
Wire Wire Line
	7200 1600 6600 1600
Connection ~ 7200 1500
Wire Wire Line
	7200 1500 6600 1500
Wire Wire Line
	7400 1500 7400 2000
Connection ~ 7400 1500
Wire Wire Line
	7400 1500 7200 1500
Wire Wire Line
	7400 1100 7400 1500
Wire Wire Line
	7500 1300 7500 1700
$Comp
L conn_thermometer_m:Connector J?
U 1 1 60708A54
P 7000 1600
F 0 "J?" H 7000 1800 50  0001 C CNN
F 1 "Connectors" V 7400 1000 50  0000 L CNN
F 2 "" H 7000 1600 50  0001 C CNN
F 3 "~" H 7000 1600 50  0001 C CNN
	1    7000 1600
	0    1    -1   0   
$EndComp
Wire Wire Line
	3900 2500 4400 2500
Wire Wire Line
	3900 2400 3900 1500
Wire Wire Line
	4400 2500 4400 1700
$Comp
L conn_thermometer_m:Connector J?
U 1 1 5E8A913E
P 6400 1600
F 0 "J?" H 6400 1800 50  0001 C CNN
F 1 "Connectors" V 7300 1400 50  0001 L CNN
F 2 "" H 6400 1600 50  0001 C CNN
F 3 "~" H 6400 1600 50  0001 C CNN
	1    6400 1600
	0    1    -1   0   
$EndComp
Wire Wire Line
	4400 2600 3900 2600
Wire Wire Line
	4200 2700 4300 2700
$Comp
L Device:R_Small_US R1
U 1 1 5E5F01D6
P 4100 2700
F 0 "R1" V 3895 2700 50  0001 C CNN
F 1 "270" V 4300 2700 50  0000 C CNN
F 2 "" H 4100 2700 50  0001 C CNN
F 3 "~" H 4100 2700 50  0001 C CNN
	1    4100 2700
	0    1    1    0   
$EndComp
Wire Wire Line
	4300 2700 4300 2800
Wire Wire Line
	4300 1100 4300 2700
Connection ~ 4300 2700
Text Label 6400 1300 0    50   ~ 0
Thermometers
Wire Wire Line
	3900 2800 4300 2800
Wire Wire Line
	4000 2700 3900 2700
Wire Wire Line
	4400 1700 4500 1700
Connection ~ 4800 3200
Wire Wire Line
	4400 3200 4400 2600
Wire Wire Line
	4800 3200 4400 3200
Wire Wire Line
	4800 3200 4800 3400
$Comp
L MCU_Module:Arduino_Nano_v3.x A1
U 1 1 5E4A8D08
P 5000 2200
F 0 "A1" H 5000 1019 50  0001 C CNN
F 1 "ATmega328P MCU" H 5000 1000 50  0000 C CNN
F 2 "Module:Arduino_Nano" H 5000 2200 50  0001 C CIN
F 3 "http://www.mouser.com/pdfdocs/Gravitech_Arduino_Nano3_0.pdf" H 5000 2200 50  0001 C CNN
	1    5000 2200
	-1   0    0    1   
$EndComp
Wire Wire Line
	7400 1100 5000 1100
Wire Wire Line
	6900 2500 5500 2500
Wire Wire Line
	5500 2600 6600 2600
Wire Wire Line
	6000 1500 6000 1600
Wire Wire Line
	6000 1300 7500 1300
Wire Wire Line
	5500 1600 6000 1600
Text Label 5800 1900 0    50   ~ 0
Interface
$Comp
L conn_interface:conn_interface J3
U 1 1 5E5B351E
P 6000 2200
F 0 "J3" H 6050 2500 50  0001 C CNN
F 1 "Connector" H 6000 2600 50  0000 C CNN
F 2 "" H 6000 2200 50  0001 C CNN
F 3 "~" H 6000 2200 50  0001 C CNN
	1    6000 2200
	1    0    0    -1  
$EndComp
Text Label 6200 3000 0    50   ~ 0
Bluetooth
Wire Wire Line
	6600 3200 6600 2600
Connection ~ 6800 3200
$Comp
L hc05:HC05 J4
U 1 1 5E660092
P 6900 2900
F 0 "J4" H 6900 3200 50  0001 C CNN
F 1 "HC05" V 6900 3600 50  0000 R CNN
F 2 "" H 6900 2900 50  0001 C CNN
F 3 "~" H 6900 2900 50  0001 C CNN
	1    6900 2900
	0    -1   -1   0   
$EndComp
Text Label 6400 2700 0    50   ~ 0
3.3v
Wire Wire Line
	5100 3500 4500 3500
Connection ~ 4300 2800
Wire Wire Line
	4300 2800 4300 3500
$Comp
L power:+9V #PWR0101
U 1 1 5E6E2834
P 4500 3500
F 0 "#PWR0101" H 4500 3350 50  0001 C CNN
F 1 "+9V" H 4400 3700 50  0000 C CNN
F 2 "" H 4500 3500 50  0001 C CNN
F 3 "" H 4500 3500 50  0001 C CNN
	1    4500 3500
	-1   0    0    1   
$EndComp
$Comp
L power:GND #PWR0102
U 1 1 5E6E3916
P 4300 3500
F 0 "#PWR0102" H 4300 3250 50  0001 C CNN
F 1 "GND" H 4200 3300 50  0000 C CNN
F 2 "" H 4300 3500 50  0001 C CNN
F 3 "" H 4300 3500 50  0001 C CNN
	1    4300 3500
	1    0    0    -1  
$EndComp
$Comp
L Device:R_Small_US R?
U 1 1 5E5C5E28
P 6000 1400
F 0 "R?" H 6068 1446 50  0001 L CNN
F 1 "4.7K" H 5700 1400 50  0000 L CNN
F 2 "" H 6000 1400 50  0001 C CNN
F 3 "~" H 6000 1400 50  0001 C CNN
	1    6000 1400
	1    0    0    -1  
$EndComp
Wire Wire Line
	3900 1500 4500 1500
Wire Wire Line
	4900 1100 4300 1100
Wire Wire Line
	4900 1200 4900 1100
Wire Wire Line
	5000 1100 5000 1200
$Comp
L Device:R_Small_US R4
U 1 1 5E72047A
P 6700 3200
F 0 "R4" V 6905 3200 50  0001 C CNN
F 1 "1K" V 6600 3200 50  0000 C CNN
F 2 "" H 6700 3200 50  0001 C CNN
F 3 "~" H 6700 3200 50  0001 C CNN
	1    6700 3200
	0    -1   -1   0   
$EndComp
Wire Wire Line
	6900 3100 6900 2500
NoConn ~ 5500 2700
Wire Wire Line
	5500 2100 5800 2100
Wire Wire Line
	5500 2000 5800 2000
NoConn ~ 5500 1900
NoConn ~ 5500 1800
NoConn ~ 5500 1700
NoConn ~ 5500 1500
NoConn ~ 4900 3200
NoConn ~ 4500 2400
NoConn ~ 4500 2200
NoConn ~ 5500 2800
NoConn ~ 4500 2100
NoConn ~ 4500 2000
NoConn ~ 4500 1900
NoConn ~ 4500 1800
NoConn ~ 4500 1600
NoConn ~ 4500 2800
NoConn ~ 4500 2700
Wire Wire Line
	5100 3500 5100 3200
Wire Wire Line
	5800 2400 5500 2400
Wire Wire Line
	5500 2300 5800 2300
Wire Wire Line
	5500 2200 5800 2200
Wire Wire Line
	4800 3400 7100 3400
Wire Wire Line
	6800 3100 6800 3200
Connection ~ 7000 3200
$Comp
L Device:R_Small_US R5
U 1 1 5E6FA832
P 6900 3200
F 0 "R5" V 6500 3400 50  0001 C CNN
F 1 "2K" V 6800 3200 50  0000 C CNN
F 2 "" H 6900 3200 50  0001 C CNN
F 3 "~" H 6900 3200 50  0001 C CNN
	1    6900 3200
	0    -1   -1   0   
$EndComp
Connection ~ 7400 2400
Wire Wire Line
	7400 2400 7400 3200
Connection ~ 7400 2200
Wire Wire Line
	7400 2200 7400 2400
Connection ~ 7400 2000
Connection ~ 7100 3400
Wire Wire Line
	7500 3400 7100 3400
NoConn ~ 6700 3100
NoConn ~ 7200 3100
Wire Wire Line
	7000 3200 7400 3200
Wire Wire Line
	7000 3100 7000 3200
Wire Wire Line
	7100 3400 7100 3100
Wire Wire Line
	7400 2000 7300 2000
Wire Wire Line
	7400 2200 7400 2000
Wire Wire Line
	7300 2200 7400 2200
Wire Wire Line
	7400 2400 6300 2400
Wire Wire Line
	6300 2200 7100 2200
Wire Wire Line
	6300 2000 7100 2000
$Comp
L Device:R_Small_US R3
U 1 1 5E5DCD06
P 7200 2200
F 0 "R3" V 6995 2200 50  0001 C CNN
F 1 "470" V 7087 2200 50  0000 C CNN
F 2 "" H 7200 2200 50  0001 C CNN
F 3 "~" H 7200 2200 50  0001 C CNN
	1    7200 2200
	0    1    1    0   
$EndComp
$Comp
L Device:R_Small_US R2
U 1 1 5E5EA4C5
P 7200 2000
F 0 "R2" V 6995 2000 50  0001 C CNN
F 1 "470" V 7087 2000 50  0000 C CNN
F 2 "" H 7200 2000 50  0001 C CNN
F 3 "~" H 7200 2000 50  0001 C CNN
	1    7200 2000
	0    1    1    0   
$EndComp
$Comp
L connector_sensor_2:Connector J?
U 1 1 5E95AD30
P 3700 2600
F 0 "J?" H 3700 2900 50  0001 C CNN
F 1 "Connector" H 3500 3100 50  0000 C CNN
F 2 "" H 3700 2600 50  0001 C CNN
F 3 "~" H 3700 2600 50  0001 C CNN
	1    3700 2600
	1    0    0    -1  
$EndComp
Text Label 3300 2200 0    50   ~ 0
Sensor
$EndSCHEMATC
