// Jest Snapshot v1, https://goo.gl/fbAQLP

exports[`TaskAppContainer should render TaskAppContainer 1`] = `
<div
  className="task-layout"
>
  <div
    className="header-container"
  >
    <header
      className="tasks-header"
      onClick={[Function]}
    >
      Task Manager
    </header>
    <button
      className="logout-button"
      onClick={[Function]}
      type="submit"
    >
      Log out
    </button>
  </div>
  <div
    className="task-feed"
  />
  <div
    className="task-buttons-container"
  >
    <button
      className="create-new-button"
      onClick={[Function]}
      type="submit"
    >
      Add New +
    </button>
    <div>
      <img
        alt="caret-up"
        id="ascending-arrow"
        onClick={[Function]}
        src="caret-up.svg"
        title="Sort in ascending order"
      />
      <img
        alt="caret-down"
        id="descending-arrow"
        onClick={[Function]}
        src="caret-down.svg"
        title="Sort in descending order"
      />
    </div>
  </div>
</div>
`;
