{
  "builders": [
    {
      "boot_command": [
        "<tab> text ks=http://{{ .HTTPIP }}:{{ .HTTPPort }}/ks.cfg<enter>"
      ],
      "guest_os_type": "RedHat_64",
      "headless": "false",
      "http_directory": "http",
      "iso_checksum_type": "sha256",
      "iso_checksum": "714acc0aefb32b7d51b515e25546835e55a90da9fb00417fbee2d03a62801efd",
      "iso_urls": [
        "CentOS-7-x86_64-Minimal-1708.iso",
        "http://mirror.globo.com/centos/7/isos/x86_64/CentOS-7-x86_64-Minimal-1804.iso"
      ],
      "shutdown_command": "echo 'vagrant' | sudo -S /sbin/halt -h -p",
      "ssh_password": "vagrant",
      "ssh_username": "vagrant",
      "ssh_wait_timeout": "50000s",
      "type": "virtualbox-iso",
      "vboxmanage": [
        [
          "modifyvm",
          "{{.Name}}",
          "--memory",
          "2048"
        ],
        [
          "modifyvm",
          "{{.Name}}",
          "--cpus",
          "2"
        ]
      ],
      "vm_name": "centos7-nocm"
    }
  ],
  "post-processors": [
  [
    {
      "type": "vagrant",
      "output": "centos7-nocm.box",
      "keep_input_artifact": false
    }
   ]
  ],
  "provisioners": [
    {
      "execute_command": "echo 'vagrant' | {{.Vars}} sudo -S -E bash '{{.Path}}'",
      "scripts": [
        "scripts/vagrant.sh",
        "scripts/virtualbox.sh",
        "scripts/sysadmin.sh",
        "scripts/cleanup.sh"
      ],
      "type": "shell"
    }
  ]

}
