NOK 
NOK 
NOK 
NOK 
NOK 
NOK 
NOK 
NOK 
NOK 
NOK 
NOK 
NOK 
NOK 
NOK 
NOK 
NOK 
NOK 
NOK 
NOK 
NOK 
NOK 
NOK 
NOK 
NOK 
NOK 
NOK 
NOK 
NOK 
NOK 
NOK 
NOK 
NOK 
NOK 
NOK 
NOK 
NOK 
NOK 
NOK 
NOK 
NOK 
NOK 
NOK 
NOK 
NOK 
NOK 
NOK 
NOK 
NOK 
NOK 
NOK 
NOK 
NOK 
NOK 
NOK 
NOK 
NOK 
NOK 
NOK 
NOK 
NOK 
NOK 
NOK 
NOK 
NOK 
NOK 
NOK 
NOK 
NOK 
NOK 
NOK 
NOK 
NOK 
NOK 
NOK 
NOK 
NOK 
NOK 
NOK 
NOK 
NOK 
NOK 
NOK 
NOK 
NOK 
NOK 
NOK 
NOK 
NOK 
NOK 
NOK 
NOK 
NOK 
NOK 
NOK 
NOK 
NOK 
NOK 
NOK 
NOK 
NOK 
NOK 
NOK 
NOK 
NOK 
NOK 
NOK 
NOK 
NOK 
NOK 
NOK 
NOK 
NOK 
NOK 
NOK 
NOK 
NOK 
NOK 
NOK 
NOK 
NOK 
NOK 
NOK 
NOK 
NOK 
NOK 
NOK 
NOK 
NOK 
NOK 
NOK 
NOK 
NOK 
NOK 
NOK 
NOK 
NOK 
NOK 
NOK 
NOK 
NOK 
NOK 
NOK 
NOK 
NOK 
NOK 
NOK 
NOK 
NOK 
NOK 
NOK 
NOK 
NOK 
NOK 
NOK 
NOK 
NOK 
NOK 
NOK 
NOK 
NOK 
NOK 
NOK 
NOK 
NOK 
NOK 
NOK 
NOK 
NOK 
NOK 
NOK 
NOK 
NOK 
NOK 
NOK 
NOK 
NOK 
NOK 
NOK 
NOK 
NOK 
NOK 
NOK 
NOK 
NOK 
NOK 
NOK 
NOK 
NOK 
NOK 
NOK 
NOK 
NOK 
NOK 
NOK 
NOK 
NOK 
NOK 
NOK 
NOK 
NOK 
NOK 
NOK 
NOK 
NOK 
NOK 
NOK 
NOK 
NOK 
NOK 
NOK 
NOK 
NOK 
NOK 
NOK 
NOK 
NOK 
NOK 
NOK 
NOK 
NOK 
NOK 
NOK 
NOK 
NOK 
NOK 
NOK 
NOK 
NOK 
NOK 
NOK 
NOK 
NOK 
NOK 
NOK 
NOK 
NOK 
NOK 
NOK 
NOK 
NOK 
NOK 
NOK 
NOK 
NOK 
NOK 
NOK 
NOK 
NOK 
NOK 
NOK 
NOK 
NOK 
NOK 
NOK 
NOK 
NOK 
NOK 
NOK 
NOK 
NOK 
NOK 
NOK 
NOK 
NOK 
NOK 
NOK 
NOK 
NOK 
NOK 
NOK 
NOK 
NOK 
NOK 
NOK 
NOK 
NOK 
NOK 
NOK 
NOK 
NOK 
NOK 
NOK 
NOK 
NOK 
NOK 
NOK 
NOK 
NOK 
NOK 
NOK 
NOK 
NOK 
NOK 
NOK 
NOK 
NOK 
NOK 
NOK 
NOK 
NOK 
NOK 
NOK 
NOK 
NOK 
NOK 
NOK 
NOK 
NOK 
NOK 
NOK 
NOK 
