{
    "name": "Wildanisme",
    "title": "Fullstuck Developer :(",
    "description": "Orang biasa yang masih mendalami makna kehidupan seutuhnya. Seorang pembelajar.",
    "thumbnail": "wildan.png",
    "social": [
      {
        "name": "Instagram",
        "url": "https://instagram.com/wildan.isme"
      },
      {
        "name": "Twitter",
        "url": "https://twitter.com/twitter"
      },
      {
        "name": "Website",
        "url": "https://wildanisme.com"
      }
    ],
    "skills": ["Graphic Design", "Javascript", "UI/UX"]
  }
  