%YAML 1.1
%TAG !u! tag:unity3d.com,2011:
--- !u!21 &2100000
Material:
  serializedVersion: 6
  m_ObjectHideFlags: 0
  m_CorrespondingSourceObject: {fileID: 0}
  m_PrefabInstance: {fileID: 0}
  m_PrefabAsset: {fileID: 0}
  m_Name: RaccoonPA Red Panda
  m_Shader: {fileID: 46, guid: 0000000000000000f000000000000000, type: 0}
  m_ShaderKeywords: 
  m_LightmapFlags: 4
  m_EnableInstancingVariants: 0
  m_DoubleSidedGI: 0
  m_CustomRenderQueue: -1
  stringTagMap: {}
  disabledShaderPasses: []
  m_SavedProperties:
    serializedVersion: 3
    m_TexEnvs:
    - _Albedo:
        m_Texture: {fileID: 0}
        m_Scale: {x: 1, y: 1}
        m_Offset: {x: 0, y: 0}
    - _BumpMap:
        m_Texture: {fileID: 0}
        m_Scale: {x: 1, y: 1}
        m_Offset: {x: 0, y: 0}
    - _DetailAlbedoMap:
        m_Texture: {fileID: 0}
        m_Scale: {x: 1, y: 1}
        m_Offset: {x: 0, y: 0}
    - _DetailMask:
        m_Texture: {fileID: 0}
        m_Scale: {x: 1, y: 1}
        m_Offset: {x: 0, y: 0}
    - _DetailNormalMap:
        m_Texture: {fileID: 0}
        m_Scale: {x: 1, y: 1}
        m_Offset: {x: 0, y: 0}
    - _Emission:
        m_Texture: {fileID: 0}
        m_Scale: {x: 1, y: 1}
        m_Offset: {x: 0, y: 0}
    - _EmissionMap:
        m_Texture: {fileID: 0}
        m_Scale: {x: 1, y: 1}
        m_Offset: {x: 0, y: 0}
    - _MainTex:
        m_Texture: {fileID: 2800000, guid: 57367a9220af3bf44b87b59ce6265475, type: 3}
        m_Scale: {x: 1, y: 1}
        m_Offset: {x: 0, y: 0}
    - _Mask1:
        m_Texture: {fileID: 0}
        m_Scale: {x: 1, y: 1}
        m_Offset: {x: 0, y: 0}
    - _Mask2:
        m_Texture: {fileID: 0}
        m_Scale: {x: 1, y: 1}
        m_Offset: {x: 0, y: 0}
    - _Metalic_Smoothness:
        m_Texture: {fileID: 0}
        m_Scale: {x: 1, y: 1}
        m_Offset: {x: 0, y: 0}
    - _MetallicGlossMap:
        m_Texture: {fileID: 0}
        m_Scale: {x: 1, y: 1}
        m_Offset: {x: 0, y: 0}
    - _Normal:
        m_Texture: {fileID: 0}
        m_Scale: {x: 1, y: 1}
        m_Offset: {x: 0, y: 0}
    - _OcclusionMap:
        m_Texture: {fileID: 0}
        m_Scale: {x: 1, y: 1}
        m_Offset: {x: 0, y: 0}
    - _ParallaxMap:
        m_Texture: {fileID: 0}
        m_Scale: {x: 1, y: 1}
        m_Offset: {x: 0, y: 0}
    - _texcoord:
        m_Texture: {fileID: 0}
        m_Scale: {x: 1, y: 1}
        m_Offset: {x: 0, y: 0}
    m_Floats:
    - _BumpScale: 1
    - _Cutoff: 0.5
    - _DetailNormalMapScale: 1
    - _DstBlend: 0
    - _EmissionPower: 3
    - _GlossMapScale: 1
    - _Glossiness: 0
    - _GlossyReflections: 1
    - _M1AHue: 1
    - _M1ASaturation: 0.8705882
    - _M1AValue: 1
    - _M1BHue: 1
    - _M1BSaturation: 1
    - _M1BValue: 1
    - _M1GHue: 1
    - _M1GSaturation: 1
    - _M1GValue: 1
    - _M1RHue: 1
    - _M1RSaturation: 1
    - _M1RValue: 1
    - _M2AHue: 1
    - _M2ASaturation: 0.8705882
    - _M2AValue: 1
    - _M2BHue: 1
    - _M2BSaturation: 1
    - _M2BValue: 1
    - _M2GHue: 1
    - _M2GSaturation: 1
    - _M2GValue: 1
    - _M2RHue: 1
    - _M2RSaturation: 1
    - _M2RValue: 1
    - _Metallic: 0
    - _Mode: 0
    - _NormalIntensity: 3
    - _OcclusionStrength: 1
    - _Parallax: 0.02
    - _Smoothness: 1
    - _SmoothnessTextureChannel: 0
    - _SpecularHighlights: 1
    - _SrcBlend: 1
    - _Transparency: 0.5
    - _UVSec: 0
    - _UseRawEmission: 0
    - _ZWrite: 1
    - __dirty: 0
    m_Colors:
    - _AddEmissiveColor: {r: 0, g: 0, b: 0, a: 0}
    - _Color: {r: 1, g: 1, b: 1, a: 1}
    - _Color1: {r: 0.3584906, g: 0.3584906, b: 0.3584906, a: 0.153}
    - _Color10: {r: 0.25735295, g: 0.1504525, b: 0.121107265, a: 0}
    - _Color11: {r: 0.6691177, g: 0.6691177, b: 0.6691177, a: 0.647}
    - _Color12: {r: 0.50735295, g: 0.50735295, b: 0.50735295, a: 0.128}
    - _Color13: {r: 0.77205884, g: 0.77205884, b: 0.77205884, a: 0.272}
    - _Color14: {r: 0.2352941, g: 0.2352941, b: 0.2352941, a: 0.047}
    - _Color15: {r: 0.875, g: 0.4632353, b: 0.4632353, a: 0.391}
    - _Color16: {r: 0.07731399, g: 0.09558821, b: 0.08122089, a: 0.134}
    - _Color2: {r: 0.003921569, g: 0.11764707, b: 0.08235294, a: 0.153}
    - _Color3: {r: 0.14705884, g: 0.11570071, b: 0.11570071, a: 0.234}
    - _Color4: {r: 0.14705884, g: 0.11570071, b: 0.11570071, a: 0.234}
    - _Color5: {r: 0.85294116, g: 0.78650516, b: 0.70242214, a: 0.23529412}
    - _Color6: {r: 0.854902, g: 0.78823537, b: 0.7019608, a: 0.153}
    - _Color7: {r: 0.85294116, g: 0.78650516, b: 0.70242214, a: 0.23529412}
    - _Color8: {r: 0.85294116, g: 0.78650516, b: 0.70242214, a: 0.23529412}
    - _Color9: {r: 0.85294116, g: 0.78650516, b: 0.70242214, a: 0.23529412}
    - _ColorMultiplier: {r: 1, g: 1, b: 1, a: 1}
    - _Color_13: {r: 0.58823526, g: 0.22923875, b: 0.22923875, a: 0.272}
    - _Color_14: {r: 0.125, g: 0.10357505, b: 0.065257356, a: 0.541}
    - _Color_15: {r: 0.7794118, g: 0.7794118, b: 0.7794118, a: 0.928}
    - _Color_16: {r: 0, g: 0, b: 0, a: 1}
    - _EmissionColor: {r: 0, g: 0, b: 0, a: 1}
