%YAML 1.1
%TAG !u! tag:unity3d.com,2011:
--- !u!114 &11400000
MonoBehaviour:
  m_ObjectHideFlags: 0
  m_CorrespondingSourceObject: {fileID: 0}
  m_PrefabInstance: {fileID: 0}
  m_PrefabAsset: {fileID: 0}
  m_GameObject: {fileID: 0}
  m_Enabled: 1
  m_EditorHideFlags: 0
  m_Script: {fileID: 11500000, guid: 0469cdebf4a3874429a1da63263a3098, type: 3}
  m_Name: Collectible7
  m_EditorClassIdentifier: 
  mCollectibleID: 7
  mSceneID: 2
  mCollectibleStory: But what they found in the caves was far worse than what they
    could have possibly imagined, they were overwhelmed.
