%YAML 1.1
%TAG !u! tag:unity3d.com,2011:
--- !u!1 &7750431603809083353
GameObject:
  m_ObjectHideFlags: 0
  m_CorrespondingSourceObject: {fileID: 0}
  m_PrefabInstance: {fileID: 0}
  m_PrefabAsset: {fileID: 0}
  serializedVersion: 6
  m_Component:
  - component: {fileID: 7750431603809083354}
  m_Layer: 14
  m_Name: LWallIntCorn
  m_TagString: Untagged
  m_Icon: {fileID: 0}
  m_NavMeshLayer: 0
  m_StaticEditorFlags: 4294967295
  m_IsActive: 1
--- !u!4 &7750431603809083354
Transform:
  m_ObjectHideFlags: 0
  m_CorrespondingSourceObject: {fileID: 0}
  m_PrefabInstance: {fileID: 0}
  m_PrefabAsset: {fileID: 0}
  m_GameObject: {fileID: 7750431603809083353}
  m_LocalRotation: {x: 0, y: 0, z: 0, w: 1}
  m_LocalPosition: {x: 0, y: 0, z: 0}
  m_LocalScale: {x: 1, y: 1, z: 1}
  m_Children:
  - {fileID: 5415762265016540934}
  m_Father: {fileID: 0}
  m_RootOrder: 0
  m_LocalEulerAnglesHint: {x: 0, y: 0, z: 0}
--- !u!64 &2055025521090334468
MeshCollider:
  m_ObjectHideFlags: 0
  m_CorrespondingSourceObject: {fileID: 0}
  m_PrefabInstance: {fileID: 0}
  m_PrefabAsset: {fileID: 0}
  m_GameObject: {fileID: 9039849041635077397}
  m_Material: {fileID: 0}
  m_IsTrigger: 0
  m_Enabled: 1
  serializedVersion: 4
  m_Convex: 1
  m_CookingOptions: 30
  m_Mesh: {fileID: 3757301508322391122, guid: 57b76e0e0add8ed44b0c74b9b07c818b, type: 3}
--- !u!1001 &1031909085401789468
PrefabInstance:
  m_ObjectHideFlags: 0
  serializedVersion: 2
  m_Modification:
    m_TransformParent: {fileID: 7750431603809083354}
    m_Modifications:
    - target: {fileID: -4216859302048453862, guid: 57b76e0e0add8ed44b0c74b9b07c818b,
        type: 3}
      propertyPath: m_LocalPosition.x
      value: 3.0006
      objectReference: {fileID: 0}
    - target: {fileID: -4216859302048453862, guid: 57b76e0e0add8ed44b0c74b9b07c818b,
        type: 3}
      propertyPath: m_LocalPosition.y
      value: -0.013596
      objectReference: {fileID: 0}
    - target: {fileID: -4216859302048453862, guid: 57b76e0e0add8ed44b0c74b9b07c818b,
        type: 3}
      propertyPath: m_LocalPosition.z
      value: -3
      objectReference: {fileID: 0}
    - target: {fileID: -4216859302048453862, guid: 57b76e0e0add8ed44b0c74b9b07c818b,
        type: 3}
      propertyPath: m_LocalRotation.x
      value: 0
      objectReference: {fileID: 0}
    - target: {fileID: -4216859302048453862, guid: 57b76e0e0add8ed44b0c74b9b07c818b,
        type: 3}
      propertyPath: m_LocalRotation.y
      value: -0
      objectReference: {fileID: 0}
    - target: {fileID: -4216859302048453862, guid: 57b76e0e0add8ed44b0c74b9b07c818b,
        type: 3}
      propertyPath: m_LocalRotation.z
      value: -0
      objectReference: {fileID: 0}
    - target: {fileID: -4216859302048453862, guid: 57b76e0e0add8ed44b0c74b9b07c818b,
        type: 3}
      propertyPath: m_LocalRotation.w
      value: 1
      objectReference: {fileID: 0}
    - target: {fileID: -4216859302048453862, guid: 57b76e0e0add8ed44b0c74b9b07c818b,
        type: 3}
      propertyPath: m_RootOrder
      value: 0
      objectReference: {fileID: 0}
    - target: {fileID: -4216859302048453862, guid: 57b76e0e0add8ed44b0c74b9b07c818b,
        type: 3}
      propertyPath: m_LocalEulerAnglesHint.x
      value: 0
      objectReference: {fileID: 0}
    - target: {fileID: -4216859302048453862, guid: 57b76e0e0add8ed44b0c74b9b07c818b,
        type: 3}
      propertyPath: m_LocalEulerAnglesHint.y
      value: 0
      objectReference: {fileID: 0}
    - target: {fileID: -4216859302048453862, guid: 57b76e0e0add8ed44b0c74b9b07c818b,
        type: 3}
      propertyPath: m_LocalEulerAnglesHint.z
      value: 0
      objectReference: {fileID: 0}
    - target: {fileID: -927199367670048503, guid: 57b76e0e0add8ed44b0c74b9b07c818b,
        type: 3}
      propertyPath: m_Name
      value: LWallIntCorn
      objectReference: {fileID: 0}
    - target: {fileID: -927199367670048503, guid: 57b76e0e0add8ed44b0c74b9b07c818b,
        type: 3}
      propertyPath: m_StaticEditorFlags
      value: 4294967295
      objectReference: {fileID: 0}
    - target: {fileID: -927199367670048503, guid: 57b76e0e0add8ed44b0c74b9b07c818b,
        type: 3}
      propertyPath: m_Layer
      value: 14
      objectReference: {fileID: 0}
    m_RemovedComponents: []
  m_SourcePrefab: {fileID: 100100000, guid: 57b76e0e0add8ed44b0c74b9b07c818b, type: 3}
--- !u!1 &9039849041635077397 stripped
GameObject:
  m_CorrespondingSourceObject: {fileID: -927199367670048503, guid: 57b76e0e0add8ed44b0c74b9b07c818b,
    type: 3}
  m_PrefabInstance: {fileID: 1031909085401789468}
  m_PrefabAsset: {fileID: 0}
--- !u!4 &5415762265016540934 stripped
Transform:
  m_CorrespondingSourceObject: {fileID: -4216859302048453862, guid: 57b76e0e0add8ed44b0c74b9b07c818b,
    type: 3}
  m_PrefabInstance: {fileID: 1031909085401789468}
  m_PrefabAsset: {fileID: 0}
