cid,laser_no,file_name,create_date,create_time,create_by,status,box_pre_id,sublot
6007260215323b100,JT3104571060,A,2018-02-18,09:00:00,11111111111,S101,B_0008,1
6007260215323b101,JT3104571061,A,2018-02-18,09:00:00,11111111111,S101,B_0008,2
6007260215323b103,JT3104571063,A,2018-02-18,09:00:00,11111111111,S101,B_0008,2
6007260215323b104,JT3104571064,A,2018-02-18,09:00:00,11111111111,S101,B_0008,2
6007260215323b105,JT3104571065,A,2018-02-18,09:00:00,11111111111,S101,B_0008,2
6007260215323b106,JT3104571066,A,2018-02-18,09:00:00,11111111111,S101,B_0009,2
6007260215323b107,JT3104571067,A,2018-02-18,09:00:00,11111111111,S101,B_0009,2
6007260215323b108,JT3104571068,A,2018-02-18,09:00:00,11111111111,S101,B_0009,2
6007260215323b109,JT3104571069,A,2018-02-18,09:00:00,11111111111,S101,B_0009,2
6007260215323b110,JT3104571070,A,2018-02-18,09:00:00,11111111111,S101,B_0009,2
6007260215323b111,JT3104571071,A,2018-02-18,09:00:00,11111111111,S101,B_0009,2
6007260215323b112,JT3104571072,A,2018-02-18,09:00:00,11111111111,S101,B_0009,2
6007260215323b113,JT3104571073,A,2018-02-18,09:00:00,11111111111,S101,B_0009,2
6007260215323b114,JT3104571074,A,2018-02-18,09:00:00,11111111111,S101,B_0009,2
6007260215323b115,JT3104571075,A,2018-02-18,09:00:00,11111111111,S101,B_0009,2
6007260215323b116,JT3104571076,A,2018-02-18,09:00:00,11111111111,S101,B_0010,2
6007260215323b117,JT3104571077,A,2018-02-18,09:00:00,11111111111,S101,B_0010,2
6007260215323b118,JT3104571078,A,2018-02-18,09:00:00,11111111111,S101,B_0010,2
6007260215323b119,JT3104571079,A,2018-02-18,09:00:00,11111111111,S101,B_0010,2
6007260215323b120,JT3104571080,A,2018-02-18,09:00:00,11111111111,S101,B_0010,2
6007260215323b121,JT3104571081,A,2018-02-18,09:00:00,11111111111,S101,B_0010,2
6007260215323b122,JT3104571082,A,2018-02-18,09:00:00,11111111111,S101,B_0010,2
6007260215323b123,JT3104571083,A,2018-02-18,09:00:00,11111111111,S101,B_0010,2
6007260215323b124,JT3104571084,A,2018-02-18,09:00:00,11111111111,S101,B_0010,2
6007260215323b125,JT3104571085,A,2018-02-18,09:00:00,11111111111,S101,B_0010,2
6007260215323b126,JT3104571086,A,2018-02-18,09:00:00,11111111111,S101,B_0011,2
6007260215323b127,JT3104571087,A,2018-02-18,09:00:00,11111111111,S101,B_0011,2
6007260215323b128,JT3104571088,A,2018-02-18,09:00:00,11111111111,S101,B_0011,2
6007260215323b129,JT3104571089,A,2018-02-18,09:00:00,11111111111,S101,B_0011,2
6007260215323b130,JT3104571090,A,2018-02-18,09:00:00,11111111111,S101,B_0011,2
6007260215323b131,JT3104571091,A,2018-02-18,09:00:00,11111111111,S101,B_0011,1
6007260215323b134,JT3104571094,A,2018-02-18,09:00:00,11111111111,S101,B_0011,1
6007260215323b135,JT3104571095,A,2018-02-18,09:00:00,11111111111,S101,B_0011,1
6007260215323b136,JT3104571096,A,2018-02-18,09:00:00,11111111111,S101,B_0012,1
6007260215323b138,JT3104571098,A,2018-02-18,09:00:00,11111111111,S101,B_0011,1
6007260215323b139,JT3104571099,A,2018-02-18,09:00:00,11111111111,S101,B_0012,1
6007260215323b140,JT3104571100,A,2018-02-18,09:00:00,11111111111,S101,B_0012,1
6007260215323b141,JT3104571101,A,2018-02-18,09:00:00,11111111111,S101,B_0012,1
6007260215323b142,JT3104571102,A,2018-02-18,09:00:00,11111111111,S101,B_0012,1
6007260215323b143,JT3104571103,A,2018-02-18,09:00:00,11111111111,S101,B_0012,1
6007260215323b144,JT3104571104,A,2018-02-18,09:00:00,11111111111,S101,B_0012,1
6007260215323b145,JT3104571105,A,2018-02-18,09:00:00,11111111111,S101,B_0012,1
6007260215323b146,JT3104571106,A,2018-02-18,09:00:00,11111111111,S101,B_0012,1
6007260215323b147,JT3104571107,A,2018-02-18,09:00:00,11111111111,S101,B_0012,1
6007260215323b148,JT3104571108,A,2018-02-18,09:00:00,11111111111,S101,B_0012,1
6007260215323b149,JT3104571109,A,2018-02-18,09:00:00,11111111111,S101,B_0013,1
6007260215323b150,JT3104571110,A,2018-02-18,09:00:00,11111111111,S101,B_0013,1
6007260215323b151,JT3104571111,A,2018-02-18,09:00:00,11111111111,S101,B_0013,1
6007260215323b152,JT3104571112,A,2018-02-18,09:00:00,11111111111,S101,B_0013,1
6007260215323b153,JT3104571113,A,2018-02-18,09:00:00,11111111111,S101,B_0013,1
6007260215323b154,JT3104571114,A,2018-02-18,09:00:00,11111111111,S101,B_0013,1
6007260215323b155,JT3104571115,A,2018-02-18,09:00:00,11111111111,S101,B_0013,1
6007260215323b156,JT3104571116,A,2018-02-18,09:00:00,11111111111,S101,B_0013,1
6007260215323b157,JT3104571117,A,2018-02-18,09:00:00,11111111111,S101,B_0013,1
6007260215323b158,JT3104571118,A,2018-02-18,09:00:00,11111111111,S101,B_0013,1
6007260215323b159,JT3104571119,A,2018-02-18,09:00:00,11111111111,S101,B_0014,1
6007260215323b160,JT3104571120,A,2018-02-18,09:00:00,11111111111,S101,B_0014,1
6007260215323b161,JT3104571121,A,2018-02-18,09:00:00,11111111111,S101,B_0014,1
6007260215323b162,JT3104571122,A,2018-02-18,09:00:00,11111111111,S101,B_0014,1
6007260215323b163,JT3104571123,A,2018-02-18,09:00:00,11111111111,S101,B_0014,1
6007260215323b164,JT3104571124,A,2018-02-18,09:00:00,11111111111,S101,B_0014,1
6007260215323b165,JT3104571125,A,2018-02-18,09:00:00,11111111111,S101,B_0014,1
6007260215323b166,JT3104571126,A,2018-02-18,09:00:00,11111111111,S101,B_0014,1
6007260215323b167,JT3104571127,A,2018-02-18,09:00:00,11111111111,S101,B_0014,1
6007260215323b168,JT3104571128,A,2018-02-18,09:00:00,11111111111,S101,B_0014,1
6007260215323b169,JT3104571129,A,2018-02-18,09:00:00,11111111111,S101,B_0015,1
6007260215323b170,JT3104571130,A,2018-02-18,09:00:00,11111111111,S101,B_0015,1
6007260215323b171,JT3104571131,A,2018-02-18,09:00:00,11111111111,S101,B_0015,1
6007260215323b172,JT3104571132,A,2018-02-18,09:00:00,11111111111,S101,B_0015,1
6007260215323b173,JT3104571133,A,2018-02-18,09:00:00,11111111111,S101,B_0015,1
6007260215323b175,JT3104571135,A,2018-02-18,09:00:00,11111111111,S101,B_0015,1
6007260215323b176,JT3104571136,A,2018-02-18,09:00:00,11111111111,S101,B_0015,1
6007260215323b177,JT3104571137,A,2018-02-18,09:00:00,11111111111,S101,B_0015,1
6007260215323b178,JT3104571138,A,2018-02-18,09:00:00,11111111111,S101,B_0015,1
6007260215323b179,JT3104571139,A,2018-02-18,09:00:00,11111111111,S101,B_0015,1
6007260215323b180,JT3104571140,A,2018-02-18,09:00:00,11111111111,S101,B_0016,1
6007260215323b181,JT3104571141,A,2018-02-18,09:00:00,11111111111,S101,B_0016,1
6007260215323b182,JT3104571142,A,2018-02-18,09:00:00,11111111111,S101,B_0016,1
6007260215323b183,JT3104571143,A,2018-02-18,09:00:00,11111111111,S101,B_0016,1
6007260215323b184,JT3104571144,A,2018-02-18,09:00:00,11111111111,S101,B_0016,1
6007260215323b185,JT3104571145,A,2018-02-18,09:00:00,11111111111,S101,B_0016,1
6007260215323b186,JT3104571146,A,2018-02-18,09:00:00,11111111111,S101,B_0016,1
6007260215323b187,JT3104571147,A,2018-02-18,09:00:00,11111111111,S101,B_0016,1
6007260215323b188,JT3104571148,A,2018-02-18,09:00:00,11111111111,S101,B_0016,1
6007260215323b189,JT3104571149,A,2018-02-18,09:00:00,11111111111,S101,B_0016,1
6007260215323b190,JT3104571150,A,2018-02-20,10:15:00,11111111111,S101,B_0017,1
6007260215323b191,JT3104571151,A,2018-02-20,10:15:00,11111111111,S101,B_0017,1
6007260215323b192,JT3104571152,A,2018-02-20,10:15:00,11111111111,S101,B_0017,1
6007260215323b193,JT3104571153,A,2018-02-20,10:15:00,11111111111,S101,B_0017,1
6007260215323b194,JT3104571154,A,2018-02-20,10:15:00,11111111111,S101,B_0017,1
6007260215323b195,JT3104571155,A,2018-02-20,10:15:00,11111111111,S101,B_0017,1
6007260215323b197,JT3104571157,A,2018-02-20,10:15:00,11111111111,S101,B_0017,1
6007260215323b198,JT3104571158,A,2018-02-20,10:15:00,11111111111,S101,B_0017,1
6007260215323b199,JT3104571159,A,2018-02-20,10:15:00,11111111111,S101,B_0017,1
6007260215323b200,JT3104571160,A,2018-02-20,10:15:00,11111111111,S101,B_0017,1
6007260215323b201,JT3104571161,A,2018-02-20,10:15:00,11111111111,S101,B_0018,1
6007260215323b202,JT3104571162,A,2018-02-20,10:15:00,11111111111,S101,B_0018,1
6007260215323b203,JT3104571163,A,2018-02-20,10:15:00,11111111111,S101,B_0018,1
6007260215323b204,JT3104571164,A,2018-02-20,10:15:00,11111111111,S101,B_0018,1
6007260215323b205,JT3104571165,A,2018-02-20,10:15:00,11111111111,S101,B_0018,1
6007260215323b206,JT3104571166,A,2018-02-20,10:15:00,11111111111,S101,B_0018,1
6007260215323b207,JT3104571167,A,2018-02-20,10:15:00,11111111111,S101,B_0018,1
6007260215323b208,JT3104571168,A,2018-02-20,10:15:00,11111111111,S101,B_0018,1
6007260215323b21,JT3104570981,A,2018-02-17,09:15:00,11111111111,S101,B_0001,1
6007260215323b210,JT3104571170,A,2018-02-20,10:15:00,11111111111,S101,B_0018,1
6007260215323b211,JT3104571171,A,2018-02-20,10:15:00,11111111111,S101,B_0018,1
6007260215323b212,JT3104571172,A,2018-02-20,10:15:00,11111111111,S011,B_0019,1
6007260215323b213,JT3104571173,A,2018-02-20,10:15:00,11111111111,S011,B_0019,1
6007260215323b214,JT3104571174,A,2018-02-20,10:15:00,11111111111,S011,B_0019,1
6007260215323b215,JT3104571175,A,2018-02-20,10:15:00,11111111111,S011,B_0019,1
6007260215323b22,JT3104570982,A,2018-02-17,09:15:00,11111111111,S101,B_0001,1
6007260215323b23,JT3104570983,A,2018-02-17,09:15:00,11111111111,S101,B_0001,1
6007260215323b24,JT3104570984,A,2018-02-17,09:15:00,11111111111,S101,B_0001,1
6007260215323b25,JT3104570985,A,2018-02-17,09:15:00,11111111111,S101,B_0001,1
6007260215323b26,JT3104570986,A,2018-02-17,09:15:00,11111111111,S101,B_0001,1
6007260215323b28,JT3104570988,A,2018-02-17,09:15:00,11111111111,S101,B_0001,1
6007260215323b29,JT3104570989,A,2018-02-17,09:15:00,11111111111,S101,B_0001,1
6007260215323b30,JT3104570990,A,2018-02-17,09:15:00,11111111111,S101,B_0001,1
6007260215323b31,JT3104570991,A,2018-02-17,09:15:00,11111111111,S101,B_0001,1
6007260215323b32,JT3104570992,A,2018-02-17,09:15:00,11111111111,S101,B_0002,1
6007260215323b33,JT3104570993,A,2018-02-17,09:15:00,11111111111,S101,B_0002,1
6007260215323b34,JT3104570994,A,2018-02-17,09:15:00,11111111111,S101,B_0002,1
6007260215323b35,JT3104570995,A,2018-02-17,09:15:00,11111111111,S101,B_0002,1
6007260215323b36,JT3104570996,A,2018-02-17,09:15:00,11111111111,S101,B_0002,1
6007260215323b37,JT3104570997,A,2018-02-17,09:15:00,11111111111,S101,B_0002,1
6007260215323b38,JT3104570998,A,2018-02-17,09:15:00,11111111111,S101,B_0002,1
6007260215323b39,JT3104570999,A,2018-02-17,09:15:00,11111111111,S101,B_0002,1
6007260215323b40,JT3104571000,A,2018-02-17,09:15:00,11111111111,S101,B_0002,1
6007260215323b41,JT3104571001,A,2018-02-17,09:15:00,11111111111,S101,B_0002,1
6007260215323b42,JT3104571002,A,2018-02-17,09:15:00,11111111111,S101,B_0003,1
6007260215323b43,JT3104571003,A,2018-02-17,09:15:00,11111111111,S101,B_0003,1
6007260215323b44,JT3104571004,A,2018-02-17,09:15:00,11111111111,S101,B_0003,1
6007260215323b45,JT3104571005,A,2018-02-17,09:15:00,11111111111,S101,B_0003,1
6007260215323b46,JT3104571006,A,2018-02-17,09:15:00,11111111111,S101,B_0003,1
6007260215323b47,JT3104571007,A,2018-02-17,09:15:00,11111111111,S101,B_0003,1
6007260215323b48,JT3104571008,A,2018-02-17,09:15:00,11111111111,S101,B_0003,1
6007260215323b50,JT3104571010,A,2018-02-17,09:15:00,11111111111,S101,B_0003,1
6007260215323b51,JT3104571011,A,2018-02-17,09:15:00,11111111111,S101,B_0003,1
6007260215323b52,JT3104571012,A,2018-02-17,09:15:00,11111111111,S101,B_0003,1
6007260215323b53,JT3104571013,A,2018-02-17,09:15:00,11111111111,S101,B_0004,1
6007260215323b54,JT3104571014,A,2018-02-17,09:15:00,11111111111,S101,B_0004,1
6007260215323b55,JT3104571015,A,2018-02-17,09:15:00,11111111111,S101,B_0004,1
6007260215323b56,JT3104571016,A,2018-02-17,09:15:00,11111111111,S101,B_0004,1
6007260215323b57,JT3104571017,A,2018-02-17,09:15:00,11111111111,S101,B_0004,1
6007260215323b58,JT3104571018,A,2018-02-17,09:15:00,11111111111,S101,B_0004,1
6007260215323b59,JT3104571019,A,2018-02-17,09:15:00,11111111111,S101,B_0004,1
6007260215323b60,JT3104571020,A,2018-02-17,09:15:00,11111111111,S101,B_0004,1
6007260215323b61,JT3104571021,A,2018-02-17,09:15:00,11111111111,S101,B_0004,1
6007260215323b62,JT3104571022,A,2018-02-17,09:15:00,11111111111,S101,B_0004,1
6007260215323b63,JT3104571023,A,2018-02-17,09:15:00,11111111111,S101,B_0005,1
6007260215323b64,JT3104571024,A,2018-02-17,09:15:00,11111111111,S101,B_0005,1
6007260215323b65,JT3104571025,A,2018-02-17,09:15:00,11111111111,S101,B_0005,1
6007260215323b66,JT3104571026,A,2018-02-17,09:15:00,11111111111,S101,B_0005,1
6007260215323b67,JT3104571027,A,2018-02-17,09:15:00,11111111111,S101,B_0005,1
6007260215323b68,JT3104571028,A,2018-02-17,09:15:00,11111111111,S101,B_0005,1
6007260215323b69,JT3104571029,A,2018-02-17,09:15:00,11111111111,S101,B_0005,1
6007260215323b70,JT3104571030,A,2018-02-17,09:15:00,11111111111,S101,B_0005,1
6007260215323b71,JT3104571031,A,2018-02-17,09:15:00,11111111111,S101,B_0005,1
6007260215323b73,JT3104571033,A,2018-02-17,09:15:00,11111111111,S101,B_0005,1
6007260215323b74,JT3104571034,A,2018-02-17,09:15:00,11111111111,S101,B_0006,1
6007260215323b76,JT3104571036,A,2018-02-17,09:15:00,11111111111,S101,B_0006,1
6007260215323b77,JT3104571037,A,2018-02-17,09:15:00,11111111111,S101,B_0006,1
6007260215323b78,JT3104571038,A,2018-02-17,09:15:00,11111111111,S101,B_0006,1
6007260215323b79,JT3104571039,A,2018-02-17,09:15:00,11111111111,S101,B_0006,1
6007260215323b80,JT3104571040,A,2018-02-17,09:15:00,11111111111,S101,B_0006,1
6007260215323b81,JT3104571041,A,2018-02-17,09:15:00,11111111111,S101,B_0006,1
6007260215323b82,JT3104571042,A,2018-02-17,09:15:00,11111111111,S101,B_0006,1
6007260215323b83,JT3104571043,A,2018-02-17,09:15:00,11111111111,S101,B_0006,1
6007260215323b84,JT3104571044,A,2018-02-17,09:15:00,11111111111,S101,B_0006,1
6007260215323b85,JT3104571045,A,2018-02-17,09:15:00,11111111111,S101,B_0007,1
6007260215323b86,JT3104571046,A,2018-02-17,09:15:00,11111111111,S101,B_0007,1
6007260215323b87,JT3104571047,A,2018-02-17,09:15:00,11111111111,S101,B_0007,1
6007260215323b88,JT3104571048,A,2018-02-17,09:15:00,11111111111,S101,B_0007,1
6007260215323b89,JT3104571049,A,2018-02-17,09:15:00,11111111111,S101,B_0007,1
6007260215323b90,JT3104571050,A,2018-02-17,09:15:00,11111111111,S101,B_0007,1
6007260215323b91,JT3104571051,A,2018-02-17,09:15:00,11111111111,S101,B_0007,1
6007260215323b92,JT3104571052,A,2018-02-17,09:15:00,11111111111,S101,B_0007,1
6007260215323b93,JT3104571053,A,2018-02-17,09:15:00,11111111111,S101,B_0007,1
6007260215323b94,JT3104571054,A,2018-02-17,09:15:00,11111111111,S101,B_0007,1
6007260215323b95,JT3104571055,A,2018-02-18,09:00:00,11111111111,S101,B_0008,1
6007260215323b96,JT3104571056,A,2018-02-18,09:00:00,11111111111,S101,B_0008,1
6007260215323b97,JT3104571057,A,2018-02-18,09:00:00,11111111111,S101,B_0008,1
6007260215323b98,JT3104571058,A,2018-02-18,09:00:00,11111111111,S101,B_0008,1
6007260215323b99,JT3104571059,A,2018-02-18,09:00:00,11111111111,S101,B_0008,1
