^F:\VC\FINAL\FINAL\OBSTACLE&SAFEPATH\CONSOLEAPPLICATION1\DEBUG\SOURCE.OBJ
F:\VC\FINAL\FINAL\OBSTACLE&SAFEPATH\DEBUG\CONSOLEAPPLICATION1.ILK
F:\VC\FINAL\FINAL\OBSTACLE&SAFEPATH\DEBUG\CONSOLEAPPLICATION1.EXE
F:\VC\FINAL\FINAL\OBSTACLE&SAFEPATH\DEBUG\CONSOLEAPPLICATION1.PDB
