{
    "author": [
        "Evertiro (Evertiro#9261)"
    ],
    "short": "Dev playground for the widgitutils library.",
    "description": "Dev playground for the widgitutils library.",
    "requirements" : [
        "widgitutils"
    ],
    "install_msg": "Thanks for installing!",
    "min_bot_version": "3.1.8",
    "disabled": false,
    "hidden": true
}
