<?xml version="1.0" encoding="UTF-8"?>
<svg id="Logo_color" data-name="Logo color" xmlns="http://www.w3.org/2000/svg" viewBox="0 0 2062.5 467.97">
  <defs>
    <style>
      .cls-1 {
        fill: #0f1217;
      }

      .cls-2 {
        fill: #0c0f16;
      }

      .cls-3 {
        fill: #21a565;
      }
    </style>
  </defs>
  <g id="Vertical">
    <g id="Symbol">
      <path class="cls-3" d="m179.55,306.95c-8.67,0-17.37-.89-25.85-2.63-24.36-5.02-46.57-17.01-64.24-34.68-15.04-15.04-25.96-33.37-31.98-53.51,18.02,14.69,40.2,23.51,63.57,25.09,2.54.17,5.13.26,7.68.26,18.23,0,36.35-4.45,52.4-12.88,10.04-5.27,19.23-12.05,27.32-20.14,6.52-6.52,12.19-13.76,16.9-21.58,7.12,15.82,10.25,33.22,9.06,50.71-1.71,25.18-12.36,48.91-30.02,66.93-8.16,1.61-16.51,2.43-24.84,2.43Zm90.08-37.31c17.66-17.66,29.66-39.88,34.68-64.24,3.47-16.82,3.53-33.87.2-50.69-18.03-17.66-41.75-28.32-66.93-30.02-2.39-.16-4.82-.24-7.22-.24-14.99,0-29.9,3.2-43.49,9.31,7.82,4.71,15.05,10.38,21.57,16.9,8.09,8.09,14.87,17.28,20.14,27.32,9.67,18.42,14.04,39.2,12.62,60.08-1.58,23.36-10.4,45.55-25.09,63.57,20.14-6.02,38.48-16.94,53.51-31.98Zm-140.9-34.97c14.99,0,29.89-3.2,43.48-9.31-7.82-4.71-15.05-10.38-21.58-16.9-8.09-8.09-14.87-17.28-20.14-27.32-9.67-18.42-14.04-39.2-12.62-60.08,1.58-23.36,10.4-45.55,25.09-63.57-20.14,6.02-38.48,16.94-53.51,31.98-17.66,17.66-29.66,39.88-34.68,64.24-3.47,16.82-3.53,33.87-.2,50.69,18.03,17.66,41.75,28.32,66.93,30.02,2.39.16,4.82.24,7.22.24h0Zm21.91-84.01c8.09-8.09,17.28-14.87,27.32-20.14,16.05-8.43,34.17-12.88,52.4-12.88,2.55,0,5.13.09,7.68.26,23.36,1.58,45.55,10.4,63.57,25.09-6.02-20.15-16.94-38.48-31.98-53.51-17.67-17.66-39.88-29.66-64.24-34.68-8.48-1.75-17.17-2.63-25.85-2.63s-16.68.82-24.84,2.43c-17.66,18.03-28.32,41.75-30.02,66.93-1.19,17.48,1.94,34.88,9.06,50.71,4.71-7.82,10.38-15.06,16.9-21.58Z"/>
      <path class="cls-2" d="m179.55,0C80.39,0,0,80.39,0,179.55c0,139.08,149.34,288.42,179.55,288.42s179.55-149.34,179.55-288.42C359.1,80.39,278.71,0,179.55,0Zm0,318.06c-76.5,0-138.51-62.01-138.51-138.51S103.05,41.04,179.55,41.04s138.51,62.01,138.51,138.51-62.01,138.51-138.51,138.51Z"/>
    </g>
    <g>
      <path class="cls-1" d="m528.75,285c0-9.03-3.18-16-9.53-20.89-6.35-4.89-17.81-9.83-34.37-14.82-16.56-4.99-29.73-10.54-39.52-16.65-18.72-11.76-28.09-27.1-28.09-46.01,0-16.56,6.75-30.2,20.25-40.93,13.5-10.73,31.03-16.09,52.57-16.09,14.3,0,27.05,2.64,38.25,7.9,11.2,5.27,19.99,12.77,26.39,22.51,6.4,9.74,9.6,20.54,9.6,32.39h-35.57c0-10.73-3.37-19.12-10.09-25.19-6.73-6.07-16.35-9.1-28.86-9.1-11.67,0-20.73,2.49-27.17,7.48-6.45,4.99-9.67,11.95-9.67,20.89,0,7.53,3.48,13.81,10.44,18.84,6.96,5.03,18.44,9.93,34.44,14.68,16,4.75,28.84,10.16,38.53,16.23,9.69,6.07,16.8,13.03,21.31,20.89,4.52,7.86,6.77,17.06,6.77,27.59,0,17.13-6.56,30.75-19.69,40.86-13.13,10.12-30.93,15.17-53.42,15.17-14.87,0-28.53-2.75-41-8.26-12.47-5.5-22.16-13.1-29.07-22.79-6.92-9.69-10.37-20.98-10.37-33.87h35.71c0,11.67,3.86,20.7,11.57,27.1,7.71,6.4,18.77,9.6,33.17,9.6,12.42,0,21.76-2.52,28.02-7.55,6.26-5.03,9.39-11.69,9.39-19.97Z"/>
      <path class="cls-1" d="m635.45,148.1v37.12h26.96v25.4h-26.96v85.25c0,5.83,1.15,10.04,3.46,12.63,2.3,2.59,6.42,3.88,12.35,3.88,3.95,0,7.95-.47,12-1.41v26.53c-7.81,2.16-15.34,3.25-22.58,3.25-26.35,0-39.52-14.54-39.52-43.61v-86.52h-25.12v-25.4h25.12v-37.12h34.3Z"/>
      <path class="cls-1" d="m768.54,216.55c-4.52-.75-9.17-1.13-13.97-1.13-15.71,0-26.3,6.02-31.76,18.07v104.44h-34.3v-152.71h32.74l.85,17.08c8.28-13.27,19.76-19.9,34.44-19.9,4.89,0,8.94.66,12.14,1.98l-.14,32.18Z"/>
      <path class="cls-1" d="m857.46,340.75c-21.74,0-39.36-6.85-52.86-20.54-13.5-13.69-20.25-31.92-20.25-54.69v-4.23c0-15.24,2.94-28.86,8.82-40.86,5.88-12,14.14-21.33,24.77-28.02,10.63-6.68,22.49-10.02,35.57-10.02,20.79,0,36.86,6.63,48.2,19.9,11.34,13.27,17.01,32.04,17.01,56.31v13.83h-99.78c1.03,12.61,5.24,22.58,12.63,29.92,7.38,7.34,16.68,11.01,27.87,11.01,15.71,0,28.51-6.35,38.39-19.05l18.49,17.64c-6.12,9.13-14.28,16.21-24.49,21.24-10.21,5.03-21.67,7.55-34.37,7.55Zm-4.09-130.84c-9.41,0-17.01,3.29-22.79,9.88-5.79,6.59-9.48,15.76-11.08,27.52h65.35v-2.54c-.75-11.48-3.81-20.16-9.17-26.04-5.36-5.88-12.8-8.82-22.3-8.82Z"/>
      <path class="cls-1" d="m1012.57,340.75c-21.74,0-39.36-6.85-52.86-20.54-13.5-13.69-20.25-31.92-20.25-54.69v-4.23c0-15.24,2.94-28.86,8.82-40.86,5.88-12,14.14-21.33,24.77-28.02,10.63-6.68,22.49-10.02,35.57-10.02,20.79,0,36.86,6.63,48.2,19.9,11.34,13.27,17.01,32.04,17.01,56.31v13.83h-99.78c1.03,12.61,5.24,22.58,12.63,29.92,7.38,7.34,16.68,11.01,27.87,11.01,15.71,0,28.51-6.35,38.39-19.05l18.49,17.64c-6.12,9.13-14.28,16.21-24.49,21.24-10.21,5.03-21.67,7.55-34.37,7.55Zm-4.09-130.84c-9.41,0-17.01,3.29-22.79,9.88-5.79,6.59-9.48,15.76-11.08,27.52h65.35v-2.54c-.75-11.48-3.81-20.16-9.17-26.04-5.36-5.88-12.8-8.82-22.3-8.82Z"/>
      <path class="cls-1" d="m1143.41,148.1v37.12h26.96v25.4h-26.96v85.25c0,5.83,1.15,10.04,3.46,12.63,2.3,2.59,6.42,3.88,12.35,3.88,3.95,0,7.95-.47,12-1.41v26.53c-7.81,2.16-15.34,3.25-22.58,3.25-26.35,0-39.52-14.54-39.52-43.61v-86.52h-25.12v-25.4h25.12v-37.12h34.3Z"/>
      <path class="cls-1" d="m1272.27,293.19l52.22-160.76h39.24l-73.96,205.5h-34.58l-73.67-205.5h39.1l51.66,160.76Z"/>
      <path class="cls-1" d="m1383.63,145.56c0-5.27,1.67-9.64,5.01-13.13,3.34-3.48,8.12-5.22,14.33-5.22s11.01,1.74,14.4,5.22c3.39,3.48,5.08,7.86,5.08,13.13s-1.69,9.48-5.08,12.91c-3.39,3.44-8.19,5.15-14.4,5.15s-10.99-1.72-14.33-5.15c-3.34-3.43-5.01-7.74-5.01-12.91Zm36.41,192.37h-34.3v-152.71h34.3v152.71Z"/>
      <path class="cls-1" d="m1524.62,340.75c-21.74,0-39.36-6.85-52.86-20.54-13.5-13.69-20.25-31.92-20.25-54.69v-4.23c0-15.24,2.94-28.86,8.82-40.86,5.88-12,14.14-21.33,24.77-28.02,10.63-6.68,22.49-10.02,35.57-10.02,20.79,0,36.86,6.63,48.2,19.9,11.34,13.27,17.01,32.04,17.01,56.31v13.83h-99.78c1.03,12.61,5.24,22.58,12.63,29.92,7.38,7.34,16.68,11.01,27.87,11.01,15.71,0,28.51-6.35,38.39-19.05l18.49,17.64c-6.12,9.13-14.28,16.21-24.49,21.24-10.21,5.03-21.67,7.55-34.37,7.55Zm-4.09-130.84c-9.41,0-17.01,3.29-22.79,9.88-5.79,6.59-9.48,15.76-11.08,27.52h65.35v-2.54c-.75-11.48-3.81-20.16-9.17-26.04-5.36-5.88-12.8-8.82-22.3-8.82Z"/>
      <path class="cls-1" d="m1746.63,290.65l24.28-105.43h33.45l-41.64,152.71h-28.23l-32.74-104.87-32.18,104.87h-28.23l-41.78-152.71h33.45l24.7,104.3,31.33-104.3h25.83l31.76,105.43Z"/>
      <path class="cls-1" d="m1894.55,340.75c-21.74,0-39.36-6.85-52.86-20.54-13.5-13.69-20.25-31.92-20.25-54.69v-4.23c0-15.24,2.94-28.86,8.82-40.86,5.88-12,14.14-21.33,24.77-28.02,10.63-6.68,22.49-10.02,35.57-10.02,20.79,0,36.86,6.63,48.2,19.9,11.34,13.27,17.01,32.04,17.01,56.31v13.83h-99.78c1.03,12.61,5.24,22.58,12.63,29.92,7.38,7.34,16.68,11.01,27.87,11.01,15.71,0,28.51-6.35,38.39-19.05l18.49,17.64c-6.12,9.13-14.28,16.21-24.49,21.24-10.21,5.03-21.67,7.55-34.37,7.55Zm-4.09-130.84c-9.41,0-17.01,3.29-22.79,9.88-5.79,6.59-9.48,15.76-11.08,27.52h65.35v-2.54c-.75-11.48-3.81-20.16-9.17-26.04-5.36-5.88-12.8-8.82-22.3-8.82Z"/>
      <path class="cls-1" d="m2062.36,216.55c-4.52-.75-9.17-1.13-13.97-1.13-15.71,0-26.3,6.02-31.76,18.07v104.44h-34.3v-152.71h32.74l.85,17.08c8.28-13.27,19.76-19.9,34.44-19.9,4.89,0,8.94.66,12.14,1.98l-.14,32.18Z"/>
    </g>
  </g>
</svg>