  
       XFOIL         Version 6.99
  
 Calculated polar for: NACA 0018                                       
  
 1 1 Reynolds number fixed          Mach number fixed         
  
 xtrf =   1.000 (top)        1.000 (bottom)  
 Mach =   0.023     Re =     0.053 e 6     Ncrit =   9.000  9.000
  
   alpha    CL        CD       CDp       CM     Top_Xtr  Bot_Xtr  Top_Itr  Bot_Itr
  ------ -------- --------- --------- -------- -------- -------- -------- --------
   0.000   0.0000   0.03951   0.02660  -0.0000   0.8872   0.8872   8.2387 152.7610
   0.500   0.2145   0.03814   0.02542  -0.0278   0.8553   0.9186   9.8407 154.4229
   1.000   0.3623   0.03591   0.02339  -0.0436   0.8164   0.9508  11.7347 156.2898
   1.500   0.4855   0.03338   0.02098  -0.0549   0.7731   0.9819  13.8128 158.4099
   2.000   0.5672   0.03158   0.01911  -0.0596   0.7291   1.0000  15.9084 160.0000
   2.500   0.5951   0.03132   0.01867  -0.0557   0.6894   1.0000  17.7939 160.0000
   3.000   0.6234   0.03130   0.01842  -0.0517   0.6512   1.0000  19.6088 160.0000
   3.500   0.6537   0.03134   0.01817  -0.0476   0.6152   1.0000  21.3298 160.0000
   4.000   0.6882   0.03126   0.01767  -0.0437   0.5811   1.0000  22.9645 160.0000
   4.500   0.7150   0.03196   0.01812  -0.0394   0.5448   1.0000  24.7129 160.0000
   5.000   0.7445   0.03263   0.01838  -0.0350   0.5114   1.0000  26.3360 160.0000
   5.500   0.7781   0.03311   0.01834  -0.0307   0.4793   1.0000  27.9053 160.0000
   6.000   0.7997   0.03451   0.01938  -0.0255   0.4475   1.0000  29.4796 160.0000
   6.500   0.8361   0.03515   0.01932  -0.0214   0.4180   1.0000  30.9535 160.0000
   7.000   0.8505   0.03715   0.02096  -0.0152   0.3897   1.0000  32.3859 160.0000
   7.500   0.8760   0.03861   0.02184  -0.0101   0.3630   1.0000  33.7544 160.0000
   8.000   0.9088   0.04006   0.02242  -0.0059   0.3383   1.0000  35.0422 160.0000
   8.500   0.9154   0.04285   0.02474   0.0010   0.3168   1.0000  36.1829 160.0000
   9.000   0.9228   0.04583   0.02709   0.0075   0.2974   1.0000  37.2285 160.0000
   9.500   0.9299   0.04904   0.02955   0.0137   0.2802   1.0000  38.1781 160.0000
  10.000   0.9423   0.05231   0.03189   0.0189   0.2642   1.0000  39.0750 160.0000
  10.500   0.8127   0.06405   0.04273   0.0316   0.2629   1.0000  39.1493 160.0000
  90.000   0.0000   1.20000   0.00000  -0.8000   0.0000   0.0000  00.0000 000.0000      
