-20,-20,-20,-20
-19.5,-19.5,-19.5,-19.5
-19,-19,-19,-19
-18.5,-18.5,-18.5,-18.5
-18,-18,-18,-18
-17.5,-17.5,-17.5,-17.5
-17,-17,-17,-17
-16.5,-16.5,-16.5,-16.5
-16,-16,-16,-16
-15.5,-15.5,-15.5,-15.5
-15,-15,-15,-15
-14.5,-14.5,-14.5,-14.5
-14,-14,-14,-14
-13.5,-13.5,-13.5,-13.5
-13,-13,-13,-13
-12.5,-12.5,-12.5,-12.5
-12,-12,-12,-12
-11.5,-11.5,-11.5,-11.5
-11,-11,-11,-11
-10.5,-10.5,-10.5,-10.5
-10,-10,-10,-10
-9.5,-9.5,-9.5,-9.5
-9,-9,-9,-9
-8.5,-8.5,-8.5,-8.5
-8,-8,-8,-8
-7.5,-7.5,-7.5,-7.5
-7,-7,-7,-7
-6.5,-6.5,-6.5,-6.5
-6,-6,-6,-6
-5.5,-5.5,-5.5,-5.5
-5,-5,-5,-5
-4.5,-4.5,-4.5,-4.5
-4,-4,-4,-4
-3.5,-3.5,-3.5,-3.5
-3,-3,-3,-3
-2.5,-2.5,-2.5,-2.5
-2,-2,-2,-2
-1.5,-1.5,-1.5,-1.5
-1,-1,-1,-1
-0.5,-0.5,-0.5,-0.5
0,0,0,0
0.5,0.5,0.5,0.5
1,1,1,1
1.5,1.5,1.5,1.5
2,2,2,2
2.5,2.5,2.5,2.5
3,3,3,3
3.5,3.5,3.5,3.5
4,4,4,4
4.5,4.5,4.5,4.5
5,5,5,5
5.5,5.5,5.5,5.5
6,6,6,6
6.5,6.5,6.5,6.5
7,7,7,7
7.5,7.5,7.5,7.5
8,8,8,8
8.5,8.5,8.5,8.5
9,9,9,9
9.5,9.5,9.5,9.5
10,10,10,10
10.5,10.5,10.5,10.5
11,11,11,11
11.5,11.5,11.5,11.5
12,12,12,12
12.5,12.5,12.5,12.5
13,13,13,13
13.5,13.5,13.5,13.5
14,14,14,14
14.5,14.5,14.5,14.5
15,15,15,15
15.5,15.5,15.5,15.5
16,16,16,16
16.5,16.5,16.5,16.5
17,17,17,17
17.5,17.5,17.5,17.5
18,18,18,18
18.5,18.5,18.5,18.5
19,19,19,19
19.5,19.5,19.5,19.5
20,20,20,20
