(footprint "RPi-Zero-2W" (version 20211014) (generator pcbnew)
  (layer "F.Cu")
  (tedit 62BCBA69)
  (attr smd)
  (fp_text reference "REF**" (at 0.15 -18.075 unlocked) (layer "F.SilkS")
    (effects (font (size 1 1) (thickness 0.15)))
    (tstamp 074b6085-71d9-4217-b537-bbcf65fdcc04)
  )
  (fp_text value "RPi-Zero-2W" (at -0.750001 -41.324999 180 unlocked) (layer "B.Fab")
    (effects (font (size 1 1) (thickness 0.15)) (justify mirror))
    (tstamp 65bdd1dc-37d5-42cb-92eb-3f6fa2b37189)
  )
  (fp_text user "${REFERENCE}" (at 28.325 -13.525) (layer "B.Fab")
    (effects (font (size 1 1) (thickness 0.15)) (justify mirror))
    (tstamp 141ab0a5-7168-48bd-a340-1a61e4a7b5c4)
  )
  (fp_text user "${REFERENCE}" (at -0.1 -18.15 unlocked) (layer "B.Fab")
    (effects (font (size 1 1) (thickness 0.15)) (justify mirror))
    (tstamp 44da9805-ecf3-41c6-a7c4-153910b1a588)
  )
  (fp_text user "${REFERENCE}" (at -30.399999 -13.968042) (layer "B.Fab")
    (effects (font (size 1 1) (thickness 0.15)) (justify mirror))
    (tstamp 461b766d-650d-47f8-ab30-09356cce6618)
  )
  (fp_text user "${REFERENCE}" (at 28.625 -13.825 -90) (layer "B.Fab")
    (effects (font (size 1 1) (thickness 0.15)) (justify mirror))
    (tstamp 9db58e2c-28e4-45e9-9a85-2ce9cae78af3)
  )
  (fp_text user "${REFERENCE}" (at -29.375 -13.825 -90) (layer "B.Fab")
    (effects (font (size 1 1) (thickness 0.15)) (justify mirror))
    (tstamp e5208d82-f010-4321-a3fa-6385555a6309)
  )
  (fp_line (start -25.76 -16.1) (end -25.76 -10.975) (layer "F.SilkS") (width 0.12) (tstamp 157249ba-3929-4e34-977a-e923a2c46b72))
  (fp_line (start 25.1 -16.1) (end 24.1 -16.1) (layer "F.SilkS") (width 0.12) (tstamp 176c5b52-146f-45c6-968f-6bf6f0117e8d))
  (fp_line (start 25.1 -13.8) (end 25.1 -11) (layer "F.SilkS") (width 0.12) (tstamp 1fa69cd8-22ed-4c04-b651-d55b4b7728c1))
  (fp_line (start 28.599999 -40) (end 29.099999 -40) (layer "F.SilkS") (width 0.15) (tstamp 2330ec55-9c57-46eb-a911-fdc3e190efcc))
  (fp_line (start 25.1 -15) (end 25.1 -16.1) (layer "F.SilkS") (width 0.12) (tstamp 2cee4561-12b3-48b7-81af-223435c0ab41))
  (fp_line (start -29.400001 -40) (end -29.900001 -40) (layer "F.SilkS") (width 0.15) (tstamp 53ede2e7-0d39-4209-9efe-1c153b9bda3e))
  (fp_line (start -25.76 -16.1) (end 22.9 -16.1) (layer "F.SilkS") (width 0.12) (tstamp 85e5e046-2bb4-4c5c-ba84-43c62090d72c))
  (fp_line (start 29.099999 -10) (end -29.900001 -10) (layer "F.SilkS") (width 0.15) (tstamp 9fedb6b6-0b62-4ec3-9599-5dee1fcd3d6e))
  (fp_line (start -25.76 -10.975) (end 25.1 -11) (layer "F.SilkS") (width 0.12) (tstamp b175af35-eeec-4836-ad5d-f464533fbf64))
  (fp_line (start -32.900001 -13) (end -32.900001 -37) (layer "F.SilkS") (width 0.15) (tstamp e07b9a60-6678-4223-8932-65abb13d0611))
  (fp_line (start 28.599999 -40) (end -29.400001 -40) (layer "F.SilkS") (width 0.15) (tstamp e7a26d24-6f35-40be-95ba-7bd458c127ad))
  (fp_line (start 32.099999 -37) (end 32.099999 -13) (layer "F.SilkS") (width 0.15) (tstamp ee334699-9bed-4e4f-b320-156b071f2e29))
  (fp_arc (start 32.099999 -13) (mid 31.221319 -10.87868) (end 29.099999 -10) (layer "F.SilkS") (width 0.15) (tstamp 6d822b34-b602-4972-8609-5b82ed96d5cd))
  (fp_arc (start 29.099999 -40) (mid 31.221319 -39.12132) (end 32.099999 -37) (layer "F.SilkS") (width 0.15) (tstamp 8aa5efaa-fada-4090-a330-2c36713ddc22))
  (fp_arc (start -29.900001 -10) (mid -32.021321 -10.87868) (end -32.900001 -13) (layer "F.SilkS") (width 0.15) (tstamp 9ab9d7ee-d269-4fc1-abcd-6c6ff9d1f5b7))
  (fp_arc (start -32.900001 -37) (mid -32.021321 -39.12132) (end -29.900001 -40) (layer "F.SilkS") (width 0.15) (tstamp b01d216c-6eef-48aa-9106-bb1f7fa62b70))
  (fp_line (start 25.555 -10.505) (end 25.555 -16.605) (layer "F.CrtYd") (width 0.05) (tstamp 1aa1e859-991c-4c20-ae41-be7a5ac2e8c1))
  (fp_line (start 25.555 -16.605) (end -26.245 -16.605) (layer "F.CrtYd") (width 0.05) (tstamp 8200f900-2893-4915-88e0-1ce3ec53bbe6))
  (fp_line (start -26.245 -10.505) (end 25.555 -10.505) (layer "F.CrtYd") (width 0.05) (tstamp aa3de0b5-c117-4ed6-b6bb-ad1295246bd8))
  (fp_line (start -26.245 -16.605) (end -26.245 -10.505) (layer "F.CrtYd") (width 0.05) (tstamp af8a1e59-cd80-42ee-b224-a64887763842))
  (fp_line (start -25.775 -16.115) (end -25.775 -11.035) (layer "F.Fab") (width 0.1) (tstamp 58a4cf29-c46c-4360-b609-5921ff7f55ef))
  (fp_line (start 24.025 -16.115) (end -25.775 -16.115) (layer "F.Fab") (width 0.1) (tstamp 8e3c9390-7c7a-4b84-9971-c78caa872370))
  (fp_line (start 25.025 -11.035) (end 25.025 -15.115) (layer "F.Fab") (width 0.1) (tstamp caba9ff7-7c1b-4130-a22b-58204ec4cda5))
  (fp_line (start -25.775 -11.035) (end 25.025 -11.035) (layer "F.Fab") (width 0.1) (tstamp ccb9dff2-2617-4a93-a1d5-708a742ef735))
  (fp_line (start 25.025 -15.115) (end 24.025 -16.115) (layer "F.Fab") (width 0.1) (tstamp f90ef548-b40a-457c-a1ad-0a1ce90cf159))
  (pad "1" thru_hole rect (at -24.555 -14.845 270) (size 1.7 1.7) (drill 1) (layers *.Cu *.Mask) (tstamp 792964d9-aa39-4fe4-99dd-99dbec585ab4))
  (pad "2" thru_hole oval (at -24.555 -12.305 270) (size 1.7 1.7) (drill 1) (layers *.Cu *.Mask) (tstamp 45907727-43c9-4bdf-90ae-c984e820aed2))
  (pad "3" thru_hole oval (at -22.015 -14.845 270) (size 1.7 1.7) (drill 1) (layers *.Cu *.Mask) (tstamp ffab4f2c-8647-49d2-8c20-9dfe5bcb7e09))
  (pad "4" thru_hole oval (at -22.015 -12.305 270) (size 1.7 1.7) (drill 1) (layers *.Cu *.Mask) (tstamp 12569cb5-d8f8-4e71-afbc-a4fb890792ce))
  (pad "5" thru_hole oval (at -19.475 -14.845 270) (size 1.7 1.7) (drill 1) (layers *.Cu *.Mask) (tstamp 7a9f97f1-607a-4a08-ad71-322aa96ac6a4))
  (pad "6" thru_hole oval (at -19.475 -12.305 270) (size 1.7 1.7) (drill 1) (layers *.Cu *.Mask) (tstamp 20fcc05b-c503-4a85-9d89-2825ca9f34d2))
  (pad "7" thru_hole oval (at -16.935 -14.845 270) (size 1.7 1.7) (drill 1) (layers *.Cu *.Mask) (tstamp 7529d2b2-a8e9-40e5-bc73-f4e45bfa60cb))
  (pad "8" thru_hole oval (at -16.935 -12.305 270) (size 1.7 1.7) (drill 1) (layers *.Cu *.Mask) (tstamp c1a9cbdd-727b-4183-bd06-7a70779d6d85))
  (pad "9" thru_hole oval (at -14.395 -14.845 270) (size 1.7 1.7) (drill 1) (layers *.Cu *.Mask) (tstamp eaaacbf1-be6a-4577-8fa2-45a2bd886b3a))
  (pad "10" thru_hole oval (at -14.395 -12.305 270) (size 1.7 1.7) (drill 1) (layers *.Cu *.Mask) (tstamp 9dad465c-ca66-4182-81a4-7d73d548c881))
  (pad "11" thru_hole oval (at -11.855 -14.845 270) (size 1.7 1.7) (drill 1) (layers *.Cu *.Mask) (tstamp 83198d4c-3c61-4801-a56f-5c8d0d0dce5e))
  (pad "12" thru_hole oval (at -11.855 -12.305 270) (size 1.7 1.7) (drill 1) (layers *.Cu *.Mask) (tstamp aae20529-58b0-42c2-9a87-71bb2b87a3ba))
  (pad "13" thru_hole oval (at -9.315 -14.845 270) (size 1.7 1.7) (drill 1) (layers *.Cu *.Mask) (tstamp 545cc2d4-ec42-4ca2-a211-e2ebdf8550db))
  (pad "14" thru_hole oval (at -9.315 -12.305 270) (size 1.7 1.7) (drill 1) (layers *.Cu *.Mask) (tstamp fb850219-1b08-447e-b03a-4937332034c4))
  (pad "15" thru_hole oval (at -6.775 -14.845 270) (size 1.7 1.7) (drill 1) (layers *.Cu *.Mask) (tstamp d0de416d-8cde-495a-a100-9610104559c9))
  (pad "16" thru_hole oval (at -6.775 -12.305 270) (size 1.7 1.7) (drill 1) (layers *.Cu *.Mask) (tstamp e16a567a-9498-4e97-91e1-828d6cd9df9d))
  (pad "17" thru_hole oval (at -4.235 -14.845 270) (size 1.7 1.7) (drill 1) (layers *.Cu *.Mask) (tstamp 96f066d6-926b-4a9c-8904-91214bf1525c))
  (pad "18" thru_hole oval (at -4.235 -12.305 270) (size 1.7 1.7) (drill 1) (layers *.Cu *.Mask) (tstamp 3464a3fa-a75e-42d1-b582-0185393fe99a))
  (pad "19" thru_hole oval (at -1.695 -14.845 270) (size 1.7 1.7) (drill 1) (layers *.Cu *.Mask) (tstamp de3399b3-1ce5-4072-84bd-ebe1837945e5))
  (pad "20" thru_hole oval (at -1.695 -12.305 270) (size 1.7 1.7) (drill 1) (layers *.Cu *.Mask) (tstamp db998c8a-d917-416a-83b3-a58009a09f41))
  (pad "21" thru_hole oval (at 0.845 -14.845 270) (size 1.7 1.7) (drill 1) (layers *.Cu *.Mask) (tstamp 0445da84-6bcc-48da-b71e-bc30b9cc204c))
  (pad "22" thru_hole oval (at 0.845 -12.305 270) (size 1.7 1.7) (drill 1) (layers *.Cu *.Mask) (tstamp eb1f6cc2-ad4c-4ade-906f-18d1638f6d2e))
  (pad "23" thru_hole oval (at 3.385 -14.845 270) (size 1.7 1.7) (drill 1) (layers *.Cu *.Mask) (tstamp f72199cf-d670-4a63-9442-d6a8f2745460))
  (pad "24" thru_hole oval (at 3.385 -12.305 270) (size 1.7 1.7) (drill 1) (layers *.Cu *.Mask) (tstamp 3e211dbe-5ad0-4054-9d22-284dcc0dc767))
  (pad "25" thru_hole oval (at 5.925 -14.845 270) (size 1.7 1.7) (drill 1) (layers *.Cu *.Mask) (tstamp 93f86531-8788-4422-a957-fb37c6498866))
  (pad "26" thru_hole oval (at 5.925 -12.305 270) (size 1.7 1.7) (drill 1) (layers *.Cu *.Mask) (tstamp 735e0fa3-ce11-41b0-aa7b-608835b63bc7))
  (pad "27" thru_hole oval (at 8.465 -14.845 270) (size 1.7 1.7) (drill 1) (layers *.Cu *.Mask) (tstamp ef9c1add-19fd-4c59-97bb-d5e4ea54ec9c))
  (pad "28" thru_hole oval (at 8.465 -12.305 270) (size 1.7 1.7) (drill 1) (layers *.Cu *.Mask) (tstamp 349a26a1-ed31-4015-8b60-4dcb1ee3ee26))
  (pad "29" thru_hole oval (at 11.005 -14.845 270) (size 1.7 1.7) (drill 1) (layers *.Cu *.Mask) (tstamp 92f76ffd-d1af-4c6c-979c-daf08cec5d2d))
  (pad "30" thru_hole oval (at 11.005 -12.305 270) (size 1.7 1.7) (drill 1) (layers *.Cu *.Mask) (tstamp d21bcd1d-125a-43b3-af7c-994d3bd8c9e2))
  (pad "31" thru_hole oval (at 13.545 -14.845 270) (size 1.7 1.7) (drill 1) (layers *.Cu *.Mask) (tstamp 11f14a85-2f71-4b68-86b6-465d1b7ff165))
  (pad "32" thru_hole oval (at 13.545 -12.305 270) (size 1.7 1.7) (drill 1) (layers *.Cu *.Mask) (tstamp b63ddeaf-b1e8-4f82-828d-23c5b521e6fa))
  (pad "33" thru_hole oval (at 16.085 -14.845 270) (size 1.7 1.7) (drill 1) (layers *.Cu *.Mask) (tstamp 4321b8ab-902a-4309-8e1d-0c0f9d6a8165))
  (pad "34" thru_hole oval (at 16.085 -12.305 270) (size 1.7 1.7) (drill 1) (layers *.Cu *.Mask) (tstamp 4ff4d76b-cb43-4171-97b3-f6d7154c2519))
  (pad "35" thru_hole oval (at 18.625 -14.845 270) (size 1.7 1.7) (drill 1) (layers *.Cu *.Mask) (tstamp df24d127-713f-48d7-ba18-c2060010a769))
  (pad "36" thru_hole oval (at 18.625 -12.305 270) (size 1.7 1.7) (drill 1) (layers *.Cu *.Mask) (tstamp 4bf7fa16-f757-4c20-bd05-5e35880eced8))
  (pad "37" thru_hole oval (at 21.165 -14.845 270) (size 1.7 1.7) (drill 1) (layers *.Cu *.Mask) (tstamp 70277abb-d35e-4e30-8aed-4588941766f5))
  (pad "38" thru_hole oval (at 21.165 -12.305 270) (size 1.7 1.7) (drill 1) (layers *.Cu *.Mask) (tstamp dc03b137-b8f1-4731-897b-2aaef5efdda0))
  (pad "39" thru_hole oval (at 23.705 -14.845 270) (size 1.7 1.7) (drill 1) (layers *.Cu *.Mask) (tstamp 33790b8f-63b3-4c84-9700-5bd6d7b94640))
  (pad "40" thru_hole oval (at 23.705 -12.305 270) (size 1.7 1.7) (drill 1) (layers *.Cu *.Mask) (tstamp 806ff617-1a3d-43de-91a3-70baeb34e8d9))
  (pad "41" thru_hole circle (at 28.625 -13.525 270) (size 6.4 6.4) (drill 3.2) (layers *.Cu *.Mask) (tstamp e1bda80b-04c2-46aa-9106-cf5209813305))
  (pad "42" thru_hole circle (at -29.375 -13.525 270) (size 6.4 6.4) (drill 3.2) (layers *.Cu *.Mask) (tstamp 9f81d3f3-ab98-4250-b50a-63632953ea0d))
  (pad "43" thru_hole circle (at -29.35 -36.525 270) (size 6.4 6.4) (drill 3.2) (layers *.Cu *.Mask) (tstamp 5369fcae-5439-433a-ba67-603cac830a41))
  (pad "44" thru_hole circle (at 28.65 -36.525 270) (size 6.4 6.4) (drill 3.2) (layers *.Cu *.Mask) (tstamp 004a1015-45a7-478b-ac9b-c202dd39c0d0))
)
