(footprint "PCA9685, adafruit" (version 20211014) (generator pcbnew)
  (layer "F.Cu")
  (tedit 622A7585)
  (attr smd)
  (fp_text reference "REF**" (at 0 -14.732 unlocked) (layer "F.SilkS")
    (effects (font (size 1 1) (thickness 0.15)))
    (tstamp bf36e9d5-29fc-4979-9020-81e493e3b1c6)
  )
  (fp_text value "PCA9685, adafruit" (at 0 14.478 unlocked) (layer "F.Fab")
    (effects (font (size 1 1) (thickness 0.15)))
    (tstamp 139e5ec0-c045-4d91-be42-b4acf22d3338)
  )
  (fp_text user "${REFERENCE}" (at -29.21 0 90) (layer "F.Fab")
    (effects (font (size 1 1) (thickness 0.15)))
    (tstamp 38d5d713-b94e-4d55-b43a-1a75433f7985)
  )
  (fp_text user "${REFERENCE}" (at -23.622 -11.684) (layer "F.Fab")
    (effects (font (size 1 1) (thickness 0.15)))
    (tstamp 4955c88e-b807-4ed0-b6d5-6ea1079bf3ed)
  )
  (fp_text user "${REFERENCE}" (at 23.622 -11.43) (layer "F.Fab")
    (effects (font (size 1 1) (thickness 0.15)))
    (tstamp 52ea611a-f15b-4fb4-859d-c0c2aa46f7bf)
  )
  (fp_text user "${REFERENCE}" (at 23.622 11.684) (layer "F.Fab")
    (effects (font (size 1 1) (thickness 0.15)))
    (tstamp 7b3fe852-ed60-4c9b-a0ba-aa3b330c7d71)
  )
  (fp_text user "${REFERENCE}" (at -23.622 11.684) (layer "F.Fab")
    (effects (font (size 1 1) (thickness 0.15)))
    (tstamp cefa58ac-6c7f-4482-82e9-3196d831c014)
  )
  (fp_text user "${REFERENCE}" (at 0 17.018 unlocked) (layer "F.Fab")
    (effects (font (size 1 1) (thickness 0.15)))
    (tstamp ee9cca1e-67e0-423d-81dd-8e074c191193)
  )
  (fp_line (start -31.242 -9.652) (end -31.242 9.652) (layer "F.SilkS") (width 0.12) (tstamp 4dc019fa-33c1-4181-b7f0-7ff2297727d7))
  (fp_line (start -27.94 -12.954) (end 27.94 -12.954) (layer "F.SilkS") (width 0.12) (tstamp 4f02a351-9568-48f2-b04f-076667160b2f))
  (fp_line (start -27.94 12.954) (end 27.94 12.954) (layer "F.SilkS") (width 0.12) (tstamp 86dfd5a1-83d6-4977-9556-e33d15d5258d))
  (fp_line (start 31.242 -9.652) (end 31.242 9.652) (layer "F.SilkS") (width 0.12) (tstamp a3b2628b-0a49-4505-aab9-3578401a32e8))
  (fp_arc (start -31.242 -9.652) (mid -30.238005 -11.950005) (end -27.94 -12.954) (layer "F.SilkS") (width 0.12) (tstamp 027e032f-1824-43dc-8ddc-ff2316bbe64d))
  (fp_arc (start -27.94 12.954) (mid -30.254499 11.966499) (end -31.242 9.652) (layer "F.SilkS") (width 0.12) (tstamp 896e4058-ef12-4821-8162-278198002d1d))
  (fp_arc (start 31.242 9.652) (mid 30.254499 11.966499) (end 27.94 12.954) (layer "F.SilkS") (width 0.12) (tstamp 980ca971-c4ed-4e4a-b43e-a0fd11aac9bd))
  (fp_arc (start 27.94 -12.954) (mid 30.238005 -11.950005) (end 31.242 -9.652) (layer "F.SilkS") (width 0.12) (tstamp 9ee7b1d5-1d4a-457a-868f-1c5ac3f6e002))
  (fp_circle (center -27.94 -9.652) (end -25.44 -9.652) (layer "Cmts.User") (width 0.15) (fill none) (tstamp 683ec5d2-a1e2-4b7c-88ff-16e5543c82f6))
  (fp_circle (center 27.94 9.652) (end 30.44 9.652) (layer "Cmts.User") (width 0.15) (fill none) (tstamp 97c6113d-2937-43f1-acef-e0f4942bc010))
  (fp_circle (center 27.94 -9.652) (end 30.44 -9.652) (layer "Cmts.User") (width 0.15) (fill none) (tstamp bddec3db-8673-4866-9549-a142b1e8a83c))
  (fp_circle (center -27.94 9.652) (end -25.44 9.652) (layer "Cmts.User") (width 0.15) (fill none) (tstamp e080946b-11f2-49f7-a907-a5898cf531fe))
  (pad "" np_thru_hole circle (at 27.94 -9.652) (size 2.5 2.5) (drill 2.5) (layers F&B.Cu *.Mask) (tstamp 3d98718b-dffb-400e-972c-e251ab4b6378))
  (pad "" np_thru_hole circle (at -27.94 9.652) (size 2.5 2.5) (drill 2.5) (layers F&B.Cu *.Mask) (tstamp 54aba7f9-713f-4b0c-b7e8-cfe71d9d4230))
  (pad "" np_thru_hole circle (at -27.94 -9.652) (size 2.5 2.5) (drill 2.5) (layers F&B.Cu *.Mask) (tstamp d73bd75a-8a90-4358-8bb9-8bf0bd5cfd01))
  (pad "" np_thru_hole circle (at 27.94 9.652) (size 2.5 2.5) (drill 2.5) (layers F&B.Cu *.Mask) (tstamp e010a0dd-ffcf-4e72-b9b5-b667c31a020b))
  (pad "1" thru_hole custom (at -29.21 6.35) (size 1.7 1.7) (drill 1) (layers *.Cu *.Mask)
    (options (clearance outline) (anchor rect))
    (primitives
    ) (tstamp 71397e76-b6a2-431e-a781-9527506befc9))
  (pad "2" thru_hole oval (at -29.21 3.81) (size 1.7 1.7) (drill 1) (layers *.Cu *.Mask) (tstamp af85d2f1-0a95-4326-a8f5-d4abec33b0ff))
  (pad "3" thru_hole oval (at -29.21 1.27) (size 1.7 1.7) (drill 1) (layers *.Cu *.Mask) (tstamp d38c4111-b22d-4aa6-9f1e-02baca01bfee))
  (pad "4" thru_hole oval (at -29.21 -1.27) (size 1.7 1.7) (drill 1) (layers *.Cu *.Mask) (tstamp 5591601a-0208-417f-b6e4-bd68e0c1316e))
  (pad "5" thru_hole oval (at -29.21 -3.81) (size 1.7 1.7) (drill 1) (layers *.Cu *.Mask) (tstamp d3f99c02-22d0-4155-aa93-2eedfa8072cd))
  (pad "6" thru_hole circle (at -29.21 -6.35) (size 1.7 1.7) (drill 1) (layers *.Cu *.Mask) (tstamp 23a4b9ee-966e-47a6-b50c-dfc53ee72eff))
)
