(footprint "XB324Z8UTJ" (version 20211014) (generator pcbnew)
  (layer "F.Cu")
  (tedit 62D02A3F)
  (descr "XBEE3 UFL ANT PTH")
  (tags "Integrated Circuit")
  (attr through_hole)
  (fp_text reference "U**" (at 10.795 6.097) (layer "F.SilkS")
    (effects (font (size 1.27 1.27) (thickness 0.254)))
    (tstamp 82632a19-1214-41b3-ac2c-4be0f381f1fc)
  )
  (fp_text value "XB324Z8UTJ" (at 10.795 6.097) (layer "F.SilkS") hide
    (effects (font (size 1.27 1.27) (thickness 0.254)))
    (tstamp b7006431-351e-40c1-931d-8d4bd53d2e93)
  )
  (fp_text user "${REFERENCE}" (at 10.795 6.097) (layer "F.Fab")
    (effects (font (size 1.27 1.27) (thickness 0.254)))
    (tstamp 3937fe61-47fa-4b5e-a057-581359012cd7)
  )
  (fp_line (start 23.19 -1.19) (end 15.5 -7.72) (layer "F.SilkS") (width 0.1) (tstamp 4e8265bd-1126-4666-b4b4-266d80788e2f))
  (fp_line (start -1.6 0) (end -1.6 0) (layer "F.SilkS") (width 0.1) (tstamp 684b317f-96b2-4563-94b7-a9f9dbce19d3))
  (fp_line (start -1.19 26.162) (end 23.19 26.162) (layer "F.SilkS") (width 0.1) (tstamp 872fc3e3-6f14-4f00-aac2-46697acceeb4))
  (fp_line (start -1.19 -1.19) (end -1.19 26.162) (layer "F.SilkS") (width 0.1) (tstamp a9099b8e-83d3-42a9-8fc6-6ccc4acfec5a))
  (fp_line (start 15.5 -7.72) (end 6.5 -7.72) (layer "F.SilkS") (width 0.1) (tstamp be8713cb-8c69-49bb-acd9-8802d55d218d))
  (fp_line (start 23.19 26.162) (end 23.19 -1.19) (layer "F.SilkS") (width 0.1) (tstamp ec19e519-279b-4d08-8288-be58fe8a8d44))
  (fp_line (start -1.5 0) (end -1.5 0) (layer "F.SilkS") (width 0.1) (tstamp f373845e-cd0b-4b97-9e4c-8fd56c27cfa7))
  (fp_line (start 6.5 -7.72) (end -1.19 -1.19) (layer "F.SilkS") (width 0.1) (tstamp fc4ead07-2c75-4f81-b5b2-9b940d5c0fbf))
  (fp_rect (start -2.5908 -8.7122) (end 24.1808 26.162) (layer "F.SilkS") (width 0.12) (fill none) (tstamp 1afbf098-e7a6-40ec-b8ef-3d32543874cc))
  (fp_arc (start -1.6 0) (mid -1.55 -0.05) (end -1.5 0) (layer "F.SilkS") (width 0.1) (tstamp 2be7b066-c2ff-480b-85f2-398b9dc58fb3))
  (fp_arc (start -1.5 0) (mid -1.55 0.05) (end -1.6 0) (layer "F.SilkS") (width 0.1) (tstamp f5f503b5-f93a-4eb0-a9b7-af9692dd025f))
  (fp_circle (center 0 0) (end 1 0) (layer "F.CrtYd") (width 0.12) (fill none) (tstamp 6006826b-5030-4091-989e-07abcd256123))
  (fp_line (start -1.19 19.914) (end 23.19 19.914) (layer "F.Fab") (width 0.2) (tstamp 6ecf39c3-7bd4-4dc2-b3d8-015e1ce8efe0))
  (fp_line (start 23.19 -1.19) (end 15.5 -7.72) (layer "F.Fab") (width 0.2) (tstamp 8bb6ea79-3367-4e22-b8d7-6f275fda6f15))
  (fp_line (start 6.5 -7.72) (end -1.19 -1.19) (layer "F.Fab") (width 0.2) (tstamp 8f66f8ce-b782-479c-bb13-b0f17be7fa48))
  (fp_line (start 15.5 -7.72) (end 6.5 -7.72) (layer "F.Fab") (width 0.2) (tstamp b22575e4-0838-4d53-a202-9782ea057b6e))
  (fp_line (start 23.19 19.914) (end 23.19 -1.19) (layer "F.Fab") (width 0.2) (tstamp dd94d98b-8847-4ce0-b30f-d31c6f77bc25))
  (fp_line (start -1.19 -1.19) (end -1.19 19.914) (layer "F.Fab") (width 0.2) (tstamp ec39e68d-6144-43b8-abb3-6034313acdbd))
  (pad "1" thru_hole circle (at 0 0) (size 1.431 1.431) (drill 0.92) (layers *.Cu *.Mask) (tstamp 0525f6c5-25e4-4e2f-a4fb-180f19b45b1a))
  (pad "2" thru_hole circle (at 0 2) (size 1.431 1.431) (drill 0.92) (layers *.Cu *.Mask) (tstamp 77060f13-d82d-44fb-a4c2-3f51fb5ce88b))
  (pad "3" thru_hole circle (at 0 4) (size 1.431 1.431) (drill 0.92) (layers *.Cu *.Mask) (tstamp da47ea40-1ec5-41ef-a9ba-010abcc54097))
  (pad "4" thru_hole circle (at 0 6) (size 1.431 1.431) (drill 0.92) (layers *.Cu *.Mask) (tstamp 111ca0cd-5c1f-4d63-aa68-b01ebe697501))
  (pad "5" thru_hole circle (at 0 8) (size 1.431 1.431) (drill 0.92) (layers *.Cu *.Mask) (tstamp 9421e2d2-f583-4a10-8942-3ab05483659f))
  (pad "6" thru_hole circle (at 0 10) (size 1.431 1.431) (drill 0.92) (layers *.Cu *.Mask) (tstamp ccb55565-97b9-4f58-91bf-c09d4d33ef98))
  (pad "7" thru_hole circle (at 0 12) (size 1.431 1.431) (drill 0.92) (layers *.Cu *.Mask) (tstamp 4228dfbb-b208-4386-b7f9-62b65109d8b6))
  (pad "8" thru_hole circle (at 0 14) (size 1.431 1.431) (drill 0.92) (layers *.Cu *.Mask) (tstamp 816a072f-d1a4-4da4-95f4-6719480d7200))
  (pad "9" thru_hole circle (at 0 16) (size 1.431 1.431) (drill 0.92) (layers *.Cu *.Mask) (tstamp f5776bce-e1eb-4cb4-b464-ff8885c8550b))
  (pad "10" thru_hole circle (at 0 18) (size 1.431 1.431) (drill 0.92) (layers *.Cu *.Mask) (tstamp 4e93b623-f4bb-46b7-b080-2842b625706f))
  (pad "11" thru_hole circle (at 22 18) (size 1.431 1.431) (drill 0.92) (layers *.Cu *.Mask) (tstamp 7b7a39d6-ac09-490e-a76e-162650c047fb))
  (pad "12" thru_hole circle (at 22 16) (size 1.431 1.431) (drill 0.92) (layers *.Cu *.Mask) (tstamp bc4f4a32-cb38-463f-bcfd-349320eb213c))
  (pad "13" thru_hole circle (at 22 14) (size 1.431 1.431) (drill 0.92) (layers *.Cu *.Mask) (tstamp d31bbdc8-4cbe-4771-81ae-669a6848f3a9))
  (pad "14" thru_hole circle (at 22 12) (size 1.431 1.431) (drill 0.92) (layers *.Cu *.Mask) (tstamp 387a6227-b331-470e-ab79-9947b9ac881d))
  (pad "15" thru_hole circle (at 22 10) (size 1.431 1.431) (drill 0.92) (layers *.Cu *.Mask) (tstamp 07463f42-6bfe-428b-b2cf-99e47c72a355))
  (pad "16" thru_hole circle (at 22 8) (size 1.431 1.431) (drill 0.92) (layers *.Cu *.Mask) (tstamp 9a516300-b8fb-47f6-9bd6-925ffaec8ccc))
  (pad "17" thru_hole circle (at 22 6) (size 1.431 1.431) (drill 0.92) (layers *.Cu *.Mask) (tstamp b07bd21d-3f59-49e2-b3c2-4a0a7a7f0bb7))
  (pad "18" thru_hole circle (at 22 4) (size 1.431 1.431) (drill 0.92) (layers *.Cu *.Mask) (tstamp 0cce093f-9433-4b0d-bbf4-f03723cb44c9))
  (pad "19" thru_hole circle (at 22 2) (size 1.431 1.431) (drill 0.92) (layers *.Cu *.Mask) (tstamp f91c8543-b6dd-4522-a7f9-22fa2740e79b))
  (pad "20" thru_hole circle (at 22 0) (size 1.431 1.431) (drill 0.92) (layers *.Cu *.Mask) (tstamp 51407367-8508-40e5-bdfc-e39b63854812))
  (model "${KIPRJMOD}/3D models/xBEE_S2C_PRO_headers.step"
    (offset (xyz 11 -26.5 8))
    (scale (xyz 1 1 1))
    (rotate (xyz 0 0 90))
  )
)
