(kicad_sch (version 20211123) (generator eeschema)

  (uuid 1f2b77aa-d305-44cc-8414-f23a5a8e1cb1)

  (paper "A4")

  (title_block
    (title "Sky Runner")
    (company "White Noise Payload Team")
  )

  (lib_symbols
    (symbol "Connector_Generic:Conn_01x03" (pin_names (offset 1.016) hide) (in_bom yes) (on_board yes)
      (property "Reference" "J" (id 0) (at 0 5.08 0)
        (effects (font (size 1.27 1.27)))
      )
      (property "Value" "Conn_01x03" (id 1) (at 0 -5.08 0)
        (effects (font (size 1.27 1.27)))
      )
      (property "Footprint" "" (id 2) (at 0 0 0)
        (effects (font (size 1.27 1.27)) hide)
      )
      (property "Datasheet" "~" (id 3) (at 0 0 0)
        (effects (font (size 1.27 1.27)) hide)
      )
      (property "ki_keywords" "connector" (id 4) (at 0 0 0)
        (effects (font (size 1.27 1.27)) hide)
      )
      (property "ki_description" "Generic connector, single row, 01x03, script generated (kicad-library-utils/schlib/autogen/connector/)" (id 5) (at 0 0 0)
        (effects (font (size 1.27 1.27)) hide)
      )
      (property "ki_fp_filters" "Connector*:*_1x??_*" (id 6) (at 0 0 0)
        (effects (font (size 1.27 1.27)) hide)
      )
      (symbol "Conn_01x03_1_1"
        (rectangle (start -1.27 -2.413) (end 0 -2.667)
          (stroke (width 0.1524) (type default) (color 0 0 0 0))
          (fill (type none))
        )
        (rectangle (start -1.27 0.127) (end 0 -0.127)
          (stroke (width 0.1524) (type default) (color 0 0 0 0))
          (fill (type none))
        )
        (rectangle (start -1.27 2.667) (end 0 2.413)
          (stroke (width 0.1524) (type default) (color 0 0 0 0))
          (fill (type none))
        )
        (rectangle (start -1.27 3.81) (end 1.27 -3.81)
          (stroke (width 0.254) (type default) (color 0 0 0 0))
          (fill (type background))
        )
        (pin passive line (at -5.08 2.54 0) (length 3.81)
          (name "Pin_1" (effects (font (size 1.27 1.27))))
          (number "1" (effects (font (size 1.27 1.27))))
        )
        (pin passive line (at -5.08 0 0) (length 3.81)
          (name "Pin_2" (effects (font (size 1.27 1.27))))
          (number "2" (effects (font (size 1.27 1.27))))
        )
        (pin passive line (at -5.08 -2.54 0) (length 3.81)
          (name "Pin_3" (effects (font (size 1.27 1.27))))
          (number "3" (effects (font (size 1.27 1.27))))
        )
      )
    )
    (symbol "Device:C" (pin_numbers hide) (pin_names (offset 0.254)) (in_bom yes) (on_board yes)
      (property "Reference" "C" (id 0) (at 0.635 2.54 0)
        (effects (font (size 1.27 1.27)) (justify left))
      )
      (property "Value" "C" (id 1) (at 0.635 -2.54 0)
        (effects (font (size 1.27 1.27)) (justify left))
      )
      (property "Footprint" "" (id 2) (at 0.9652 -3.81 0)
        (effects (font (size 1.27 1.27)) hide)
      )
      (property "Datasheet" "~" (id 3) (at 0 0 0)
        (effects (font (size 1.27 1.27)) hide)
      )
      (property "ki_keywords" "cap capacitor" (id 4) (at 0 0 0)
        (effects (font (size 1.27 1.27)) hide)
      )
      (property "ki_description" "Unpolarized capacitor" (id 5) (at 0 0 0)
        (effects (font (size 1.27 1.27)) hide)
      )
      (property "ki_fp_filters" "C_*" (id 6) (at 0 0 0)
        (effects (font (size 1.27 1.27)) hide)
      )
      (symbol "C_0_1"
        (polyline
          (pts
            (xy -2.032 -0.762)
            (xy 2.032 -0.762)
          )
          (stroke (width 0.508) (type default) (color 0 0 0 0))
          (fill (type none))
        )
        (polyline
          (pts
            (xy -2.032 0.762)
            (xy 2.032 0.762)
          )
          (stroke (width 0.508) (type default) (color 0 0 0 0))
          (fill (type none))
        )
      )
      (symbol "C_1_1"
        (pin passive line (at 0 3.81 270) (length 2.794)
          (name "~" (effects (font (size 1.27 1.27))))
          (number "1" (effects (font (size 1.27 1.27))))
        )
        (pin passive line (at 0 -3.81 90) (length 2.794)
          (name "~" (effects (font (size 1.27 1.27))))
          (number "2" (effects (font (size 1.27 1.27))))
        )
      )
    )
    (symbol "Device:R" (pin_numbers hide) (pin_names (offset 0)) (in_bom yes) (on_board yes)
      (property "Reference" "R" (id 0) (at 2.032 0 90)
        (effects (font (size 1.27 1.27)))
      )
      (property "Value" "R" (id 1) (at 0 0 90)
        (effects (font (size 1.27 1.27)))
      )
      (property "Footprint" "" (id 2) (at -1.778 0 90)
        (effects (font (size 1.27 1.27)) hide)
      )
      (property "Datasheet" "~" (id 3) (at 0 0 0)
        (effects (font (size 1.27 1.27)) hide)
      )
      (property "ki_keywords" "R res resistor" (id 4) (at 0 0 0)
        (effects (font (size 1.27 1.27)) hide)
      )
      (property "ki_description" "Resistor" (id 5) (at 0 0 0)
        (effects (font (size 1.27 1.27)) hide)
      )
      (property "ki_fp_filters" "R_*" (id 6) (at 0 0 0)
        (effects (font (size 1.27 1.27)) hide)
      )
      (symbol "R_0_1"
        (rectangle (start -1.016 -2.54) (end 1.016 2.54)
          (stroke (width 0.254) (type default) (color 0 0 0 0))
          (fill (type none))
        )
      )
      (symbol "R_1_1"
        (pin passive line (at 0 3.81 270) (length 1.27)
          (name "~" (effects (font (size 1.27 1.27))))
          (number "1" (effects (font (size 1.27 1.27))))
        )
        (pin passive line (at 0 -3.81 90) (length 1.27)
          (name "~" (effects (font (size 1.27 1.27))))
          (number "2" (effects (font (size 1.27 1.27))))
        )
      )
    )
    (symbol "Jumper:SolderJumper_3_Open" (pin_names (offset 0) hide) (in_bom yes) (on_board yes)
      (property "Reference" "JP" (id 0) (at -2.54 -2.54 0)
        (effects (font (size 1.27 1.27)))
      )
      (property "Value" "SolderJumper_3_Open" (id 1) (at 0 2.794 0)
        (effects (font (size 1.27 1.27)))
      )
      (property "Footprint" "" (id 2) (at 0 0 0)
        (effects (font (size 1.27 1.27)) hide)
      )
      (property "Datasheet" "~" (id 3) (at 0 0 0)
        (effects (font (size 1.27 1.27)) hide)
      )
      (property "ki_keywords" "Solder Jumper SPDT" (id 4) (at 0 0 0)
        (effects (font (size 1.27 1.27)) hide)
      )
      (property "ki_description" "Solder Jumper, 3-pole, open" (id 5) (at 0 0 0)
        (effects (font (size 1.27 1.27)) hide)
      )
      (property "ki_fp_filters" "SolderJumper*Open*" (id 6) (at 0 0 0)
        (effects (font (size 1.27 1.27)) hide)
      )
      (symbol "SolderJumper_3_Open_0_1"
        (arc (start -1.016 1.016) (mid -2.032 0) (end -1.016 -1.016)
          (stroke (width 0) (type default) (color 0 0 0 0))
          (fill (type none))
        )
        (arc (start -1.016 1.016) (mid -2.032 0) (end -1.016 -1.016)
          (stroke (width 0) (type default) (color 0 0 0 0))
          (fill (type outline))
        )
        (rectangle (start -0.508 1.016) (end 0.508 -1.016)
          (stroke (width 0) (type default) (color 0 0 0 0))
          (fill (type outline))
        )
        (polyline
          (pts
            (xy -2.54 0)
            (xy -2.032 0)
          )
          (stroke (width 0) (type default) (color 0 0 0 0))
          (fill (type none))
        )
        (polyline
          (pts
            (xy -1.016 1.016)
            (xy -1.016 -1.016)
          )
          (stroke (width 0) (type default) (color 0 0 0 0))
          (fill (type none))
        )
        (polyline
          (pts
            (xy 0 -1.27)
            (xy 0 -1.016)
          )
          (stroke (width 0) (type default) (color 0 0 0 0))
          (fill (type none))
        )
        (polyline
          (pts
            (xy 1.016 1.016)
            (xy 1.016 -1.016)
          )
          (stroke (width 0) (type default) (color 0 0 0 0))
          (fill (type none))
        )
        (polyline
          (pts
            (xy 2.54 0)
            (xy 2.032 0)
          )
          (stroke (width 0) (type default) (color 0 0 0 0))
          (fill (type none))
        )
        (arc (start 1.016 -1.016) (mid 2.032 0) (end 1.016 1.016)
          (stroke (width 0) (type default) (color 0 0 0 0))
          (fill (type none))
        )
        (arc (start 1.016 -1.016) (mid 2.032 0) (end 1.016 1.016)
          (stroke (width 0) (type default) (color 0 0 0 0))
          (fill (type outline))
        )
      )
      (symbol "SolderJumper_3_Open_1_1"
        (pin passive line (at -5.08 0 0) (length 2.54)
          (name "A" (effects (font (size 1.27 1.27))))
          (number "1" (effects (font (size 1.27 1.27))))
        )
        (pin input line (at 0 -3.81 90) (length 2.54)
          (name "C" (effects (font (size 1.27 1.27))))
          (number "2" (effects (font (size 1.27 1.27))))
        )
        (pin passive line (at 5.08 0 180) (length 2.54)
          (name "B" (effects (font (size 1.27 1.27))))
          (number "3" (effects (font (size 1.27 1.27))))
        )
      )
    )
    (symbol "Logic_LevelTranslator:TXB0108DQSR" (in_bom yes) (on_board yes)
      (property "Reference" "U" (id 0) (at -6.35 16.51 0)
        (effects (font (size 1.27 1.27)))
      )
      (property "Value" "TXB0108DQSR" (id 1) (at 3.81 16.51 0)
        (effects (font (size 1.27 1.27)) (justify left))
      )
      (property "Footprint" "Package_SON:USON-20_2x4mm_P0.4mm" (id 2) (at 0 -19.05 0)
        (effects (font (size 1.27 1.27)) hide)
      )
      (property "Datasheet" "http://www.ti.com/lit/ds/symlink/txb0108.pdf" (id 3) (at 0 -2.54 0)
        (effects (font (size 1.27 1.27)) hide)
      )
      (property "ki_keywords" "bidirectional voltage level translator" (id 4) (at 0 0 0)
        (effects (font (size 1.27 1.27)) hide)
      )
      (property "ki_description" "8-bit bidirectional voltage level translator with auto-direction sensing USON package" (id 5) (at 0 0 0)
        (effects (font (size 1.27 1.27)) hide)
      )
      (property "ki_fp_filters" "USON*2x4mm*P0.4mm*" (id 6) (at 0 0 0)
        (effects (font (size 1.27 1.27)) hide)
      )
      (symbol "TXB0108DQSR_0_1"
        (rectangle (start -7.62 15.24) (end 7.62 -15.24)
          (stroke (width 0.254) (type default) (color 0 0 0 0))
          (fill (type background))
        )
      )
      (symbol "TXB0108DQSR_1_1"
        (pin bidirectional line (at -10.16 7.62 0) (length 2.54)
          (name "A1" (effects (font (size 1.27 1.27))))
          (number "1" (effects (font (size 1.27 1.27))))
        )
        (pin bidirectional line (at -10.16 -10.16 0) (length 2.54)
          (name "A8" (effects (font (size 1.27 1.27))))
          (number "10" (effects (font (size 1.27 1.27))))
        )
        (pin bidirectional line (at 10.16 -10.16 180) (length 2.54)
          (name "B8" (effects (font (size 1.27 1.27))))
          (number "11" (effects (font (size 1.27 1.27))))
        )
        (pin bidirectional line (at 10.16 -7.62 180) (length 2.54)
          (name "B7" (effects (font (size 1.27 1.27))))
          (number "12" (effects (font (size 1.27 1.27))))
        )
        (pin bidirectional line (at 10.16 -5.08 180) (length 2.54)
          (name "B6" (effects (font (size 1.27 1.27))))
          (number "13" (effects (font (size 1.27 1.27))))
        )
        (pin bidirectional line (at 10.16 -2.54 180) (length 2.54)
          (name "B5" (effects (font (size 1.27 1.27))))
          (number "14" (effects (font (size 1.27 1.27))))
        )
        (pin power_in line (at 0 -17.78 90) (length 2.54)
          (name "GND" (effects (font (size 1.27 1.27))))
          (number "15" (effects (font (size 1.27 1.27))))
        )
        (pin power_in line (at 2.54 17.78 270) (length 2.54)
          (name "VCCB" (effects (font (size 1.27 1.27))))
          (number "16" (effects (font (size 1.27 1.27))))
        )
        (pin bidirectional line (at 10.16 0 180) (length 2.54)
          (name "B4" (effects (font (size 1.27 1.27))))
          (number "17" (effects (font (size 1.27 1.27))))
        )
        (pin bidirectional line (at 10.16 2.54 180) (length 2.54)
          (name "B3" (effects (font (size 1.27 1.27))))
          (number "18" (effects (font (size 1.27 1.27))))
        )
        (pin bidirectional line (at 10.16 5.08 180) (length 2.54)
          (name "B2" (effects (font (size 1.27 1.27))))
          (number "19" (effects (font (size 1.27 1.27))))
        )
        (pin bidirectional line (at -10.16 5.08 0) (length 2.54)
          (name "A2" (effects (font (size 1.27 1.27))))
          (number "2" (effects (font (size 1.27 1.27))))
        )
        (pin bidirectional line (at 10.16 7.62 180) (length 2.54)
          (name "B1" (effects (font (size 1.27 1.27))))
          (number "20" (effects (font (size 1.27 1.27))))
        )
        (pin bidirectional line (at -10.16 2.54 0) (length 2.54)
          (name "A3" (effects (font (size 1.27 1.27))))
          (number "3" (effects (font (size 1.27 1.27))))
        )
        (pin bidirectional line (at -10.16 0 0) (length 2.54)
          (name "A4" (effects (font (size 1.27 1.27))))
          (number "4" (effects (font (size 1.27 1.27))))
        )
        (pin power_in line (at -2.54 17.78 270) (length 2.54)
          (name "VCCA" (effects (font (size 1.27 1.27))))
          (number "5" (effects (font (size 1.27 1.27))))
        )
        (pin input line (at -10.16 10.16 0) (length 2.54)
          (name "OE" (effects (font (size 1.27 1.27))))
          (number "6" (effects (font (size 1.27 1.27))))
        )
        (pin bidirectional line (at -10.16 -2.54 0) (length 2.54)
          (name "A5" (effects (font (size 1.27 1.27))))
          (number "7" (effects (font (size 1.27 1.27))))
        )
        (pin bidirectional line (at -10.16 -5.08 0) (length 2.54)
          (name "A6" (effects (font (size 1.27 1.27))))
          (number "8" (effects (font (size 1.27 1.27))))
        )
        (pin bidirectional line (at -10.16 -7.62 0) (length 2.54)
          (name "A7" (effects (font (size 1.27 1.27))))
          (number "9" (effects (font (size 1.27 1.27))))
        )
      )
    )
    (symbol "MCU_Module:Arduino_Nano_v3.x" (in_bom yes) (on_board yes)
      (property "Reference" "A" (id 0) (at -10.16 23.495 0)
        (effects (font (size 1.27 1.27)) (justify left bottom))
      )
      (property "Value" "Arduino_Nano_v3.x" (id 1) (at 5.08 -24.13 0)
        (effects (font (size 1.27 1.27)) (justify left top))
      )
      (property "Footprint" "Module:Arduino_Nano" (id 2) (at 0 0 0)
        (effects (font (size 1.27 1.27) italic) hide)
      )
      (property "Datasheet" "http://www.mouser.com/pdfdocs/Gravitech_Arduino_Nano3_0.pdf" (id 3) (at 0 0 0)
        (effects (font (size 1.27 1.27)) hide)
      )
      (property "ki_keywords" "Arduino nano microcontroller module USB" (id 4) (at 0 0 0)
        (effects (font (size 1.27 1.27)) hide)
      )
      (property "ki_description" "Arduino Nano v3.x" (id 5) (at 0 0 0)
        (effects (font (size 1.27 1.27)) hide)
      )
      (property "ki_fp_filters" "Arduino*Nano*" (id 6) (at 0 0 0)
        (effects (font (size 1.27 1.27)) hide)
      )
      (symbol "Arduino_Nano_v3.x_0_1"
        (rectangle (start -10.16 22.86) (end 10.16 -22.86)
          (stroke (width 0.254) (type default) (color 0 0 0 0))
          (fill (type background))
        )
      )
      (symbol "Arduino_Nano_v3.x_1_1"
        (pin bidirectional line (at -12.7 12.7 0) (length 2.54)
          (name "D1/TX" (effects (font (size 1.27 1.27))))
          (number "1" (effects (font (size 1.27 1.27))))
        )
        (pin bidirectional line (at -12.7 -2.54 0) (length 2.54)
          (name "D7" (effects (font (size 1.27 1.27))))
          (number "10" (effects (font (size 1.27 1.27))))
        )
        (pin bidirectional line (at -12.7 -5.08 0) (length 2.54)
          (name "D8" (effects (font (size 1.27 1.27))))
          (number "11" (effects (font (size 1.27 1.27))))
        )
        (pin bidirectional line (at -12.7 -7.62 0) (length 2.54)
          (name "D9" (effects (font (size 1.27 1.27))))
          (number "12" (effects (font (size 1.27 1.27))))
        )
        (pin bidirectional line (at -12.7 -10.16 0) (length 2.54)
          (name "D10" (effects (font (size 1.27 1.27))))
          (number "13" (effects (font (size 1.27 1.27))))
        )
        (pin bidirectional line (at -12.7 -12.7 0) (length 2.54)
          (name "D11" (effects (font (size 1.27 1.27))))
          (number "14" (effects (font (size 1.27 1.27))))
        )
        (pin bidirectional line (at -12.7 -15.24 0) (length 2.54)
          (name "D12" (effects (font (size 1.27 1.27))))
          (number "15" (effects (font (size 1.27 1.27))))
        )
        (pin bidirectional line (at -12.7 -17.78 0) (length 2.54)
          (name "D13" (effects (font (size 1.27 1.27))))
          (number "16" (effects (font (size 1.27 1.27))))
        )
        (pin power_out line (at 2.54 25.4 270) (length 2.54)
          (name "3V3" (effects (font (size 1.27 1.27))))
          (number "17" (effects (font (size 1.27 1.27))))
        )
        (pin input line (at 12.7 5.08 180) (length 2.54)
          (name "AREF" (effects (font (size 1.27 1.27))))
          (number "18" (effects (font (size 1.27 1.27))))
        )
        (pin bidirectional line (at 12.7 0 180) (length 2.54)
          (name "A0" (effects (font (size 1.27 1.27))))
          (number "19" (effects (font (size 1.27 1.27))))
        )
        (pin bidirectional line (at -12.7 15.24 0) (length 2.54)
          (name "D0/RX" (effects (font (size 1.27 1.27))))
          (number "2" (effects (font (size 1.27 1.27))))
        )
        (pin bidirectional line (at 12.7 -2.54 180) (length 2.54)
          (name "A1" (effects (font (size 1.27 1.27))))
          (number "20" (effects (font (size 1.27 1.27))))
        )
        (pin bidirectional line (at 12.7 -5.08 180) (length 2.54)
          (name "A2" (effects (font (size 1.27 1.27))))
          (number "21" (effects (font (size 1.27 1.27))))
        )
        (pin bidirectional line (at 12.7 -7.62 180) (length 2.54)
          (name "A3" (effects (font (size 1.27 1.27))))
          (number "22" (effects (font (size 1.27 1.27))))
        )
        (pin bidirectional line (at 12.7 -10.16 180) (length 2.54)
          (name "A4" (effects (font (size 1.27 1.27))))
          (number "23" (effects (font (size 1.27 1.27))))
        )
        (pin bidirectional line (at 12.7 -12.7 180) (length 2.54)
          (name "A5" (effects (font (size 1.27 1.27))))
          (number "24" (effects (font (size 1.27 1.27))))
        )
        (pin bidirectional line (at 12.7 -15.24 180) (length 2.54)
          (name "A6" (effects (font (size 1.27 1.27))))
          (number "25" (effects (font (size 1.27 1.27))))
        )
        (pin bidirectional line (at 12.7 -17.78 180) (length 2.54)
          (name "A7" (effects (font (size 1.27 1.27))))
          (number "26" (effects (font (size 1.27 1.27))))
        )
        (pin power_out line (at 5.08 25.4 270) (length 2.54)
          (name "+5V" (effects (font (size 1.27 1.27))))
          (number "27" (effects (font (size 1.27 1.27))))
        )
        (pin input line (at 12.7 15.24 180) (length 2.54)
          (name "~{RESET}" (effects (font (size 1.27 1.27))))
          (number "28" (effects (font (size 1.27 1.27))))
        )
        (pin power_in line (at 2.54 -25.4 90) (length 2.54)
          (name "GND" (effects (font (size 1.27 1.27))))
          (number "29" (effects (font (size 1.27 1.27))))
        )
        (pin input line (at 12.7 12.7 180) (length 2.54)
          (name "~{RESET}" (effects (font (size 1.27 1.27))))
          (number "3" (effects (font (size 1.27 1.27))))
        )
        (pin power_in line (at -2.54 25.4 270) (length 2.54)
          (name "VIN" (effects (font (size 1.27 1.27))))
          (number "30" (effects (font (size 1.27 1.27))))
        )
        (pin power_in line (at 0 -25.4 90) (length 2.54)
          (name "GND" (effects (font (size 1.27 1.27))))
          (number "4" (effects (font (size 1.27 1.27))))
        )
        (pin bidirectional line (at -12.7 10.16 0) (length 2.54)
          (name "D2" (effects (font (size 1.27 1.27))))
          (number "5" (effects (font (size 1.27 1.27))))
        )
        (pin bidirectional line (at -12.7 7.62 0) (length 2.54)
          (name "D3" (effects (font (size 1.27 1.27))))
          (number "6" (effects (font (size 1.27 1.27))))
        )
        (pin bidirectional line (at -12.7 5.08 0) (length 2.54)
          (name "D4" (effects (font (size 1.27 1.27))))
          (number "7" (effects (font (size 1.27 1.27))))
        )
        (pin bidirectional line (at -12.7 2.54 0) (length 2.54)
          (name "D5" (effects (font (size 1.27 1.27))))
          (number "8" (effects (font (size 1.27 1.27))))
        )
        (pin bidirectional line (at -12.7 0 0) (length 2.54)
          (name "D6" (effects (font (size 1.27 1.27))))
          (number "9" (effects (font (size 1.27 1.27))))
        )
      )
    )
    (symbol "payload:Connector_Generic_Conn_02x20_Odd_Even-raspberrypi_zerow_uhat-cache" (pin_names (offset 1.016) hide) (in_bom yes) (on_board yes)
      (property "Reference" "J" (id 0) (at 1.27 25.4 0)
        (effects (font (size 1.27 1.27)))
      )
      (property "Value" "payload_Connector_Generic_Conn_02x20_Odd_Even-raspberrypi_zerow_uhat-cache" (id 1) (at 1.27 -27.94 0)
        (effects (font (size 1.27 1.27)))
      )
      (property "Footprint" "" (id 2) (at 0 0 0)
        (effects (font (size 1.27 1.27)) hide)
      )
      (property "Datasheet" "" (id 3) (at 0 0 0)
        (effects (font (size 1.27 1.27)) hide)
      )
      (property "ki_fp_filters" "Connector*:*_2x??_*" (id 4) (at 0 0 0)
        (effects (font (size 1.27 1.27)) hide)
      )
      (symbol "Connector_Generic_Conn_02x20_Odd_Even-raspberrypi_zerow_uhat-cache_1_1"
        (rectangle (start -1.27 -25.273) (end 0 -25.527)
          (stroke (width 0.1524) (type default) (color 0 0 0 0))
          (fill (type none))
        )
        (rectangle (start -1.27 -22.733) (end 0 -22.987)
          (stroke (width 0.1524) (type default) (color 0 0 0 0))
          (fill (type none))
        )
        (rectangle (start -1.27 -20.193) (end 0 -20.447)
          (stroke (width 0.1524) (type default) (color 0 0 0 0))
          (fill (type none))
        )
        (rectangle (start -1.27 -17.653) (end 0 -17.907)
          (stroke (width 0.1524) (type default) (color 0 0 0 0))
          (fill (type none))
        )
        (rectangle (start -1.27 -15.113) (end 0 -15.367)
          (stroke (width 0.1524) (type default) (color 0 0 0 0))
          (fill (type none))
        )
        (rectangle (start -1.27 -12.573) (end 0 -12.827)
          (stroke (width 0.1524) (type default) (color 0 0 0 0))
          (fill (type none))
        )
        (rectangle (start -1.27 -10.033) (end 0 -10.287)
          (stroke (width 0.1524) (type default) (color 0 0 0 0))
          (fill (type none))
        )
        (rectangle (start -1.27 -7.493) (end 0 -7.747)
          (stroke (width 0.1524) (type default) (color 0 0 0 0))
          (fill (type none))
        )
        (rectangle (start -1.27 -4.953) (end 0 -5.207)
          (stroke (width 0.1524) (type default) (color 0 0 0 0))
          (fill (type none))
        )
        (rectangle (start -1.27 -2.413) (end 0 -2.667)
          (stroke (width 0.1524) (type default) (color 0 0 0 0))
          (fill (type none))
        )
        (rectangle (start -1.27 0.127) (end 0 -0.127)
          (stroke (width 0.1524) (type default) (color 0 0 0 0))
          (fill (type none))
        )
        (rectangle (start -1.27 2.667) (end 0 2.413)
          (stroke (width 0.1524) (type default) (color 0 0 0 0))
          (fill (type none))
        )
        (rectangle (start -1.27 5.207) (end 0 4.953)
          (stroke (width 0.1524) (type default) (color 0 0 0 0))
          (fill (type none))
        )
        (rectangle (start -1.27 7.747) (end 0 7.493)
          (stroke (width 0.1524) (type default) (color 0 0 0 0))
          (fill (type none))
        )
        (rectangle (start -1.27 10.287) (end 0 10.033)
          (stroke (width 0.1524) (type default) (color 0 0 0 0))
          (fill (type none))
        )
        (rectangle (start -1.27 12.827) (end 0 12.573)
          (stroke (width 0.1524) (type default) (color 0 0 0 0))
          (fill (type none))
        )
        (rectangle (start -1.27 15.367) (end 0 15.113)
          (stroke (width 0.1524) (type default) (color 0 0 0 0))
          (fill (type none))
        )
        (rectangle (start -1.27 17.907) (end 0 17.653)
          (stroke (width 0.1524) (type default) (color 0 0 0 0))
          (fill (type none))
        )
        (rectangle (start -1.27 20.447) (end 0 20.193)
          (stroke (width 0.1524) (type default) (color 0 0 0 0))
          (fill (type none))
        )
        (rectangle (start -1.27 22.987) (end 0 22.733)
          (stroke (width 0.1524) (type default) (color 0 0 0 0))
          (fill (type none))
        )
        (rectangle (start -1.27 24.13) (end 3.81 -26.67)
          (stroke (width 0.254) (type default) (color 0 0 0 0))
          (fill (type background))
        )
        (rectangle (start 3.81 -25.273) (end 2.54 -25.527)
          (stroke (width 0.1524) (type default) (color 0 0 0 0))
          (fill (type none))
        )
        (rectangle (start 3.81 -22.733) (end 2.54 -22.987)
          (stroke (width 0.1524) (type default) (color 0 0 0 0))
          (fill (type none))
        )
        (rectangle (start 3.81 -20.193) (end 2.54 -20.447)
          (stroke (width 0.1524) (type default) (color 0 0 0 0))
          (fill (type none))
        )
        (rectangle (start 3.81 -17.653) (end 2.54 -17.907)
          (stroke (width 0.1524) (type default) (color 0 0 0 0))
          (fill (type none))
        )
        (rectangle (start 3.81 -15.113) (end 2.54 -15.367)
          (stroke (width 0.1524) (type default) (color 0 0 0 0))
          (fill (type none))
        )
        (rectangle (start 3.81 -12.573) (end 2.54 -12.827)
          (stroke (width 0.1524) (type default) (color 0 0 0 0))
          (fill (type none))
        )
        (rectangle (start 3.81 -10.033) (end 2.54 -10.287)
          (stroke (width 0.1524) (type default) (color 0 0 0 0))
          (fill (type none))
        )
        (rectangle (start 3.81 -7.493) (end 2.54 -7.747)
          (stroke (width 0.1524) (type default) (color 0 0 0 0))
          (fill (type none))
        )
        (rectangle (start 3.81 -4.953) (end 2.54 -5.207)
          (stroke (width 0.1524) (type default) (color 0 0 0 0))
          (fill (type none))
        )
        (rectangle (start 3.81 -2.413) (end 2.54 -2.667)
          (stroke (width 0.1524) (type default) (color 0 0 0 0))
          (fill (type none))
        )
        (rectangle (start 3.81 0.127) (end 2.54 -0.127)
          (stroke (width 0.1524) (type default) (color 0 0 0 0))
          (fill (type none))
        )
        (rectangle (start 3.81 2.667) (end 2.54 2.413)
          (stroke (width 0.1524) (type default) (color 0 0 0 0))
          (fill (type none))
        )
        (rectangle (start 3.81 5.207) (end 2.54 4.953)
          (stroke (width 0.1524) (type default) (color 0 0 0 0))
          (fill (type none))
        )
        (rectangle (start 3.81 7.747) (end 2.54 7.493)
          (stroke (width 0.1524) (type default) (color 0 0 0 0))
          (fill (type none))
        )
        (rectangle (start 3.81 10.287) (end 2.54 10.033)
          (stroke (width 0.1524) (type default) (color 0 0 0 0))
          (fill (type none))
        )
        (rectangle (start 3.81 12.827) (end 2.54 12.573)
          (stroke (width 0.1524) (type default) (color 0 0 0 0))
          (fill (type none))
        )
        (rectangle (start 3.81 15.367) (end 2.54 15.113)
          (stroke (width 0.1524) (type default) (color 0 0 0 0))
          (fill (type none))
        )
        (rectangle (start 3.81 17.907) (end 2.54 17.653)
          (stroke (width 0.1524) (type default) (color 0 0 0 0))
          (fill (type none))
        )
        (rectangle (start 3.81 20.447) (end 2.54 20.193)
          (stroke (width 0.1524) (type default) (color 0 0 0 0))
          (fill (type none))
        )
        (rectangle (start 3.81 22.987) (end 2.54 22.733)
          (stroke (width 0.1524) (type default) (color 0 0 0 0))
          (fill (type none))
        )
        (pin passive line (at -5.08 22.86 0) (length 3.81)
          (name "Pin_1" (effects (font (size 1.27 1.27))))
          (number "1" (effects (font (size 1.27 1.27))))
        )
        (pin passive line (at 7.62 12.7 180) (length 3.81)
          (name "Pin_10" (effects (font (size 1.27 1.27))))
          (number "10" (effects (font (size 1.27 1.27))))
        )
        (pin passive line (at -5.08 10.16 0) (length 3.81)
          (name "Pin_11" (effects (font (size 1.27 1.27))))
          (number "11" (effects (font (size 1.27 1.27))))
        )
        (pin passive line (at 7.62 10.16 180) (length 3.81)
          (name "Pin_12" (effects (font (size 1.27 1.27))))
          (number "12" (effects (font (size 1.27 1.27))))
        )
        (pin passive line (at -5.08 7.62 0) (length 3.81)
          (name "Pin_13" (effects (font (size 1.27 1.27))))
          (number "13" (effects (font (size 1.27 1.27))))
        )
        (pin passive line (at 7.62 7.62 180) (length 3.81)
          (name "Pin_14" (effects (font (size 1.27 1.27))))
          (number "14" (effects (font (size 1.27 1.27))))
        )
        (pin passive line (at -5.08 5.08 0) (length 3.81)
          (name "Pin_15" (effects (font (size 1.27 1.27))))
          (number "15" (effects (font (size 1.27 1.27))))
        )
        (pin passive line (at 7.62 5.08 180) (length 3.81)
          (name "Pin_16" (effects (font (size 1.27 1.27))))
          (number "16" (effects (font (size 1.27 1.27))))
        )
        (pin passive line (at -5.08 2.54 0) (length 3.81)
          (name "Pin_17" (effects (font (size 1.27 1.27))))
          (number "17" (effects (font (size 1.27 1.27))))
        )
        (pin passive line (at 7.62 2.54 180) (length 3.81)
          (name "Pin_18" (effects (font (size 1.27 1.27))))
          (number "18" (effects (font (size 1.27 1.27))))
        )
        (pin passive line (at -5.08 0 0) (length 3.81)
          (name "Pin_19" (effects (font (size 1.27 1.27))))
          (number "19" (effects (font (size 1.27 1.27))))
        )
        (pin passive line (at 7.62 22.86 180) (length 3.81)
          (name "Pin_2" (effects (font (size 1.27 1.27))))
          (number "2" (effects (font (size 1.27 1.27))))
        )
        (pin passive line (at 7.62 0 180) (length 3.81)
          (name "Pin_20" (effects (font (size 1.27 1.27))))
          (number "20" (effects (font (size 1.27 1.27))))
        )
        (pin passive line (at -5.08 -2.54 0) (length 3.81)
          (name "Pin_21" (effects (font (size 1.27 1.27))))
          (number "21" (effects (font (size 1.27 1.27))))
        )
        (pin passive line (at 7.62 -2.54 180) (length 3.81)
          (name "Pin_22" (effects (font (size 1.27 1.27))))
          (number "22" (effects (font (size 1.27 1.27))))
        )
        (pin passive line (at -5.08 -5.08 0) (length 3.81)
          (name "Pin_23" (effects (font (size 1.27 1.27))))
          (number "23" (effects (font (size 1.27 1.27))))
        )
        (pin passive line (at 7.62 -5.08 180) (length 3.81)
          (name "Pin_24" (effects (font (size 1.27 1.27))))
          (number "24" (effects (font (size 1.27 1.27))))
        )
        (pin passive line (at -5.08 -7.62 0) (length 3.81)
          (name "Pin_25" (effects (font (size 1.27 1.27))))
          (number "25" (effects (font (size 1.27 1.27))))
        )
        (pin passive line (at 7.62 -7.62 180) (length 3.81)
          (name "Pin_26" (effects (font (size 1.27 1.27))))
          (number "26" (effects (font (size 1.27 1.27))))
        )
        (pin passive line (at -5.08 -10.16 0) (length 3.81)
          (name "Pin_27" (effects (font (size 1.27 1.27))))
          (number "27" (effects (font (size 1.27 1.27))))
        )
        (pin passive line (at 7.62 -10.16 180) (length 3.81)
          (name "Pin_28" (effects (font (size 1.27 1.27))))
          (number "28" (effects (font (size 1.27 1.27))))
        )
        (pin passive line (at -5.08 -12.7 0) (length 3.81)
          (name "Pin_29" (effects (font (size 1.27 1.27))))
          (number "29" (effects (font (size 1.27 1.27))))
        )
        (pin passive line (at -5.08 20.32 0) (length 3.81)
          (name "Pin_3" (effects (font (size 1.27 1.27))))
          (number "3" (effects (font (size 1.27 1.27))))
        )
        (pin passive line (at 7.62 -12.7 180) (length 3.81)
          (name "Pin_30" (effects (font (size 1.27 1.27))))
          (number "30" (effects (font (size 1.27 1.27))))
        )
        (pin passive line (at -5.08 -15.24 0) (length 3.81)
          (name "Pin_31" (effects (font (size 1.27 1.27))))
          (number "31" (effects (font (size 1.27 1.27))))
        )
        (pin passive line (at 7.62 -15.24 180) (length 3.81)
          (name "Pin_32" (effects (font (size 1.27 1.27))))
          (number "32" (effects (font (size 1.27 1.27))))
        )
        (pin passive line (at -5.08 -17.78 0) (length 3.81)
          (name "Pin_33" (effects (font (size 1.27 1.27))))
          (number "33" (effects (font (size 1.27 1.27))))
        )
        (pin passive line (at 7.62 -17.78 180) (length 3.81)
          (name "Pin_34" (effects (font (size 1.27 1.27))))
          (number "34" (effects (font (size 1.27 1.27))))
        )
        (pin passive line (at -5.08 -20.32 0) (length 3.81)
          (name "Pin_35" (effects (font (size 1.27 1.27))))
          (number "35" (effects (font (size 1.27 1.27))))
        )
        (pin passive line (at 7.62 -20.32 180) (length 3.81)
          (name "Pin_36" (effects (font (size 1.27 1.27))))
          (number "36" (effects (font (size 1.27 1.27))))
        )
        (pin passive line (at -5.08 -22.86 0) (length 3.81)
          (name "Pin_37" (effects (font (size 1.27 1.27))))
          (number "37" (effects (font (size 1.27 1.27))))
        )
        (pin passive line (at 7.62 -22.86 180) (length 3.81)
          (name "Pin_38" (effects (font (size 1.27 1.27))))
          (number "38" (effects (font (size 1.27 1.27))))
        )
        (pin passive line (at -5.08 -25.4 0) (length 3.81)
          (name "Pin_39" (effects (font (size 1.27 1.27))))
          (number "39" (effects (font (size 1.27 1.27))))
        )
        (pin passive line (at 7.62 20.32 180) (length 3.81)
          (name "Pin_4" (effects (font (size 1.27 1.27))))
          (number "4" (effects (font (size 1.27 1.27))))
        )
        (pin passive line (at 7.62 -25.4 180) (length 3.81)
          (name "Pin_40" (effects (font (size 1.27 1.27))))
          (number "40" (effects (font (size 1.27 1.27))))
        )
        (pin passive line (at -5.08 17.78 0) (length 3.81)
          (name "Pin_5" (effects (font (size 1.27 1.27))))
          (number "5" (effects (font (size 1.27 1.27))))
        )
        (pin passive line (at 7.62 17.78 180) (length 3.81)
          (name "Pin_6" (effects (font (size 1.27 1.27))))
          (number "6" (effects (font (size 1.27 1.27))))
        )
        (pin passive line (at -5.08 15.24 0) (length 3.81)
          (name "Pin_7" (effects (font (size 1.27 1.27))))
          (number "7" (effects (font (size 1.27 1.27))))
        )
        (pin passive line (at 7.62 15.24 180) (length 3.81)
          (name "Pin_8" (effects (font (size 1.27 1.27))))
          (number "8" (effects (font (size 1.27 1.27))))
        )
        (pin passive line (at -5.08 12.7 0) (length 3.81)
          (name "Pin_9" (effects (font (size 1.27 1.27))))
          (number "9" (effects (font (size 1.27 1.27))))
        )
      )
    )
    (symbol "power:+3V3" (power) (pin_names (offset 0)) (in_bom yes) (on_board yes)
      (property "Reference" "#PWR" (id 0) (at 0 -3.81 0)
        (effects (font (size 1.27 1.27)) hide)
      )
      (property "Value" "+3V3" (id 1) (at 0 3.556 0)
        (effects (font (size 1.27 1.27)))
      )
      (property "Footprint" "" (id 2) (at 0 0 0)
        (effects (font (size 1.27 1.27)) hide)
      )
      (property "Datasheet" "" (id 3) (at 0 0 0)
        (effects (font (size 1.27 1.27)) hide)
      )
      (property "ki_keywords" "power-flag" (id 4) (at 0 0 0)
        (effects (font (size 1.27 1.27)) hide)
      )
      (property "ki_description" "Power symbol creates a global label with name \"+3V3\"" (id 5) (at 0 0 0)
        (effects (font (size 1.27 1.27)) hide)
      )
      (symbol "+3V3_0_1"
        (polyline
          (pts
            (xy -0.762 1.27)
            (xy 0 2.54)
          )
          (stroke (width 0) (type default) (color 0 0 0 0))
          (fill (type none))
        )
        (polyline
          (pts
            (xy 0 0)
            (xy 0 2.54)
          )
          (stroke (width 0) (type default) (color 0 0 0 0))
          (fill (type none))
        )
        (polyline
          (pts
            (xy 0 2.54)
            (xy 0.762 1.27)
          )
          (stroke (width 0) (type default) (color 0 0 0 0))
          (fill (type none))
        )
      )
      (symbol "+3V3_1_1"
        (pin power_in line (at 0 0 90) (length 0) hide
          (name "+3V3" (effects (font (size 1.27 1.27))))
          (number "1" (effects (font (size 1.27 1.27))))
        )
      )
    )
    (symbol "power:+5V" (power) (pin_names (offset 0)) (in_bom yes) (on_board yes)
      (property "Reference" "#PWR" (id 0) (at 0 -3.81 0)
        (effects (font (size 1.27 1.27)) hide)
      )
      (property "Value" "+5V" (id 1) (at 0 3.556 0)
        (effects (font (size 1.27 1.27)))
      )
      (property "Footprint" "" (id 2) (at 0 0 0)
        (effects (font (size 1.27 1.27)) hide)
      )
      (property "Datasheet" "" (id 3) (at 0 0 0)
        (effects (font (size 1.27 1.27)) hide)
      )
      (property "ki_keywords" "power-flag" (id 4) (at 0 0 0)
        (effects (font (size 1.27 1.27)) hide)
      )
      (property "ki_description" "Power symbol creates a global label with name \"+5V\"" (id 5) (at 0 0 0)
        (effects (font (size 1.27 1.27)) hide)
      )
      (symbol "+5V_0_1"
        (polyline
          (pts
            (xy -0.762 1.27)
            (xy 0 2.54)
          )
          (stroke (width 0) (type default) (color 0 0 0 0))
          (fill (type none))
        )
        (polyline
          (pts
            (xy 0 0)
            (xy 0 2.54)
          )
          (stroke (width 0) (type default) (color 0 0 0 0))
          (fill (type none))
        )
        (polyline
          (pts
            (xy 0 2.54)
            (xy 0.762 1.27)
          )
          (stroke (width 0) (type default) (color 0 0 0 0))
          (fill (type none))
        )
      )
      (symbol "+5V_1_1"
        (pin power_in line (at 0 0 90) (length 0) hide
          (name "+5V" (effects (font (size 1.27 1.27))))
          (number "1" (effects (font (size 1.27 1.27))))
        )
      )
    )
    (symbol "power:GND" (power) (pin_names (offset 0)) (in_bom yes) (on_board yes)
      (property "Reference" "#PWR" (id 0) (at 0 -6.35 0)
        (effects (font (size 1.27 1.27)) hide)
      )
      (property "Value" "GND" (id 1) (at 0 -3.81 0)
        (effects (font (size 1.27 1.27)))
      )
      (property "Footprint" "" (id 2) (at 0 0 0)
        (effects (font (size 1.27 1.27)) hide)
      )
      (property "Datasheet" "" (id 3) (at 0 0 0)
        (effects (font (size 1.27 1.27)) hide)
      )
      (property "ki_keywords" "power-flag" (id 4) (at 0 0 0)
        (effects (font (size 1.27 1.27)) hide)
      )
      (property "ki_description" "Power symbol creates a global label with name \"GND\" , ground" (id 5) (at 0 0 0)
        (effects (font (size 1.27 1.27)) hide)
      )
      (symbol "GND_0_1"
        (polyline
          (pts
            (xy 0 0)
            (xy 0 -1.27)
            (xy 1.27 -1.27)
            (xy 0 -2.54)
            (xy -1.27 -1.27)
            (xy 0 -1.27)
          )
          (stroke (width 0) (type default) (color 0 0 0 0))
          (fill (type none))
        )
      )
      (symbol "GND_1_1"
        (pin power_in line (at 0 0 270) (length 0) hide
          (name "GND" (effects (font (size 1.27 1.27))))
          (number "1" (effects (font (size 1.27 1.27))))
        )
      )
    )
  )

  (junction (at 280.67 105.41) (diameter 0) (color 0 0 0 0)
    (uuid 046aa560-758c-4f60-b2bb-3b07b79206b8)
  )
  (junction (at 280.67 92.71) (diameter 0) (color 0 0 0 0)
    (uuid 09495733-96ea-4863-a003-a3708e20f3cc)
  )
  (junction (at 229.87 100.33) (diameter 0) (color 0 0 0 0)
    (uuid 0a8237ee-e17f-4f9a-8376-fa445d636611)
  )
  (junction (at 182.88 67.31) (diameter 0) (color 0 0 0 0)
    (uuid 1371ae99-d81b-4953-9433-7fcca7330f26)
  )
  (junction (at 229.87 118.11) (diameter 0) (color 0 0 0 0)
    (uuid 2d072e2f-2acf-4cba-bd89-8ec4095efc41)
  )
  (junction (at 280.67 85.09) (diameter 0) (color 0 0 0 0)
    (uuid 2dfebaa8-3a9a-4de6-82d3-224a8e68482a)
  )
  (junction (at 187.96 67.31) (diameter 0) (color 0 0 0 0)
    (uuid 6cec2f76-d07a-4de9-9ea1-a16f8554b976)
  )
  (junction (at 264.16 69.85) (diameter 0) (color 0 0 0 0)
    (uuid 7b12296f-158c-4361-88d7-2bc433cd1484)
  )
  (junction (at 198.12 67.31) (diameter 0) (color 0 0 0 0)
    (uuid abe0b287-e005-4109-9e91-fafea068d181)
  )
  (junction (at 205.74 82.55) (diameter 0) (color 0 0 0 0)
    (uuid b50b249b-d454-4223-995d-d193b317cd4a)
  )
  (junction (at 280.67 110.49) (diameter 0) (color 0 0 0 0)
    (uuid e5f7c078-ee43-492e-b6db-a2652b520dd0)
  )

  (no_connect (at 246.38 105.41) (uuid 0047b95d-43f5-41af-859d-bfaaded1df49))
  (no_connect (at 115.57 82.55) (uuid 12dca6be-e3bf-49dd-ae30-351de8f97903))
  (no_connect (at 140.97 107.95) (uuid 1352542a-63cc-4307-8478-e3dc8b676d24))
  (no_connect (at 130.81 118.11) (uuid 16bfc454-72d8-4557-a357-4335d6bb367b))
  (no_connect (at 246.38 90.17) (uuid 19b04dd2-9a43-4243-9103-e9c3a4793bfb))
  (no_connect (at 259.08 102.87) (uuid 2698b3c9-fadc-4b2e-895e-034d7012e832))
  (no_connect (at 140.97 80.01) (uuid 28f49f26-2ba8-4656-9b82-0d89bb01addb))
  (no_connect (at 115.57 95.25) (uuid 2abe7583-a99d-4320-b3dd-9b5ad40e8d14))
  (no_connect (at 140.97 97.79) (uuid 326a9608-fb7e-4b01-b66b-0837b42fc7f1))
  (no_connect (at 246.38 77.47) (uuid 3768f14e-aadd-4b1a-958e-09940920638f))
  (no_connect (at 259.08 95.25) (uuid 3ca24607-44d0-44ee-a4be-d7953eeb44f7))
  (no_connect (at 259.08 118.11) (uuid 4318b7b7-acb0-4886-bb41-2ad34ea301ee))
  (no_connect (at 246.38 82.55) (uuid 463401e5-60ed-40ac-b324-4ff899988b39))
  (no_connect (at 130.81 67.31) (uuid 46ade8fc-dc39-4f76-a4a5-d7b3c4e33061))
  (no_connect (at 195.58 102.87) (uuid 63c60c20-98ec-4fa9-9614-8b64349a4cab))
  (no_connect (at 175.26 102.87) (uuid 63c60c20-98ec-4fa9-9614-8b64349a4cac))
  (no_connect (at 175.26 100.33) (uuid 63c60c20-98ec-4fa9-9614-8b64349a4cad))
  (no_connect (at 140.97 110.49) (uuid 68232d07-93cd-4d4e-bdd5-e31f7f1879eb))
  (no_connect (at 246.38 107.95) (uuid 69719d00-0e16-41e3-a0ea-3bf04b719286))
  (no_connect (at 140.97 100.33) (uuid 74c50177-a599-4143-a72a-47f6211362dc))
  (no_connect (at 246.38 85.09) (uuid 753be3b6-ae5a-4af9-9212-4918fa536d96))
  (no_connect (at 115.57 97.79) (uuid 7b2493f1-ed41-46d9-b096-89333c0c82de))
  (no_connect (at 140.97 87.63) (uuid 8da8d053-2f68-4df5-a825-5101c6846bbc))
  (no_connect (at 140.97 77.47) (uuid 965020cf-1c6b-4793-a41c-7bdcac818953))
  (no_connect (at 115.57 77.47) (uuid 9ef2c4aa-4165-4ad0-aeac-d08195ac8028))
  (no_connect (at 245.11 69.85) (uuid a4b3b6c2-a7e6-4056-aa4f-69273bc67593))
  (no_connect (at 125.73 67.31) (uuid afb7d8ec-4891-40b6-bdca-0c4494fb267f))
  (no_connect (at 140.97 95.25) (uuid b48bd070-cf50-435a-a267-c0ec631e9358))
  (no_connect (at 115.57 80.01) (uuid b80c157f-06a6-4746-b06b-e26571b3b784))
  (no_connect (at 195.58 97.79) (uuid c4388743-53ed-4ac5-9b72-0c59f23c2645))
  (no_connect (at 259.08 113.03) (uuid dd1abb29-c8f9-4d9d-9d0b-aa7325c9722d))
  (no_connect (at 140.97 92.71) (uuid dd7a26f1-e34a-469e-90db-89b26ac59192))
  (no_connect (at 259.08 115.57) (uuid de33e4bf-65f0-42e3-9e67-f7512ad421bf))
  (no_connect (at 246.38 87.63) (uuid e013695d-3be7-49f2-8098-9cb601b2c47e))
  (no_connect (at 246.38 102.87) (uuid e3195ea3-d21e-406d-96e1-a5c91a0f5c0b))
  (no_connect (at 259.08 90.17) (uuid ed01a3c8-31f7-410e-b81c-83854c199ec7))
  (no_connect (at 259.08 100.33) (uuid eee31022-c681-408f-947f-1fb76c8ae331))
  (no_connect (at 195.58 100.33) (uuid f64f8c12-77e2-433f-9d5d-ac8ea02502ba))
  (no_connect (at 246.38 115.57) (uuid f75cb820-f771-45b5-bb21-3affafe1da3b))
  (no_connect (at 175.26 97.79) (uuid f926e4cb-4720-4fab-b26a-f5c32dd0bf16))

  (wire (pts (xy 111.76 105.41) (xy 115.57 105.41))
    (stroke (width 0) (type default) (color 0 0 0 0))
    (uuid 000051ed-096b-4f1c-934d-9a0f895c735a)
  )
  (wire (pts (xy 259.08 72.39) (xy 264.16 72.39))
    (stroke (width 0) (type default) (color 0 0 0 0))
    (uuid 01f99d83-795c-4a37-8f52-14635d1d6fac)
  )
  (wire (pts (xy 205.74 67.31) (xy 198.12 67.31))
    (stroke (width 0) (type default) (color 0 0 0 0))
    (uuid 04b8c12c-c968-46ed-8430-bb561de3d667)
  )
  (wire (pts (xy 171.45 95.25) (xy 175.26 95.25))
    (stroke (width 0) (type default) (color 0 0 0 0))
    (uuid 05daaf5f-8a76-4029-a2fb-fc0da06771fa)
  )
  (wire (pts (xy 259.08 87.63) (xy 264.16 87.63))
    (stroke (width 0) (type default) (color 0 0 0 0))
    (uuid 08db0625-d4c6-48ff-acf6-540ed3353c4f)
  )
  (wire (pts (xy 259.08 80.01) (xy 264.16 80.01))
    (stroke (width 0) (type default) (color 0 0 0 0))
    (uuid 091b490d-34ff-48c0-89b3-9b0321886a1c)
  )
  (polyline (pts (xy 237.49 120.65) (xy 237.49 130.81))
    (stroke (width 0) (type default) (color 0 0 0 0))
    (uuid 09c80bf9-b539-4fe5-a287-6ecdd276447a)
  )

  (wire (pts (xy 195.58 82.55) (xy 205.74 82.55))
    (stroke (width 0) (type default) (color 0 0 0 0))
    (uuid 0bb5ad54-60ec-4097-89e3-5486005f0fd8)
  )
  (wire (pts (xy 259.08 77.47) (xy 264.16 77.47))
    (stroke (width 0) (type default) (color 0 0 0 0))
    (uuid 0d6028b3-241e-4d0f-9ea4-2372b6b8beda)
  )
  (wire (pts (xy 243.84 110.49) (xy 246.38 110.49))
    (stroke (width 0) (type default) (color 0 0 0 0))
    (uuid 0e9c3401-72b7-48ae-b695-e74020bba81a)
  )
  (polyline (pts (xy 88.9 91.44) (xy 88.9 17.78))
    (stroke (width 0) (type default) (color 0 0 0 0))
    (uuid 100f8be9-ecdb-48c3-ba93-b84b28b2f1e0)
  )
  (polyline (pts (xy 19.05 17.78) (xy 19.05 93.98))
    (stroke (width 0) (type default) (color 0 0 0 0))
    (uuid 144f1ffe-d19b-4420-83a0-f3608e4a627d)
  )

  (wire (pts (xy 91.44 140.97) (xy 95.25 140.97))
    (stroke (width 0) (type default) (color 0 0 0 0))
    (uuid 17a9e8cf-523e-4a15-83da-9ef6aa3eb108)
  )
  (wire (pts (xy 187.96 67.31) (xy 187.96 74.93))
    (stroke (width 0) (type default) (color 0 0 0 0))
    (uuid 1eaf353b-0455-4bae-a7b7-e31c66f7804e)
  )
  (wire (pts (xy 71.12 62.23) (xy 74.93 62.23))
    (stroke (width 0) (type default) (color 0 0 0 0))
    (uuid 1f1a21da-db13-4178-846d-ec1371c02059)
  )
  (wire (pts (xy 66.04 82.55) (xy 66.04 87.63))
    (stroke (width 0) (type default) (color 0 0 0 0))
    (uuid 20b8a47d-c8fa-4982-9369-d2180796681d)
  )
  (wire (pts (xy 111.76 85.09) (xy 115.57 85.09))
    (stroke (width 0) (type default) (color 0 0 0 0))
    (uuid 21a1bf57-ac3b-410c-af25-54f9ae31a0a4)
  )
  (wire (pts (xy 45.72 166.37) (xy 49.53 166.37))
    (stroke (width 0) (type default) (color 0 0 0 0))
    (uuid 23808d9a-cef8-48d8-af56-d734474a56e6)
  )
  (wire (pts (xy 171.45 77.47) (xy 171.45 78.74))
    (stroke (width 0) (type default) (color 0 0 0 0))
    (uuid 2be48832-6576-458f-93a6-bb6e9cc241ee)
  )
  (wire (pts (xy 182.88 64.77) (xy 182.88 67.31))
    (stroke (width 0) (type default) (color 0 0 0 0))
    (uuid 2d699c62-ccf7-4c31-a00d-cef4d026d61e)
  )
  (wire (pts (xy 243.84 95.25) (xy 246.38 95.25))
    (stroke (width 0) (type default) (color 0 0 0 0))
    (uuid 2e0857bf-fda4-4021-97d7-f130bbd4e5e4)
  )
  (polyline (pts (xy 17.78 128.27) (xy 17.78 185.42))
    (stroke (width 0) (type default) (color 0 0 0 0))
    (uuid 301f05d3-4eeb-4769-b5a1-37ff99c8342b)
  )

  (wire (pts (xy 229.87 118.11) (xy 229.87 121.92))
    (stroke (width 0) (type default) (color 0 0 0 0))
    (uuid 34fd2c37-8e91-4808-b147-e149e6c74ad5)
  )
  (wire (pts (xy 229.87 100.33) (xy 246.38 100.33))
    (stroke (width 0) (type default) (color 0 0 0 0))
    (uuid 3a724ed0-a980-42de-89e1-ae9c0e12a740)
  )
  (wire (pts (xy 40.64 170.18) (xy 40.64 172.72))
    (stroke (width 0) (type default) (color 0 0 0 0))
    (uuid 3a787d03-b44f-44ff-80b1-ccb716f1fb6a)
  )
  (wire (pts (xy 280.67 92.71) (xy 280.67 105.41))
    (stroke (width 0) (type default) (color 0 0 0 0))
    (uuid 4102cee8-e74b-4995-a09a-f47ba68ba85a)
  )
  (wire (pts (xy 71.12 44.45) (xy 74.93 44.45))
    (stroke (width 0) (type default) (color 0 0 0 0))
    (uuid 44e29b7a-a843-4d96-a81c-835756e9d903)
  )
  (wire (pts (xy 111.76 90.17) (xy 115.57 90.17))
    (stroke (width 0) (type default) (color 0 0 0 0))
    (uuid 4557ee72-55b8-4c53-ba69-2e6b9c8fcad2)
  )
  (wire (pts (xy 57.15 44.45) (xy 60.96 44.45))
    (stroke (width 0) (type default) (color 0 0 0 0))
    (uuid 4a62429e-02c3-4ecf-bc90-f1d28c069c07)
  )
  (wire (pts (xy 66.04 48.26) (xy 66.04 50.8))
    (stroke (width 0) (type default) (color 0 0 0 0))
    (uuid 4b776ec8-3d26-4448-892b-1c325086394a)
  )
  (wire (pts (xy 40.64 144.78) (xy 40.64 147.32))
    (stroke (width 0) (type default) (color 0 0 0 0))
    (uuid 4ec19b7c-af12-4464-89b7-b85c3d3a1478)
  )
  (wire (pts (xy 246.38 69.85) (xy 245.11 69.85))
    (stroke (width 0) (type default) (color 0 0 0 0))
    (uuid 4ef80e42-9454-4e5c-b508-18244f750cdb)
  )
  (wire (pts (xy 111.76 102.87) (xy 115.57 102.87))
    (stroke (width 0) (type default) (color 0 0 0 0))
    (uuid 5271ca71-18be-4485-9240-4117e3cc2ecd)
  )
  (wire (pts (xy 171.45 87.63) (xy 175.26 87.63))
    (stroke (width 0) (type default) (color 0 0 0 0))
    (uuid 527d7055-3ce5-41ea-8d5c-635dc168f557)
  )
  (wire (pts (xy 68.58 82.55) (xy 68.58 87.63))
    (stroke (width 0) (type default) (color 0 0 0 0))
    (uuid 5289437c-18c4-48b0-8e04-02b39285db47)
  )
  (polyline (pts (xy 110.49 185.42) (xy 110.49 127))
    (stroke (width 0) (type default) (color 0 0 0 0))
    (uuid 543a42af-2747-4d33-881c-d3a2acde169d)
  )

  (wire (pts (xy 171.45 67.31) (xy 182.88 67.31))
    (stroke (width 0) (type default) (color 0 0 0 0))
    (uuid 5799dfd2-7df4-407e-906a-705b49e6d1e3)
  )
  (wire (pts (xy 259.08 74.93) (xy 280.67 74.93))
    (stroke (width 0) (type default) (color 0 0 0 0))
    (uuid 58b012cd-a15a-4615-86c1-f8f178433501)
  )
  (wire (pts (xy 45.72 140.97) (xy 49.53 140.97))
    (stroke (width 0) (type default) (color 0 0 0 0))
    (uuid 5a38a857-4984-4b5e-8f28-122bf78b50b4)
  )
  (wire (pts (xy 280.67 110.49) (xy 280.67 113.03))
    (stroke (width 0) (type default) (color 0 0 0 0))
    (uuid 5ac780eb-d412-4dba-a42d-4e9785fd4884)
  )
  (polyline (pts (xy 17.78 185.42) (xy 110.49 185.42))
    (stroke (width 0) (type default) (color 0 0 0 0))
    (uuid 5b44dddd-fc3a-475c-a08c-e6a8622d4886)
  )
  (polyline (pts (xy 267.97 130.81) (xy 267.97 120.65))
    (stroke (width 0) (type default) (color 0 0 0 0))
    (uuid 5f840a8e-d918-4cb0-9806-417e931f3ec3)
  )

  (wire (pts (xy 171.45 92.71) (xy 175.26 92.71))
    (stroke (width 0) (type default) (color 0 0 0 0))
    (uuid 662990e6-445f-464f-8d12-59979e2dc0ea)
  )
  (wire (pts (xy 259.08 107.95) (xy 264.16 107.95))
    (stroke (width 0) (type default) (color 0 0 0 0))
    (uuid 6aa8857c-c702-41dd-bdbe-a151cf41b14b)
  )
  (wire (pts (xy 66.04 29.21) (xy 66.04 31.75))
    (stroke (width 0) (type default) (color 0 0 0 0))
    (uuid 6e94eb4f-3159-4139-b1cc-e127787f5ac5)
  )
  (wire (pts (xy 229.87 100.33) (xy 229.87 118.11))
    (stroke (width 0) (type default) (color 0 0 0 0))
    (uuid 702422f5-cb72-4f2a-82af-0e1d23ae0fd3)
  )
  (wire (pts (xy 205.74 82.55) (xy 209.55 82.55))
    (stroke (width 0) (type default) (color 0 0 0 0))
    (uuid 71165b79-9190-4a7e-9e3b-a1a6efeea73c)
  )
  (wire (pts (xy 195.58 90.17) (xy 200.66 90.17))
    (stroke (width 0) (type default) (color 0 0 0 0))
    (uuid 71aa85cd-d38b-45e5-b2ee-d51a63654582)
  )
  (wire (pts (xy 128.27 118.11) (xy 128.27 122.555))
    (stroke (width 0) (type default) (color 0 0 0 0))
    (uuid 7361193c-683a-43a2-8ee6-ead319246a6d)
  )
  (wire (pts (xy 185.42 110.49) (xy 185.42 116.84))
    (stroke (width 0) (type default) (color 0 0 0 0))
    (uuid 792ca0dc-c988-4ee4-8a25-ec4938d426d5)
  )
  (polyline (pts (xy 237.49 120.65) (xy 267.97 120.65))
    (stroke (width 0) (type default) (color 0 0 0 0))
    (uuid 7c2f1005-aab6-4479-a8d0-dd37e8bc2044)
  )

  (wire (pts (xy 259.08 85.09) (xy 280.67 85.09))
    (stroke (width 0) (type default) (color 0 0 0 0))
    (uuid 7d51e056-4275-427f-bc6e-ad2e56c326c6)
  )
  (wire (pts (xy 264.16 62.23) (xy 264.16 69.85))
    (stroke (width 0) (type default) (color 0 0 0 0))
    (uuid 80d53347-73d3-4193-98ea-e92925297143)
  )
  (wire (pts (xy 243.84 92.71) (xy 246.38 92.71))
    (stroke (width 0) (type default) (color 0 0 0 0))
    (uuid 832157cb-f712-4a1c-aea8-63de1670035f)
  )
  (wire (pts (xy 77.47 140.97) (xy 81.28 140.97))
    (stroke (width 0) (type default) (color 0 0 0 0))
    (uuid 84f50e4d-585d-4b4d-ba0e-c1c77dfebe8b)
  )
  (wire (pts (xy 229.87 80.01) (xy 229.87 100.33))
    (stroke (width 0) (type default) (color 0 0 0 0))
    (uuid 86ac770b-0f97-4df1-a67d-4b7fb8a1e54b)
  )
  (wire (pts (xy 63.5 29.21) (xy 63.5 31.75))
    (stroke (width 0) (type default) (color 0 0 0 0))
    (uuid 86ffd511-1523-4931-b82d-eec70a1b4a4a)
  )
  (wire (pts (xy 217.17 82.55) (xy 219.71 82.55))
    (stroke (width 0) (type default) (color 0 0 0 0))
    (uuid 8b5a2739-f991-4a5a-acf7-dce617e75a6f)
  )
  (wire (pts (xy 111.76 92.71) (xy 115.57 92.71))
    (stroke (width 0) (type default) (color 0 0 0 0))
    (uuid 8f2f4470-e393-483a-bc03-a2ba655eae6d)
  )
  (wire (pts (xy 195.58 85.09) (xy 200.66 85.09))
    (stroke (width 0) (type default) (color 0 0 0 0))
    (uuid 8fa26b39-5e14-4c5f-b238-84b5abd5289d)
  )
  (polyline (pts (xy 88.9 17.78) (xy 19.05 17.78))
    (stroke (width 0) (type default) (color 0 0 0 0))
    (uuid 9411221d-9329-4779-8722-0bb2ed723d32)
  )

  (wire (pts (xy 259.08 105.41) (xy 280.67 105.41))
    (stroke (width 0) (type default) (color 0 0 0 0))
    (uuid 941e6252-3c19-4d6a-a868-e8d38536a63c)
  )
  (wire (pts (xy 86.36 170.18) (xy 86.36 172.72))
    (stroke (width 0) (type default) (color 0 0 0 0))
    (uuid 9511d6e1-ad69-48c7-ab16-eeced975e0f6)
  )
  (wire (pts (xy 171.45 85.09) (xy 175.26 85.09))
    (stroke (width 0) (type default) (color 0 0 0 0))
    (uuid 96f6b12d-a4f2-43fa-a0aa-399434e02979)
  )
  (polyline (pts (xy 237.49 130.81) (xy 267.97 130.81))
    (stroke (width 0) (type default) (color 0 0 0 0))
    (uuid 978253f1-0d66-4412-bd23-0bdddcd5f781)
  )

  (wire (pts (xy 242.57 72.39) (xy 246.38 72.39))
    (stroke (width 0) (type default) (color 0 0 0 0))
    (uuid 97e47b08-a29c-4099-88e5-7e218f4c098d)
  )
  (wire (pts (xy 111.76 87.63) (xy 115.57 87.63))
    (stroke (width 0) (type default) (color 0 0 0 0))
    (uuid a038671d-9488-43be-a589-513f8ab8efa9)
  )
  (wire (pts (xy 280.67 105.41) (xy 280.67 110.49))
    (stroke (width 0) (type default) (color 0 0 0 0))
    (uuid a2a21856-c44a-435c-9c35-76617adea21a)
  )
  (wire (pts (xy 140.97 105.41) (xy 143.51 105.41))
    (stroke (width 0) (type default) (color 0 0 0 0))
    (uuid a3d63c6b-7273-42cc-9e51-82bacfeea530)
  )
  (wire (pts (xy 219.71 82.55) (xy 219.71 87.63))
    (stroke (width 0) (type default) (color 0 0 0 0))
    (uuid a3ef1f10-c828-4529-8bb2-8680a91035fa)
  )
  (wire (pts (xy 264.16 69.85) (xy 259.08 69.85))
    (stroke (width 0) (type default) (color 0 0 0 0))
    (uuid a5770b3b-89c3-4f68-96a8-4d993f4d3b0d)
  )
  (wire (pts (xy 182.88 67.31) (xy 182.88 74.93))
    (stroke (width 0) (type default) (color 0 0 0 0))
    (uuid a761fac3-7174-40cd-a418-784743c6b174)
  )
  (wire (pts (xy 195.58 95.25) (xy 200.66 95.25))
    (stroke (width 0) (type default) (color 0 0 0 0))
    (uuid a9c1c16a-14d0-4085-b4c2-8c295c5274a6)
  )
  (wire (pts (xy 246.38 80.01) (xy 229.87 80.01))
    (stroke (width 0) (type default) (color 0 0 0 0))
    (uuid a9c4d11e-551e-444f-8198-fe34a81e2936)
  )
  (wire (pts (xy 111.76 110.49) (xy 115.57 110.49))
    (stroke (width 0) (type default) (color 0 0 0 0))
    (uuid aa8fda49-ee4c-4d7e-87d5-10ccd89c45c2)
  )
  (wire (pts (xy 280.67 85.09) (xy 280.67 92.71))
    (stroke (width 0) (type default) (color 0 0 0 0))
    (uuid ab57be61-3be2-49a1-b1a4-004ab8e0694b)
  )
  (wire (pts (xy 259.08 110.49) (xy 280.67 110.49))
    (stroke (width 0) (type default) (color 0 0 0 0))
    (uuid ac64a312-7e71-4ac5-b7c7-68a20821c906)
  )
  (wire (pts (xy 31.75 166.37) (xy 35.56 166.37))
    (stroke (width 0) (type default) (color 0 0 0 0))
    (uuid b8565440-e06d-4d80-a82d-6dee5864731b)
  )
  (wire (pts (xy 195.58 87.63) (xy 200.66 87.63))
    (stroke (width 0) (type default) (color 0 0 0 0))
    (uuid b8ae980c-265e-4626-bc59-853b488bca60)
  )
  (wire (pts (xy 63.5 82.55) (xy 63.5 87.63))
    (stroke (width 0) (type default) (color 0 0 0 0))
    (uuid b90ac68d-fd97-4686-85c7-a191a2ceab55)
  )
  (polyline (pts (xy 88.9 91.44) (xy 88.9 93.98))
    (stroke (width 0) (type default) (color 0 0 0 0))
    (uuid b97d6691-ef1f-4021-9a45-b6350942842f)
  )

  (wire (pts (xy 243.84 97.79) (xy 246.38 97.79))
    (stroke (width 0) (type default) (color 0 0 0 0))
    (uuid ba8215ea-b533-45fd-a457-f07237bb3d27)
  )
  (wire (pts (xy 77.47 166.37) (xy 81.28 166.37))
    (stroke (width 0) (type default) (color 0 0 0 0))
    (uuid bd0bcdc3-e506-40b8-9d7d-34790f71dcf5)
  )
  (wire (pts (xy 198.12 69.85) (xy 198.12 67.31))
    (stroke (width 0) (type default) (color 0 0 0 0))
    (uuid bed30624-8f27-47ab-8fac-e91528899339)
  )
  (wire (pts (xy 91.44 166.37) (xy 95.25 166.37))
    (stroke (width 0) (type default) (color 0 0 0 0))
    (uuid bf709803-4d4f-4339-b1c6-1b1dd9ed8ffe)
  )
  (wire (pts (xy 86.36 144.78) (xy 86.36 147.32))
    (stroke (width 0) (type default) (color 0 0 0 0))
    (uuid c1cb370d-1add-4090-92fc-93c3b7218631)
  )
  (wire (pts (xy 259.08 92.71) (xy 280.67 92.71))
    (stroke (width 0) (type default) (color 0 0 0 0))
    (uuid c37dcd1e-d55c-4ea2-9efb-cab1bfceffbc)
  )
  (wire (pts (xy 31.75 140.97) (xy 35.56 140.97))
    (stroke (width 0) (type default) (color 0 0 0 0))
    (uuid c41ccf92-1695-480e-8b22-7002b9afb2cb)
  )
  (polyline (pts (xy 17.78 127) (xy 17.78 128.27))
    (stroke (width 0) (type default) (color 0 0 0 0))
    (uuid c6d704f0-86e3-42c3-9061-d3da5727757b)
  )

  (wire (pts (xy 205.74 82.55) (xy 205.74 67.31))
    (stroke (width 0) (type default) (color 0 0 0 0))
    (uuid cad4b59e-c7b7-4e0b-bc6a-5ec3dcfd03e9)
  )
  (wire (pts (xy 111.76 100.33) (xy 115.57 100.33))
    (stroke (width 0) (type default) (color 0 0 0 0))
    (uuid d01282d0-415b-40ad-afa9-a6e190786177)
  )
  (wire (pts (xy 264.16 72.39) (xy 264.16 69.85))
    (stroke (width 0) (type default) (color 0 0 0 0))
    (uuid d0dbb2b2-8c68-42e1-ae68-d661cb4db8c0)
  )
  (wire (pts (xy 198.12 77.47) (xy 198.12 78.74))
    (stroke (width 0) (type default) (color 0 0 0 0))
    (uuid d51b5133-f0cf-4e25-ae0e-e186e0d70aa2)
  )
  (wire (pts (xy 243.84 113.03) (xy 246.38 113.03))
    (stroke (width 0) (type default) (color 0 0 0 0))
    (uuid d54e41b9-e9e5-4135-8b1b-a881b4f3d03e)
  )
  (wire (pts (xy 198.12 67.31) (xy 187.96 67.31))
    (stroke (width 0) (type default) (color 0 0 0 0))
    (uuid d573f43a-73b2-48ab-a504-60770557aef0)
  )
  (wire (pts (xy 57.15 62.23) (xy 60.96 62.23))
    (stroke (width 0) (type default) (color 0 0 0 0))
    (uuid d8618da9-ee7e-4c68-bdda-32b008b50b02)
  )
  (wire (pts (xy 68.58 29.21) (xy 68.58 31.75))
    (stroke (width 0) (type default) (color 0 0 0 0))
    (uuid dc7162f1-8faa-4667-81cd-6408ca95c217)
  )
  (wire (pts (xy 280.67 74.93) (xy 280.67 85.09))
    (stroke (width 0) (type default) (color 0 0 0 0))
    (uuid df6ff6ee-bae2-4876-894b-0afbc904d939)
  )
  (wire (pts (xy 187.96 64.77) (xy 187.96 67.31))
    (stroke (width 0) (type default) (color 0 0 0 0))
    (uuid e1b5ac9a-a8ec-4a63-94d5-79883d8f452c)
  )
  (wire (pts (xy 171.45 90.17) (xy 175.26 90.17))
    (stroke (width 0) (type default) (color 0 0 0 0))
    (uuid e1cc1378-5803-4578-a129-b1134aa7f359)
  )
  (wire (pts (xy 259.08 82.55) (xy 264.16 82.55))
    (stroke (width 0) (type default) (color 0 0 0 0))
    (uuid ea339424-6f32-486c-8fc3-a4e789a2dfb8)
  )
  (wire (pts (xy 259.08 97.79) (xy 264.16 97.79))
    (stroke (width 0) (type default) (color 0 0 0 0))
    (uuid ea65a5f6-5bc9-41b0-894f-ed649103eede)
  )
  (polyline (pts (xy 110.49 127) (xy 17.78 127))
    (stroke (width 0) (type default) (color 0 0 0 0))
    (uuid eaffb88b-4ffe-42bc-9483-6d8a8f8bdb25)
  )

  (wire (pts (xy 111.76 107.95) (xy 115.57 107.95))
    (stroke (width 0) (type default) (color 0 0 0 0))
    (uuid eb9b8843-ed14-4804-ad76-6130a624e35f)
  )
  (polyline (pts (xy 19.05 93.98) (xy 88.9 93.98))
    (stroke (width 0) (type default) (color 0 0 0 0))
    (uuid ec99ec23-c279-44c6-b6fa-df10fea97787)
  )

  (wire (pts (xy 195.58 92.71) (xy 200.66 92.71))
    (stroke (width 0) (type default) (color 0 0 0 0))
    (uuid ee280521-350b-409e-8cdb-8d642d9fa29a)
  )
  (wire (pts (xy 171.45 69.85) (xy 171.45 67.31))
    (stroke (width 0) (type default) (color 0 0 0 0))
    (uuid eedeea60-0a7e-4353-ac17-bc7239c4f8b3)
  )
  (wire (pts (xy 133.35 59.69) (xy 133.35 67.31))
    (stroke (width 0) (type default) (color 0 0 0 0))
    (uuid f475d9c6-208e-4d57-a1ab-9e089f525398)
  )
  (wire (pts (xy 229.87 118.11) (xy 246.38 118.11))
    (stroke (width 0) (type default) (color 0 0 0 0))
    (uuid f5047e27-05be-4a5f-a63c-250995cac355)
  )
  (wire (pts (xy 242.57 74.93) (xy 246.38 74.93))
    (stroke (width 0) (type default) (color 0 0 0 0))
    (uuid f692872c-f6d7-4c5f-99fe-d259ac9907b6)
  )
  (wire (pts (xy 66.04 66.04) (xy 66.04 68.58))
    (stroke (width 0) (type default) (color 0 0 0 0))
    (uuid f7161d64-a0dc-42e0-98d7-a0e878124a80)
  )
  (wire (pts (xy 140.97 102.87) (xy 143.51 102.87))
    (stroke (width 0) (type default) (color 0 0 0 0))
    (uuid fe2db74f-c49b-4b24-bc57-3737adcec6ad)
  )

  (text "Select if the Arduino \nor the RPi will be the \ncontroller of the I2C \nbus. Use shunt jumpers \non the lab - solder jumpers \nfor flight safety. "
    (at 20.32 57.15 0)
    (effects (font (size 1.27 1.27)) (justify left bottom))
    (uuid 3c5aae4d-15c9-4f99-8ad2-d87b20901c8f)
  )
  (text "Select which device \nwill control the servo motors."
    (at 49.53 133.35 0)
    (effects (font (size 1.27 1.27)) (justify left bottom))
    (uuid 50a733b6-e31e-481b-958c-210e0f797066)
  )
  (text "GPS_RX is the line from\nwhich the GPS received data,\nso it is connected to the TX\npin of the RPi"
    (at 238.76 129.54 0)
    (effects (font (size 1.27 1.27)) (justify left bottom))
    (uuid 6ecb8453-31ae-4015-b4f8-e1caf6a6030b)
  )
  (text "Logic Level Shifter" (at 176.53 59.69 0)
    (effects (font (size 1.27 1.27)) (justify left bottom))
    (uuid ec8a5668-59ce-4359-942f-f1b972c859b7)
  )

  (label "SPI_MOSI_ARD" (at 171.45 92.71 180)
    (effects (font (size 1.27 1.27)) (justify right bottom))
    (uuid 0334579e-d04b-4a2c-a910-bfae35dd71fe)
  )
  (label "SERVO_2_ARD" (at 31.75 166.37 180)
    (effects (font (size 1.27 1.27)) (justify right bottom))
    (uuid 0ac7f897-2070-442e-84db-90afa53b07cb)
  )
  (label "SERVO_2_RPI" (at 243.84 110.49 180)
    (effects (font (size 1.27 1.27)) (justify right bottom))
    (uuid 150877aa-0a3a-4d32-bbd4-9b0e1b56090f)
  )
  (label "SERVO_3_ARD" (at 77.47 140.97 180)
    (effects (font (size 1.27 1.27)) (justify right bottom))
    (uuid 15d7253e-5f50-4592-b0b0-14913d4012c4)
  )
  (label "SERVO_2_RPI" (at 49.53 166.37 0)
    (effects (font (size 1.27 1.27)) (justify left bottom))
    (uuid 176f5571-16f2-4fcd-9b67-710933745953)
  )
  (label "SDA_RPI" (at 74.93 44.45 0)
    (effects (font (size 1.27 1.27)) (justify left bottom))
    (uuid 1bc34a00-69a9-4768-9421-2bfc63fed366)
  )
  (label "SERVO_1_RPI" (at 95.25 166.37 0)
    (effects (font (size 1.27 1.27)) (justify left bottom))
    (uuid 2200df9a-494a-4f8b-8cb0-5c21afaf2ef6)
  )
  (label "SCL_RPI" (at 68.58 87.63 0)
    (effects (font (size 1.27 1.27)) (justify left bottom))
    (uuid 22e7e1cc-7e88-4975-b3fc-0cf952b7e602)
  )
  (label "SERVO_2_ARD" (at 111.76 92.71 180)
    (effects (font (size 1.27 1.27)) (justify right bottom))
    (uuid 25700189-bfb4-4ac0-bfa2-e57dbedcf717)
  )
  (label "RPI_RUNS_ARD" (at 111.76 87.63 180)
    (effects (font (size 1.27 1.27)) (justify right bottom))
    (uuid 280f6455-83c3-4b9b-b58b-87e18c68a13f)
  )
  (label "SPI_SCK_RPI" (at 243.84 97.79 180)
    (effects (font (size 1.27 1.27)) (justify right bottom))
    (uuid 32390f5a-352b-4876-9b7f-fc06b5401d7a)
  )
  (label "CS_RPI" (at 200.66 85.09 0)
    (effects (font (size 1.27 1.27)) (justify left bottom))
    (uuid 34df93e0-ebaa-4e5b-bb60-9810004dcadd)
  )
  (label "SPI_MOSI_RPI" (at 200.66 92.71 0)
    (effects (font (size 1.27 1.27)) (justify left bottom))
    (uuid 359cde88-e1cc-4e1c-9534-269e33f0f8f8)
  )
  (label "RPI_RUNS_ARD" (at 171.45 95.25 180)
    (effects (font (size 1.27 1.27)) (justify right bottom))
    (uuid 3ac50454-9185-4c8e-b229-215af509eb77)
  )
  (label "SERVO_4_RPI" (at 49.53 140.97 0)
    (effects (font (size 1.27 1.27)) (justify left bottom))
    (uuid 443629f4-0a2d-41a4-a71e-9e38e1d7d0bb)
  )
  (label "SERVO_1_RPI" (at 243.84 113.03 180)
    (effects (font (size 1.27 1.27)) (justify right bottom))
    (uuid 48b7cea9-dd61-45d0-8286-dd575edfb486)
  )
  (label "SPI_MISO_RPI" (at 200.66 90.17 0)
    (effects (font (size 1.27 1.27)) (justify left bottom))
    (uuid 59c05ced-aafb-46ce-9091-9dd731293ed2)
  )
  (label "SERVO_3_RPI" (at 264.16 107.95 0)
    (effects (font (size 1.27 1.27)) (justify left bottom))
    (uuid 5c51d4d7-b432-42c1-8086-b4cfce498694)
  )
  (label "SPI_MISO_RPI" (at 243.84 95.25 180)
    (effects (font (size 1.27 1.27)) (justify right bottom))
    (uuid 5e28fca1-d39b-4233-93a9-26461c24bd2e)
  )
  (label "SERVO_1_ARD" (at 111.76 100.33 180)
    (effects (font (size 1.27 1.27)) (justify right bottom))
    (uuid 5ec5d8fb-f41b-4682-acb4-3e2fef19db46)
  )
  (label "SPI_MISO_ARD" (at 171.45 90.17 180)
    (effects (font (size 1.27 1.27)) (justify right bottom))
    (uuid 6f6f1ab9-4031-4a45-849f-5f2194505625)
  )
  (label "SDA_RPI" (at 68.58 31.75 0)
    (effects (font (size 1.27 1.27)) (justify left bottom))
    (uuid 731de8f9-7c21-4a5e-93e6-2466de5b2bcb)
  )
  (label "SERVO_4_ARD" (at 111.76 85.09 180)
    (effects (font (size 1.27 1.27)) (justify right bottom))
    (uuid 7b43f3b8-d080-48d7-9279-6bcfafd4da0d)
  )
  (label "SPI_SCK_ARD" (at 111.76 110.49 180)
    (effects (font (size 1.27 1.27)) (justify right bottom))
    (uuid 7cdf698d-c893-417e-bc8a-b1bc64c116a4)
  )
  (label "SCL_ARDUINO" (at 63.5 87.63 180)
    (effects (font (size 1.27 1.27)) (justify right bottom))
    (uuid 80014a06-833d-4efb-90a8-2f5ba9d4afad)
  )
  (label "SPI_MOSI_RPI" (at 243.84 92.71 180)
    (effects (font (size 1.27 1.27)) (justify right bottom))
    (uuid 821167fa-1976-4915-9bbf-420f85ab731b)
  )
  (label "CS_ARDUINO" (at 111.76 102.87 180)
    (effects (font (size 1.27 1.27)) (justify right bottom))
    (uuid 8596352e-9774-41e9-92dc-fb61b374de6c)
  )
  (label "SDA_ARDUINO" (at 63.5 31.75 180)
    (effects (font (size 1.27 1.27)) (justify right bottom))
    (uuid 87dc822a-1f20-486d-badb-b00c3143549f)
  )
  (label "CS_ARDUINO" (at 171.45 85.09 180)
    (effects (font (size 1.27 1.27)) (justify right bottom))
    (uuid 9539eac4-2ac7-4a45-8303-0a58fef24da9)
  )
  (label "SERVO_1_ARD" (at 77.47 166.37 180)
    (effects (font (size 1.27 1.27)) (justify right bottom))
    (uuid 9da0eee9-cb65-4374-baad-1223ce8d182b)
  )
  (label "SCL_RPI" (at 242.57 74.93 180)
    (effects (font (size 1.27 1.27)) (justify right bottom))
    (uuid 9db38285-014f-4a00-9911-7603995f491f)
  )
  (label "CS_RPI" (at 264.16 97.79 0)
    (effects (font (size 1.27 1.27)) (justify left bottom))
    (uuid a2f1dd6f-750f-4472-b084-db9db0541f0b)
  )
  (label "SERVO_4_ARD" (at 31.75 140.97 180)
    (effects (font (size 1.27 1.27)) (justify right bottom))
    (uuid a7acbc06-a35f-47bb-8fe9-a75b072a864d)
  )
  (label "SCL_RPI" (at 74.93 62.23 0)
    (effects (font (size 1.27 1.27)) (justify left bottom))
    (uuid b2849b68-d3be-4c19-930c-e5624cfe332f)
  )
  (label "SPI_SCK_ARD" (at 171.45 87.63 180)
    (effects (font (size 1.27 1.27)) (justify right bottom))
    (uuid b7819e21-4ba0-424f-8d45-d770ac1a8124)
  )
  (label "RPI_RUNS_RPI" (at 264.16 87.63 0)
    (effects (font (size 1.27 1.27)) (justify left bottom))
    (uuid bd7637dd-d0eb-4944-9df2-61b54c5cd43d)
  )
  (label "RPI_RUNS_RPI" (at 200.66 95.25 0)
    (effects (font (size 1.27 1.27)) (justify left bottom))
    (uuid c7392d6d-4e7b-4abe-a65e-f47f7bdecfa5)
  )
  (label "SDA_RPI" (at 242.57 72.39 180)
    (effects (font (size 1.27 1.27)) (justify right bottom))
    (uuid cdf02fa8-a2be-4031-b83f-f0abddab17c4)
  )
  (label "SPI_MOSI_ARD" (at 111.76 105.41 180)
    (effects (font (size 1.27 1.27)) (justify right bottom))
    (uuid d3271c1c-7387-4b91-8a3d-71014b2bced7)
  )
  (label "SERVO_4_RPI" (at 264.16 82.55 0)
    (effects (font (size 1.27 1.27)) (justify left bottom))
    (uuid e21f65a2-f9c3-4098-ad48-f34af80482df)
  )
  (label "SDA_ARDUINO" (at 57.15 44.45 180)
    (effects (font (size 1.27 1.27)) (justify right bottom))
    (uuid e4ba5a4c-50ed-4810-bf5c-f441a44fcf2e)
  )
  (label "SPI_MISO_ARD" (at 111.76 107.95 180)
    (effects (font (size 1.27 1.27)) (justify right bottom))
    (uuid e5acb7ba-2928-4bf8-b785-8ae44bfaf157)
  )
  (label "SERVO_3_ARD" (at 111.76 90.17 180)
    (effects (font (size 1.27 1.27)) (justify right bottom))
    (uuid e821cec3-dbf8-4a6d-89da-0c7ddeee2d28)
  )
  (label "SDA_ARDUINO" (at 143.51 102.87 0)
    (effects (font (size 1.27 1.27)) (justify left bottom))
    (uuid eedc078f-9464-4d2b-948a-a71f78a35992)
  )
  (label "SERVO_3_RPI" (at 95.25 140.97 0)
    (effects (font (size 1.27 1.27)) (justify left bottom))
    (uuid f11c8a72-b0e7-4315-90ec-86ca045020b5)
  )
  (label "SCL_ARDUINO" (at 57.15 62.23 180)
    (effects (font (size 1.27 1.27)) (justify right bottom))
    (uuid f2bcb677-b906-46e8-a7d0-806f327b15ca)
  )
  (label "SCL_ARDUINO" (at 143.51 105.41 0)
    (effects (font (size 1.27 1.27)) (justify left bottom))
    (uuid f2eba3d0-6b09-4a9e-bb1e-84fba106eb8c)
  )
  (label "SPI_SCK_RPI" (at 200.66 87.63 0)
    (effects (font (size 1.27 1.27)) (justify left bottom))
    (uuid fe96fe1b-b363-45b4-978d-d25617729148)
  )

  (hierarchical_label "SERVO_2" (shape output) (at 40.64 172.72 270)
    (effects (font (size 1.27 1.27)) (justify right))
    (uuid 217f6938-2a34-46dd-9b3b-ff4bb72fdd16)
  )
  (hierarchical_label "SDA" (shape bidirectional) (at 66.04 50.8 270)
    (effects (font (size 1.27 1.27)) (justify right))
    (uuid 5bcb492a-e5a5-4a9f-b962-6943769653f9)
  )
  (hierarchical_label "XBEE_RX" (shape output) (at 264.16 77.47 0)
    (effects (font (size 1.27 1.27)) (justify left))
    (uuid 7d1580b9-e5db-4458-bb4d-989f588ebed0)
  )
  (hierarchical_label "SCL" (shape bidirectional) (at 66.04 87.63 270)
    (effects (font (size 1.27 1.27)) (justify right))
    (uuid a62bfad0-133d-428e-957a-40c0f3a1435c)
  )
  (hierarchical_label "SDA" (shape bidirectional) (at 66.04 31.75 270)
    (effects (font (size 1.27 1.27)) (justify right))
    (uuid c421d40c-1ac4-47fd-837f-90076e21dd48)
  )
  (hierarchical_label "SERVO_3" (shape output) (at 86.36 147.32 270)
    (effects (font (size 1.27 1.27)) (justify right))
    (uuid cee68776-3485-4621-b6be-14a194a7e834)
  )
  (hierarchical_label "SERVO_4" (shape output) (at 40.64 147.32 270)
    (effects (font (size 1.27 1.27)) (justify right))
    (uuid d7fedfae-c711-4a1a-9476-8ca01d215fcc)
  )
  (hierarchical_label "SERVO_1" (shape output) (at 86.36 172.72 270)
    (effects (font (size 1.27 1.27)) (justify right))
    (uuid dc55d78e-22c3-41d4-aaeb-836abebfb36e)
  )
  (hierarchical_label "SCL" (shape bidirectional) (at 66.04 68.58 270)
    (effects (font (size 1.27 1.27)) (justify right))
    (uuid dd0f1c62-c6d4-4133-b42f-0284c33939b3)
  )
  (hierarchical_label "XBEE_TX" (shape input) (at 264.16 80.01 0)
    (effects (font (size 1.27 1.27)) (justify left))
    (uuid e98ff514-bf57-47b4-833e-9dba60b5de4f)
  )

  (symbol (lib_id "Jumper:SolderJumper_3_Open") (at 66.04 44.45 0) (unit 1)
    (in_bom yes) (on_board yes)
    (uuid 04dca3ad-eb85-431c-b742-4ac85e064e00)
    (property "Reference" "JP403" (id 0) (at 66.04 39.37 0))
    (property "Value" "SolderJumper_3_Open" (id 1) (at 66.04 41.91 0))
    (property "Footprint" "Jumper:SolderJumper-3_P1.3mm_Open_Pad1.0x1.5mm" (id 2) (at 66.04 44.45 0)
      (effects (font (size 1.27 1.27)) hide)
    )
    (property "Datasheet" "~" (id 3) (at 66.04 44.45 0)
      (effects (font (size 1.27 1.27)) hide)
    )
    (pin "1" (uuid 6becdf84-f3e2-43f7-8d3f-c42f5a5ee206))
    (pin "2" (uuid 4eecb89c-602a-405a-9581-c7de48f1bfea))
    (pin "3" (uuid 50fbf6cc-85f4-46c7-991c-01ed4ce42876))
  )

  (symbol (lib_id "power:GND") (at 128.27 122.555 0) (unit 1)
    (in_bom yes) (on_board yes)
    (uuid 0c1c9e21-d786-4d2e-b35d-6920823004bc)
    (property "Reference" "#PWR0401" (id 0) (at 128.27 128.905 0)
      (effects (font (size 1.27 1.27)) hide)
    )
    (property "Value" "GND" (id 1) (at 129.54 127 0)
      (effects (font (size 1.27 1.27)) (justify right))
    )
    (property "Footprint" "" (id 2) (at 128.27 122.555 0)
      (effects (font (size 1.27 1.27)) hide)
    )
    (property "Datasheet" "" (id 3) (at 128.27 122.555 0)
      (effects (font (size 1.27 1.27)) hide)
    )
    (pin "1" (uuid c1698e06-d2e2-4f2a-a808-43c8b78fb84f))
  )

  (symbol (lib_id "power:GND") (at 185.42 116.84 0) (unit 1)
    (in_bom yes) (on_board yes)
    (uuid 0d2a9636-4275-475f-bb0d-10d4a1c90dbc)
    (property "Reference" "#PWR0405" (id 0) (at 185.42 123.19 0)
      (effects (font (size 1.27 1.27)) hide)
    )
    (property "Value" "GND" (id 1) (at 187.96 120.65 0)
      (effects (font (size 1.27 1.27)) (justify right))
    )
    (property "Footprint" "" (id 2) (at 185.42 116.84 0)
      (effects (font (size 1.27 1.27)) hide)
    )
    (property "Datasheet" "" (id 3) (at 185.42 116.84 0)
      (effects (font (size 1.27 1.27)) hide)
    )
    (pin "1" (uuid 2c227041-1bdb-4835-9f59-af824809e492))
  )

  (symbol (lib_id "Logic_LevelTranslator:TXB0108DQSR") (at 185.42 92.71 0) (mirror y) (unit 1)
    (in_bom yes) (on_board yes) (fields_autoplaced)
    (uuid 2ef35386-4d55-40a2-a398-dc3cfa01a7d3)
    (property "Reference" "U402" (id 0) (at 185.9406 110.49 0)
      (effects (font (size 1.27 1.27)) (justify right))
    )
    (property "Value" "TXB0108DQSR" (id 1) (at 185.9406 113.03 0)
      (effects (font (size 1.27 1.27)) (justify right))
    )
    (property "Footprint" "Package_SON:USON-20_2x4mm_P0.4mm" (id 2) (at 185.42 111.76 0)
      (effects (font (size 1.27 1.27)) hide)
    )
    (property "Datasheet" "http://www.ti.com/lit/ds/symlink/txb0108.pdf" (id 3) (at 185.42 95.25 0)
      (effects (font (size 1.27 1.27)) hide)
    )
    (property "Mfr." "Texas Instruments" (id 4) (at 185.42 92.71 0)
      (effects (font (size 1.27 1.27)) hide)
    )
    (property "Mfr. No." "TXB0108DQSR " (id 5) (at 185.42 92.71 0)
      (effects (font (size 1.27 1.27)) hide)
    )
    (pin "1" (uuid 8a23b5d6-b4ee-4520-962d-6d3ee4ae5f26))
    (pin "10" (uuid 906bb77d-ea32-44dc-8510-5eafb58e9673))
    (pin "11" (uuid c4d48fe6-7ac0-477b-aaf5-5ddf12feba7c))
    (pin "12" (uuid f7f4c969-5597-4778-ae1c-1225ce567758))
    (pin "13" (uuid 87cc7662-33bc-4dc6-ba8c-fb0af1e6764e))
    (pin "14" (uuid cb51bedd-2a80-4d86-bced-7f582d953451))
    (pin "15" (uuid 316f776b-32a3-4c5e-9e39-df74cf5ff6d3))
    (pin "16" (uuid 979cbe0d-1015-4ec0-8770-54f0496fd98c))
    (pin "17" (uuid 7dc1a259-2f48-4783-8c52-78a60e25dc04))
    (pin "18" (uuid 6524a299-2fa2-4375-9f36-3b41fd29ce52))
    (pin "19" (uuid caaf1b23-25e7-48f2-9786-f1690529567c))
    (pin "2" (uuid 32043872-145b-4137-b657-d5579b2eff37))
    (pin "20" (uuid 6e233c7f-41b0-488c-bfd4-ade197d7c025))
    (pin "3" (uuid c4bea283-f501-469a-937d-10df4b31e8fd))
    (pin "4" (uuid 3c8bd413-63e8-495c-9764-b9fc6f1d21e8))
    (pin "5" (uuid 0f2d322a-8a9c-4aa1-a194-105d4faa8caa))
    (pin "6" (uuid 49ebf2b9-37ce-46c4-bf0c-81e3bde0ab5a))
    (pin "7" (uuid 15a4e205-af30-4b9b-9583-d540116a0f2c))
    (pin "8" (uuid 250ed118-20b4-4773-b34b-84a9c1b1ce2e))
    (pin "9" (uuid ec0f2b24-aab3-4892-a001-064c68cf9e3d))
  )

  (symbol (lib_id "Jumper:SolderJumper_3_Open") (at 40.64 166.37 0) (unit 1)
    (in_bom yes) (on_board yes)
    (uuid 2fac3fdd-de01-49e6-af04-18180e8adbaa)
    (property "Reference" "JP402" (id 0) (at 40.64 161.29 0))
    (property "Value" "SJ_3_Open" (id 1) (at 40.64 163.83 0))
    (property "Footprint" "Jumper:SolderJumper-3_P1.3mm_Open_Pad1.0x1.5mm" (id 2) (at 40.64 166.37 0)
      (effects (font (size 1.27 1.27)) hide)
    )
    (property "Datasheet" "~" (id 3) (at 40.64 166.37 0)
      (effects (font (size 1.27 1.27)) hide)
    )
    (pin "1" (uuid 76abd028-2505-456e-9c1d-86a704fa9431))
    (pin "2" (uuid 612cc8b5-cacb-421d-ae58-df46b3b14558))
    (pin "3" (uuid 44858ceb-b21c-4efa-85d3-b2fd89d1df18))
  )

  (symbol (lib_id "power:+3V3") (at 187.96 64.77 0) (unit 1)
    (in_bom yes) (on_board yes)
    (uuid 3950d9f7-b426-47df-b889-7c8c59c3bf88)
    (property "Reference" "#PWR0406" (id 0) (at 187.96 68.58 0)
      (effects (font (size 1.27 1.27)) hide)
    )
    (property "Value" "+3V3" (id 1) (at 191.77 62.23 0))
    (property "Footprint" "" (id 2) (at 187.96 64.77 0)
      (effects (font (size 1.27 1.27)) hide)
    )
    (property "Datasheet" "" (id 3) (at 187.96 64.77 0)
      (effects (font (size 1.27 1.27)) hide)
    )
    (pin "1" (uuid 5c183168-f96c-4db8-b0f8-9a1c09480b8d))
  )

  (symbol (lib_id "power:+5V") (at 133.35 59.69 0) (unit 1)
    (in_bom yes) (on_board yes)
    (uuid 42648739-ca7c-42a3-83ec-f332e61dddba)
    (property "Reference" "#PWR0402" (id 0) (at 133.35 63.5 0)
      (effects (font (size 1.27 1.27)) hide)
    )
    (property "Value" "+5V" (id 1) (at 133.35 55.88 0)
      (effects (font (size 1.27 1.27)) (justify left))
    )
    (property "Footprint" "" (id 2) (at 133.35 59.69 0)
      (effects (font (size 1.27 1.27)) hide)
    )
    (property "Datasheet" "" (id 3) (at 133.35 59.69 0)
      (effects (font (size 1.27 1.27)) hide)
    )
    (pin "1" (uuid a3c21d62-592f-4ee3-8d27-df75696b9f27))
  )

  (symbol (lib_id "power:+5V") (at 182.88 64.77 0) (unit 1)
    (in_bom yes) (on_board yes)
    (uuid 4fb4d27d-0848-44dd-be97-86d2834b2f4a)
    (property "Reference" "#PWR0404" (id 0) (at 182.88 68.58 0)
      (effects (font (size 1.27 1.27)) hide)
    )
    (property "Value" "+5V" (id 1) (at 177.8 62.23 0)
      (effects (font (size 1.27 1.27)) (justify left))
    )
    (property "Footprint" "" (id 2) (at 182.88 64.77 0)
      (effects (font (size 1.27 1.27)) hide)
    )
    (property "Datasheet" "" (id 3) (at 182.88 64.77 0)
      (effects (font (size 1.27 1.27)) hide)
    )
    (pin "1" (uuid f21ecab3-132a-4497-9beb-e5f6cb416a18))
  )

  (symbol (lib_id "MCU_Module:Arduino_Nano_v3.x") (at 128.27 92.71 0) (unit 1)
    (in_bom yes) (on_board yes) (fields_autoplaced)
    (uuid 51f8a4e2-67a8-49d5-84b5-b9988cf38e08)
    (property "Reference" "U401" (id 0) (at 132.8294 118.11 0)
      (effects (font (size 1.27 1.27)) (justify left))
    )
    (property "Value" "Arduino_Nano_v3.x" (id 1) (at 132.8294 120.65 0)
      (effects (font (size 1.27 1.27)) (justify left))
    )
    (property "Footprint" "Module:Arduino_Nano" (id 2) (at 128.27 92.71 0)
      (effects (font (size 1.27 1.27) italic) hide)
    )
    (property "Datasheet" "" (id 3) (at 128.27 92.71 0)
      (effects (font (size 1.27 1.27)) hide)
    )
    (pin "1" (uuid 825434cd-6dd2-4355-a5bb-8c39e3e8ed06))
    (pin "10" (uuid 7c214535-5553-4d7c-9e04-a06f3b3503b0))
    (pin "11" (uuid 2f7b8550-5c41-4f23-b072-7af2d49e8e15))
    (pin "12" (uuid 6bef3321-5bf3-44fd-8eae-e23e5b0d967a))
    (pin "13" (uuid c1bb0968-f35c-49bd-bf6b-8f4949894fad))
    (pin "14" (uuid 92ad301d-ff66-4959-a65c-c5998185f534))
    (pin "15" (uuid a2dcf0a9-ee0f-460f-98f4-0ec9dba40b8f))
    (pin "16" (uuid 37e76997-735c-401a-8eaf-611a424bf9bc))
    (pin "17" (uuid e81a85d5-967a-47f7-a920-535526883ab7))
    (pin "18" (uuid eb90285e-4192-4eae-a319-8b3dd7964d08))
    (pin "19" (uuid 3edc5054-3d79-40e5-8374-36101381a6e2))
    (pin "2" (uuid 0ed74405-2499-415d-9e4d-d831168b419e))
    (pin "20" (uuid 9441365d-cdd6-4553-8ff2-988d086936d9))
    (pin "21" (uuid 975a2ed5-c3a9-400f-a141-bc7a691a5c55))
    (pin "22" (uuid 5d98914d-1801-43c8-96ca-19f222dbae40))
    (pin "23" (uuid 5dc56d43-162b-40f9-8dbd-ba25efb2f4cf))
    (pin "24" (uuid 3e1667d0-25e8-44c0-af55-7fd66178a644))
    (pin "25" (uuid b8c36979-df24-47a2-bed6-c8f771a76490))
    (pin "26" (uuid ff2460c6-5784-4c0f-ac3a-99536e92b844))
    (pin "27" (uuid 73a0eba6-a915-4abd-94f1-366b503907a7))
    (pin "28" (uuid c4f8b8b7-31e2-4f43-9223-67247aebebc9))
    (pin "29" (uuid 51acc0f6-dbb5-4aaa-ad9c-08ac7a8f9c79))
    (pin "3" (uuid 06cfcd46-b704-4a3a-9108-6ffce6be1ac7))
    (pin "30" (uuid bfab5d6d-171a-4dcc-9737-266369a798be))
    (pin "4" (uuid 23568d63-eaa9-442f-a599-e1516c4c7089))
    (pin "5" (uuid cbf03142-7b6b-4c20-b3d8-c0f1fcfa763e))
    (pin "6" (uuid 2778b21d-7936-4283-979f-5366b56c324f))
    (pin "7" (uuid 5291d8ef-4000-4f60-a970-e79c8e977713))
    (pin "8" (uuid e54848cf-7587-409f-b9c4-ab825799aa30))
    (pin "9" (uuid b0f20902-5d69-4fa5-992e-a452fa012428))
  )

  (symbol (lib_id "Device:C") (at 198.12 73.66 0) (unit 1)
    (in_bom yes) (on_board yes)
    (uuid 52664e6c-c54b-4067-b367-4a14ef315b9e)
    (property "Reference" "C402" (id 0) (at 199.39 71.12 0)
      (effects (font (size 1.27 1.27)) (justify left))
    )
    (property "Value" "0u1" (id 1) (at 199.39 76.2 0)
      (effects (font (size 1.27 1.27)) (justify left))
    )
    (property "Footprint" "Capacitor_SMD:C_0603_1608Metric" (id 2) (at 199.0852 77.47 0)
      (effects (font (size 1.27 1.27)) hide)
    )
    (property "Datasheet" "https://gr.mouser.com/datasheet/2/212/KEM_C1002_X7R_SMD-1102033.pdf" (id 3) (at 198.12 73.66 0)
      (effects (font (size 1.27 1.27)) hide)
    )
    (property "Mfr." "KEMET " (id 4) (at 198.12 73.66 0)
      (effects (font (size 1.27 1.27)) hide)
    )
    (property "Mfr. No." "C0603C104M4RAC" (id 5) (at 198.12 73.66 0)
      (effects (font (size 1.27 1.27)) hide)
    )
    (pin "1" (uuid e1f34e8d-59d5-41ca-b822-179ca60c5757))
    (pin "2" (uuid 20068a69-8711-4b3c-a175-ba48e06a48d9))
  )

  (symbol (lib_id "Jumper:SolderJumper_3_Open") (at 86.36 166.37 0) (unit 1)
    (in_bom yes) (on_board yes)
    (uuid 5f57716a-1770-465c-bd5c-764e6a2f7c3e)
    (property "Reference" "JP406" (id 0) (at 86.36 161.29 0))
    (property "Value" "SJ_3_Open" (id 1) (at 86.36 163.83 0))
    (property "Footprint" "Jumper:SolderJumper-3_P1.3mm_Open_Pad1.0x1.5mm" (id 2) (at 86.36 166.37 0)
      (effects (font (size 1.27 1.27)) hide)
    )
    (property "Datasheet" "~" (id 3) (at 86.36 166.37 0)
      (effects (font (size 1.27 1.27)) hide)
    )
    (pin "1" (uuid 11f149e9-f20e-436e-8570-70f87282d96d))
    (pin "2" (uuid 0a5a8a9e-f724-480d-9e24-e2f0fd72aaf4))
    (pin "3" (uuid 46a17313-3b78-4a84-8f45-a37ea5833dad))
  )

  (symbol (lib_id "power:GND") (at 198.12 78.74 0) (unit 1)
    (in_bom yes) (on_board yes)
    (uuid 63d4b818-49e3-46db-89cd-7a69febc4215)
    (property "Reference" "#PWR0407" (id 0) (at 198.12 85.09 0)
      (effects (font (size 1.27 1.27)) hide)
    )
    (property "Value" "GND" (id 1) (at 204.47 80.01 0)
      (effects (font (size 1.27 1.27)) (justify right))
    )
    (property "Footprint" "" (id 2) (at 198.12 78.74 0)
      (effects (font (size 1.27 1.27)) hide)
    )
    (property "Datasheet" "" (id 3) (at 198.12 78.74 0)
      (effects (font (size 1.27 1.27)) hide)
    )
    (pin "1" (uuid d6ea4c19-dc5d-4b10-bf41-c21db5d9a17b))
  )

  (symbol (lib_id "Connector_Generic:Conn_01x03") (at 66.04 24.13 90) (unit 1)
    (in_bom yes) (on_board yes) (fields_autoplaced)
    (uuid 675b2dff-a519-40bf-92aa-64d4d558f3b9)
    (property "Reference" "J401" (id 0) (at 71.12 22.8599 90)
      (effects (font (size 1.27 1.27)) (justify right))
    )
    (property "Value" "Conn_01x03" (id 1) (at 71.12 25.3999 90)
      (effects (font (size 1.27 1.27)) (justify right))
    )
    (property "Footprint" "Connector_PinHeader_2.54mm:PinHeader_1x03_P2.54mm_Vertical" (id 2) (at 66.04 24.13 0)
      (effects (font (size 1.27 1.27)) hide)
    )
    (property "Datasheet" "~" (id 3) (at 66.04 24.13 0)
      (effects (font (size 1.27 1.27)) hide)
    )
    (pin "1" (uuid 8e77a146-6df4-42a8-9b49-d5e41c3afbdf))
    (pin "2" (uuid 5650a7ea-4beb-4c22-93b0-a4e76439ce9f))
    (pin "3" (uuid c38c8d5c-c081-4d0c-b2ee-1e54a5f20c18))
  )

  (symbol (lib_id "Jumper:SolderJumper_3_Open") (at 66.04 62.23 0) (unit 1)
    (in_bom yes) (on_board yes)
    (uuid 6d451c4a-5702-483d-be6b-51116bc3dd76)
    (property "Reference" "JP404" (id 0) (at 66.04 57.15 0))
    (property "Value" "SolderJumper_3_Open" (id 1) (at 66.04 59.69 0))
    (property "Footprint" "Jumper:SolderJumper-3_P1.3mm_Open_Pad1.0x1.5mm" (id 2) (at 66.04 62.23 0)
      (effects (font (size 1.27 1.27)) hide)
    )
    (property "Datasheet" "~" (id 3) (at 66.04 62.23 0)
      (effects (font (size 1.27 1.27)) hide)
    )
    (pin "1" (uuid 2041c0be-6623-4729-85a5-192e2fff9808))
    (pin "2" (uuid ea0fc003-f615-4bcd-9954-d1c2dc53ca15))
    (pin "3" (uuid cc6541e0-5b29-4657-920d-f8f94268d7be))
  )

  (symbol (lib_id "power:GND") (at 229.87 121.92 0) (unit 1)
    (in_bom yes) (on_board yes)
    (uuid 70342ebd-4e23-43b5-8d3d-3bd6593ad721)
    (property "Reference" "#PWR0409" (id 0) (at 229.87 128.27 0)
      (effects (font (size 1.27 1.27)) hide)
    )
    (property "Value" "GND" (id 1) (at 232.41 125.73 0)
      (effects (font (size 1.27 1.27)) (justify right))
    )
    (property "Footprint" "" (id 2) (at 229.87 121.92 0)
      (effects (font (size 1.27 1.27)) hide)
    )
    (property "Datasheet" "" (id 3) (at 229.87 121.92 0)
      (effects (font (size 1.27 1.27)) hide)
    )
    (pin "1" (uuid d85067e1-4c97-4013-93af-ea7194d7bd48))
  )

  (symbol (lib_id "power:GND") (at 219.71 87.63 0) (unit 1)
    (in_bom yes) (on_board yes)
    (uuid 81110d25-5dba-46ab-aece-f020527dbf41)
    (property "Reference" "#PWR0408" (id 0) (at 219.71 93.98 0)
      (effects (font (size 1.27 1.27)) hide)
    )
    (property "Value" "GND" (id 1) (at 224.79 87.63 0)
      (effects (font (size 1.27 1.27)) (justify right))
    )
    (property "Footprint" "" (id 2) (at 219.71 87.63 0)
      (effects (font (size 1.27 1.27)) hide)
    )
    (property "Datasheet" "" (id 3) (at 219.71 87.63 0)
      (effects (font (size 1.27 1.27)) hide)
    )
    (pin "1" (uuid f7e7ba8f-976b-4517-85c5-778dd551d624))
  )

  (symbol (lib_id "payload:Connector_Generic_Conn_02x20_Odd_Even-raspberrypi_zerow_uhat-cache") (at 251.46 92.71 0) (unit 1)
    (in_bom yes) (on_board yes)
    (uuid 858f12ac-1d42-442c-968a-52f50ed1caa1)
    (property "Reference" "J403" (id 0) (at 252.73 64.3382 0))
    (property "Value" "RPi 3 B+" (id 1) (at 252.73 66.04 0))
    (property "Footprint" "sky_runner:MODULE_RASPBERRY_PI_3_MODEL_B+" (id 2) (at 251.46 92.71 0)
      (effects (font (size 1.27 1.27)) hide)
    )
    (property "Datasheet" "" (id 3) (at 251.46 92.71 0)
      (effects (font (size 1.27 1.27)) hide)
    )
    (pin "1" (uuid 9cc5129f-868a-4f84-9866-ecc192c8329b))
    (pin "10" (uuid 056a3a8d-dd0e-4ad6-9ee7-f9f3c83571f2))
    (pin "11" (uuid ddbfbf66-e8fc-4292-ac81-d5ebfd547190))
    (pin "12" (uuid d969d1ee-9c0f-4ca9-a310-49ba60a0ab55))
    (pin "13" (uuid 45b9cce2-46f5-49af-b887-295799b3a2af))
    (pin "14" (uuid edf74bc7-7ac0-434d-ae6e-5c161ae8ad94))
    (pin "15" (uuid 92416daa-c594-45c2-8109-eaad5e4a2b39))
    (pin "16" (uuid 6919cedd-8bcc-4270-81a1-262739bb027a))
    (pin "17" (uuid 9d86a04e-32ac-45b7-9f88-e734564ecb74))
    (pin "18" (uuid 987e1c4f-3f9d-46b9-a8fe-489c55b1719b))
    (pin "19" (uuid 0e34e076-8db4-4b7d-b0a8-2a586bb6b62a))
    (pin "2" (uuid de85eafd-55d7-4f64-93d1-ad7e53577dee))
    (pin "20" (uuid b8f871d7-10b4-417f-bd9e-db05dab178a6))
    (pin "21" (uuid 820a41c0-15d3-43d7-836d-2b2569e578f9))
    (pin "22" (uuid ffa443d7-2153-4a88-b203-007f3e5109dd))
    (pin "23" (uuid 6c65f90c-0880-4346-adff-9b07174dce3e))
    (pin "24" (uuid acff16eb-4870-4811-bb9b-6d74e08488df))
    (pin "25" (uuid 1c93b054-b7f8-4d7c-ac0f-49b994f58b24))
    (pin "26" (uuid 142ff44f-34c3-4d5a-9804-c3c5a741a6b4))
    (pin "27" (uuid 47d716b3-77cd-44fb-9032-18f34d8fab1f))
    (pin "28" (uuid b3bfd719-37fa-424f-86e2-ea8cd93acafb))
    (pin "29" (uuid 3d87d540-75a9-4693-bb3c-ef2a02972f48))
    (pin "3" (uuid cbc133e6-9d21-484f-9270-1b902d2a0ce6))
    (pin "30" (uuid 8c4d1fa0-a974-4495-8800-165837a1ac11))
    (pin "31" (uuid 06d5c5f7-18ae-40ca-b604-e46dfdced65c))
    (pin "32" (uuid f3f5ba7b-7365-495e-b6ac-d058713e0bf3))
    (pin "33" (uuid 02ff5d34-494f-4e99-96ec-196035688fde))
    (pin "34" (uuid 372454aa-43e3-49bd-8d97-ba7fb0dde3b2))
    (pin "35" (uuid 6a414f0e-5858-462f-8035-10e3e86221e9))
    (pin "36" (uuid e8a51c0c-80f0-4075-94dc-a22c97282b94))
    (pin "37" (uuid 569f4fbe-630c-4fc7-92e1-1b13e9bcb8b4))
    (pin "38" (uuid 31eb0ae2-a5cf-4b58-b0a9-b4fb77be3697))
    (pin "39" (uuid 081a3a88-d880-45de-acc7-6d2bcb7860bc))
    (pin "4" (uuid f468217a-7c38-4340-a6f0-9936572a4d6d))
    (pin "40" (uuid f4f8c556-e8a4-40f1-aa4f-afde5390f0b4))
    (pin "5" (uuid 16980b1d-894e-4e5f-a2b2-bac9a1ba3c5b))
    (pin "6" (uuid 3bed7ca8-a578-4d80-ae7e-1a777b03281b))
    (pin "7" (uuid 19c4e4a0-98e5-4dda-93d0-89a16bdf7f02))
    (pin "8" (uuid 7b719377-731a-4773-a514-a63b6155d57b))
    (pin "9" (uuid 672e8cc2-dd4d-471f-85b8-33d90017ce48))
  )

  (symbol (lib_id "Device:C") (at 171.45 73.66 0) (unit 1)
    (in_bom yes) (on_board yes)
    (uuid 8eca39a0-cd4a-45f1-a2bf-15e2db04b46e)
    (property "Reference" "C401" (id 0) (at 166.37 71.12 0)
      (effects (font (size 1.27 1.27)) (justify left))
    )
    (property "Value" "0u1" (id 1) (at 167.64 76.2 0)
      (effects (font (size 1.27 1.27)) (justify left))
    )
    (property "Footprint" "Capacitor_SMD:C_0603_1608Metric" (id 2) (at 172.4152 77.47 0)
      (effects (font (size 1.27 1.27)) hide)
    )
    (property "Datasheet" "https://gr.mouser.com/datasheet/2/212/KEM_C1002_X7R_SMD-1102033.pdf" (id 3) (at 171.45 73.66 0)
      (effects (font (size 1.27 1.27)) hide)
    )
    (property "Mfr." "KEMET " (id 4) (at 171.45 73.66 0)
      (effects (font (size 1.27 1.27)) hide)
    )
    (property "Mfr. No." "C0603C104M4RAC" (id 5) (at 171.45 73.66 0)
      (effects (font (size 1.27 1.27)) hide)
    )
    (pin "1" (uuid 5bbbf0f4-b3ee-4329-9916-98f0e8678ec7))
    (pin "2" (uuid c77d179d-bf2a-4232-bb30-94a1d4ab86fc))
  )

  (symbol (lib_id "Jumper:SolderJumper_3_Open") (at 86.36 140.97 0) (unit 1)
    (in_bom yes) (on_board yes)
    (uuid 9147a61b-509e-44c5-835c-8c05de63b354)
    (property "Reference" "JP405" (id 0) (at 86.36 135.89 0))
    (property "Value" "SJ_3_Open" (id 1) (at 86.36 138.43 0))
    (property "Footprint" "Jumper:SolderJumper-3_P1.3mm_Open_Pad1.0x1.5mm" (id 2) (at 86.36 140.97 0)
      (effects (font (size 1.27 1.27)) hide)
    )
    (property "Datasheet" "~" (id 3) (at 86.36 140.97 0)
      (effects (font (size 1.27 1.27)) hide)
    )
    (pin "1" (uuid ff454b89-0b77-4807-be8e-18c1d11253d5))
    (pin "2" (uuid 87e89f7a-1f32-4099-994c-f55819065adc))
    (pin "3" (uuid de33da55-caa4-4940-8fa3-bdf949d9535b))
  )

  (symbol (lib_id "power:GND") (at 280.67 113.03 0) (unit 1)
    (in_bom yes) (on_board yes)
    (uuid 9d3ddefe-3d73-43df-95c1-718888219286)
    (property "Reference" "#PWR0411" (id 0) (at 280.67 119.38 0)
      (effects (font (size 1.27 1.27)) hide)
    )
    (property "Value" "GND" (id 1) (at 283.21 116.84 0)
      (effects (font (size 1.27 1.27)) (justify right))
    )
    (property "Footprint" "" (id 2) (at 280.67 113.03 0)
      (effects (font (size 1.27 1.27)) hide)
    )
    (property "Datasheet" "" (id 3) (at 280.67 113.03 0)
      (effects (font (size 1.27 1.27)) hide)
    )
    (pin "1" (uuid 1df17cf7-7545-4b35-98c6-ca2bb8976ca1))
  )

  (symbol (lib_id "Jumper:SolderJumper_3_Open") (at 40.64 140.97 0) (unit 1)
    (in_bom yes) (on_board yes)
    (uuid b61629a9-7c00-41a4-b8f0-1e323dd28fa1)
    (property "Reference" "JP401" (id 0) (at 40.64 135.89 0))
    (property "Value" "SJ_3_Open" (id 1) (at 40.64 138.43 0))
    (property "Footprint" "Jumper:SolderJumper-3_P1.3mm_Open_Pad1.0x1.5mm" (id 2) (at 40.64 140.97 0)
      (effects (font (size 1.27 1.27)) hide)
    )
    (property "Datasheet" "~" (id 3) (at 40.64 140.97 0)
      (effects (font (size 1.27 1.27)) hide)
    )
    (pin "1" (uuid 00741b78-e1f2-47f5-9ec5-682c954e7e77))
    (pin "2" (uuid bb4b6a7e-649e-4fb8-9ec5-5632aba6a864))
    (pin "3" (uuid 06bcd18c-b916-450c-8b9e-12523112eba9))
  )

  (symbol (lib_id "Connector_Generic:Conn_01x03") (at 66.04 77.47 90) (unit 1)
    (in_bom yes) (on_board yes) (fields_autoplaced)
    (uuid ca1a4f14-c67c-47b1-9154-c9c9e01d3ea2)
    (property "Reference" "J402" (id 0) (at 71.12 76.1999 90)
      (effects (font (size 1.27 1.27)) (justify right))
    )
    (property "Value" "Conn_01x03" (id 1) (at 71.12 78.7399 90)
      (effects (font (size 1.27 1.27)) (justify right))
    )
    (property "Footprint" "Connector_PinHeader_2.54mm:PinHeader_1x03_P2.54mm_Vertical" (id 2) (at 66.04 77.47 0)
      (effects (font (size 1.27 1.27)) hide)
    )
    (property "Datasheet" "~" (id 3) (at 66.04 77.47 0)
      (effects (font (size 1.27 1.27)) hide)
    )
    (pin "1" (uuid 07592694-7be5-4387-8f43-67cc71813fad))
    (pin "2" (uuid 31f211d7-49b5-47c3-820d-9ae6999331d5))
    (pin "3" (uuid dd1c1268-79f2-4ef0-b39c-ba8394588a4e))
  )

  (symbol (lib_id "power:+5V") (at 264.16 62.23 0) (unit 1)
    (in_bom yes) (on_board yes)
    (uuid d2dfb27f-994e-4c2a-97fb-357fc632426b)
    (property "Reference" "#PWR0410" (id 0) (at 264.16 66.04 0)
      (effects (font (size 1.27 1.27)) hide)
    )
    (property "Value" "+5V" (id 1) (at 264.16 58.42 0)
      (effects (font (size 1.27 1.27)) (justify left))
    )
    (property "Footprint" "" (id 2) (at 264.16 62.23 0)
      (effects (font (size 1.27 1.27)) hide)
    )
    (property "Datasheet" "" (id 3) (at 264.16 62.23 0)
      (effects (font (size 1.27 1.27)) hide)
    )
    (pin "1" (uuid 289ba2cf-bb61-490b-97b5-7892567071a7))
  )

  (symbol (lib_id "power:GND") (at 171.45 78.74 0) (unit 1)
    (in_bom yes) (on_board yes)
    (uuid d4eed051-7dc8-4ad0-829c-fa70203e72b1)
    (property "Reference" "#PWR0403" (id 0) (at 171.45 85.09 0)
      (effects (font (size 1.27 1.27)) hide)
    )
    (property "Value" "GND" (id 1) (at 168.91 80.01 0)
      (effects (font (size 1.27 1.27)) (justify right))
    )
    (property "Footprint" "" (id 2) (at 171.45 78.74 0)
      (effects (font (size 1.27 1.27)) hide)
    )
    (property "Datasheet" "" (id 3) (at 171.45 78.74 0)
      (effects (font (size 1.27 1.27)) hide)
    )
    (pin "1" (uuid 755ecdc0-f81a-4e85-bf6e-38d4beb2d726))
  )

  (symbol (lib_id "Device:R") (at 213.36 82.55 90) (unit 1)
    (in_bom yes) (on_board yes)
    (uuid d80eab77-02a7-438c-9448-216846629b95)
    (property "Reference" "R401" (id 0) (at 213.36 77.47 90))
    (property "Value" "10k" (id 1) (at 213.36 80.01 90))
    (property "Footprint" "Resistor_SMD:R_0603_1608Metric" (id 2) (at 213.36 84.328 90)
      (effects (font (size 1.27 1.27)) hide)
    )
    (property "Datasheet" "https://gr.mouser.com/datasheet/2/315/Panasonic_Resistors_Thick_Film_Anti_Sulf_Anti_Surg-1825099.pdf" (id 3) (at 213.36 82.55 0)
      (effects (font (size 1.27 1.27)) hide)
    )
    (property "Mfr.:" "" (id 4) (at 213.36 82.55 90)
      (effects (font (size 1.27 1.27)) hide)
    )
    (property "Mfr. No:" "" (id 5) (at 213.36 82.55 90)
      (effects (font (size 1.27 1.27)) hide)
    )
    (property "Mfr. No." "ERJ-UP3J103V" (id 6) (at 213.36 82.55 0)
      (effects (font (size 1.27 1.27)) hide)
    )
    (property "Mfr." "Panasonic" (id 7) (at 213.36 82.55 0)
      (effects (font (size 1.27 1.27)) hide)
    )
    (pin "1" (uuid eb194682-42b3-461c-af66-2dbf89c8a170))
    (pin "2" (uuid 6bb73d55-4cbd-47dc-9424-f1f3abb9a197))
  )
)
