(footprint "axle_servo_base" (version 20211014) (generator pcbnew)
  (layer "F.Cu")
  (tedit 6246215E)
  (attr through_hole)
  (fp_text reference "H**" (at -7.747 0.889 90 unlocked) (layer "F.SilkS")
    (effects (font (size 1 1) (thickness 0.15)))
    (tstamp d257d806-2fef-4098-89d0-5f4eaf01a3b9)
  )
  (fp_text value "axle_servo_base" (at 0 16.383 unlocked) (layer "F.Fab")
    (effects (font (size 1 1) (thickness 0.15)))
    (tstamp 4769d5fe-3c28-4e3e-90de-86298e98223a)
  )
  (fp_text user "No components\nhere " (at 1.17408 0.419 90) (layer "Cmts.User")
    (effects (font (size 1.5 1.5) (thickness 0.3)))
    (tstamp 8c3858ab-15b2-483d-a9db-a3f099625633)
  )
  (fp_text user "${REFERENCE}" (at 4.508 -10.078) (layer "F.Fab")
    (effects (font (size 1 1) (thickness 0.15)))
    (tstamp 1d70f394-b2a7-47ea-9c80-cc301d38760c)
  )
  (fp_text user "${REFERENCE}" (at 0.508 10.922) (layer "F.Fab")
    (effects (font (size 1 1) (thickness 0.15)))
    (tstamp 210d0498-fb50-44e2-842f-b4674155377f)
  )
  (fp_text user "${REFERENCE}" (at 4.508 10.922) (layer "F.Fab")
    (effects (font (size 1 1) (thickness 0.15)))
    (tstamp 3fede8ba-d624-4ca4-b83c-867217b31982)
  )
  (fp_text user "${REFERENCE}" (at -3.492 10.922) (layer "F.Fab")
    (effects (font (size 1 1) (thickness 0.15)))
    (tstamp a3161d5b-3549-4de9-b93c-7088c8839c0f)
  )
  (fp_text user "${REFERENCE}" (at -3.492 -10.078) (layer "F.Fab")
    (effects (font (size 1 1) (thickness 0.15)))
    (tstamp c4390a62-a6e5-4c03-87f8-9d8cc2748e1e)
  )
  (fp_text user "${REFERENCE}" (at 0.508 -10.078) (layer "F.Fab")
    (effects (font (size 1 1) (thickness 0.15)))
    (tstamp d00a140c-eaa3-4d0c-be45-e19b2c72b697)
  )
  (fp_line (start -6.792 14.922) (end 7.208 14.922) (layer "F.SilkS") (width 0.2) (tstamp 60173bd6-096a-4505-b329-b080a613e187))
  (fp_line (start -6.792 -14.078) (end -6.792 14.922) (layer "F.SilkS") (width 0.2) (tstamp 61804232-6b6b-403c-8090-6b7d234e42cb))
  (fp_line (start 7.208 14.922) (end 7.208 -14.078) (layer "F.SilkS") (width 0.2) (tstamp b9cf3766-8c3c-4a23-9a56-aa82a04aade1))
  (fp_line (start 7.208 -14.078) (end -6.792 -14.078) (layer "F.SilkS") (width 0.2) (tstamp ff538bec-6218-4c88-a7f3-1b81bdf95136))
  (fp_circle (center 0.208 10.922) (end 2.108 10.922) (layer "Cmts.User") (width 0.15) (fill none) (tstamp 093b71d0-271c-4c46-84b9-9acd2042131f))
  (fp_circle (center 0.208 -10.078) (end 2.108 -10.078) (layer "Cmts.User") (width 0.15) (fill none) (tstamp 2b2d02d0-861e-484e-98af-76ad5ec10a19))
  (fp_circle (center -3.792 -10.078) (end -1.892 -10.078) (layer "Cmts.User") (width 0.15) (fill none) (tstamp 42e55c51-3305-4be3-8639-9bcc2b175329))
  (fp_circle (center -3.792 10.922) (end -1.892 10.922) (layer "Cmts.User") (width 0.15) (fill none) (tstamp 596059e2-b9d0-4541-865a-a8c547404802))
  (fp_circle (center 4.208 10.922) (end 6.108 10.922) (layer "Cmts.User") (width 0.15) (fill none) (tstamp a6edafa0-254d-4882-abb5-056508de14b6))
  (fp_circle (center 4.208 -10.078) (end 6.108 -10.078) (layer "Cmts.User") (width 0.15) (fill none) (tstamp b6b9120c-aff7-4e99-ac38-11afd6024ae2))
  (fp_circle (center 4.208 10.922) (end 6.358 10.922) (layer "F.CrtYd") (width 0.05) (fill none) (tstamp 812ef1b4-93da-4f5a-b255-ddaca3505057))
  (fp_circle (center 4.208 -10.078) (end 6.358 -10.078) (layer "F.CrtYd") (width 0.05) (fill none) (tstamp a10f3c06-baf8-43d0-9117-b4b6865904cc))
  (fp_circle (center 0.208 10.922) (end 2.358 10.922) (layer "F.CrtYd") (width 0.05) (fill none) (tstamp c58eb072-7fb0-4db3-93c6-5932257dbc94))
  (fp_circle (center -3.792 -10.078) (end -1.642 -10.078) (layer "F.CrtYd") (width 0.05) (fill none) (tstamp cea2caf7-491c-416e-8c77-fdf2fe202236))
  (fp_circle (center -3.792 10.922) (end -1.642 10.922) (layer "F.CrtYd") (width 0.05) (fill none) (tstamp de05c20d-0dce-476b-b868-0ed2774e9ae4))
  (fp_circle (center 0.208 -10.078) (end 2.358 -10.078) (layer "F.CrtYd") (width 0.05) (fill none) (tstamp ff3beda3-ee1c-4cf8-a4e7-540d45f92001))
  (pad "1" thru_hole circle (at -3.792 10.922) (size 3.8 3.8) (drill 2.2) (layers *.Cu *.Mask) (tstamp 2ef65e78-4be0-41c5-803d-14946a973aa6))
  (pad "1" thru_hole circle (at -3.792 -10.078) (size 3.8 3.8) (drill 2.2) (layers *.Cu *.Mask) (tstamp 665c4a85-e2bf-40f0-98fd-7ec4069c44d6))
  (pad "1" thru_hole circle (at 4.208 -10.078) (size 3.8 3.8) (drill 2.2) (layers *.Cu *.Mask) (tstamp 984ec17b-4581-421f-afea-513d52dcc0d9))
  (pad "1" thru_hole circle (at 0.208 -10.078) (size 3.8 3.8) (drill 2.2) (layers *.Cu *.Mask) (tstamp cf9ea7be-1f91-4751-a550-249822e06dc1))
  (pad "1" thru_hole circle (at 4.208 10.922) (size 3.8 3.8) (drill 2.2) (layers *.Cu *.Mask) (tstamp d146e634-5cd0-4319-9baa-f0f144e010d7))
  (pad "1" thru_hole circle (at 0.208 10.922) (size 3.8 3.8) (drill 2.2) (layers *.Cu *.Mask) (tstamp e122ff9e-0569-4639-9fbd-fbb4c9d81f4d))
  (model "${KIPRJMOD}/3D models/Axle_servo_base.step"
    (offset (xyz -0.18 -0.5 -3.5))
    (scale (xyz 1 1 1))
    (rotate (xyz 0 0 0))
  )
)
