(footprint "FXOS8700+FXAS21002" (version 20211014) (generator pcbnew)
  (layer "F.Cu")
  (tedit 62E0244B)
  (attr smd)
  (fp_text reference "REF**" (at 0 -12.7 unlocked) (layer "F.Fab")
    (effects (font (size 1 1) (thickness 0.15)))
    (tstamp 4e66a44f-7fa6-4e16-bf9b-62ec864301a5)
  )
  (fp_text value "FXOS8700+FXAS21002" (at 0 12.7 unlocked) (layer "F.SilkS")
    (effects (font (size 1 1) (thickness 0.15)))
    (tstamp 4412226e-d975-40a2-921f-502ff4129a95)
  )
  (fp_text user "${REFERENCE}" (at 0 15.24 unlocked) (layer "F.SilkS")
    (effects (font (size 1 1) (thickness 0.15)))
    (tstamp 7447a6e7-8205-46ba-afca-d0fa8f90c95a)
  )
  (fp_line (start 13.97 -10.16) (end -13.97 -10.16) (layer "F.SilkS") (width 0.2) (tstamp 570b0686-0fc3-46c1-be51-39569bba54ce))
  (fp_line (start -13.97 -10.16) (end -13.97 10.16) (layer "F.SilkS") (width 0.2) (tstamp 86a6b9b9-3de3-44b4-b763-98233419d240))
  (fp_line (start -13.97 10.16) (end 13.97 10.16) (layer "F.SilkS") (width 0.2) (tstamp e085e529-431d-4fe9-aed9-287036ceabd6))
  (fp_line (start 13.97 10.16) (end 13.97 -10.16) (layer "F.SilkS") (width 0.2) (tstamp f47ba0cc-ecae-4aef-a30d-acee22ce59db))
  (fp_line (start -13.97 10.16) (end -13.97 -10.16) (layer "F.CrtYd") (width 0.12) (tstamp 15ad82f6-dc09-46ea-87e9-03801d5683d0))
  (fp_line (start 13.97 -10.16) (end 13.97 10.16) (layer "F.CrtYd") (width 0.12) (tstamp 389bc177-a9a1-40e5-93f6-04691e70504c))
  (fp_line (start 13.97 10.16) (end -13.97 10.16) (layer "F.CrtYd") (width 0.12) (tstamp 51fcdb9a-fcf0-4331-8999-d17f2a71768a))
  (fp_line (start -13.97 -10.16) (end 13.97 -10.16) (layer "F.CrtYd") (width 0.12) (tstamp f15a0c3a-ffb2-4e08-9a31-9fcb71e1ed70))
  (fp_rect (start -13.95 -10.15) (end 13.95 10.15) (layer "F.CrtYd") (width 0.12) (fill none) (tstamp 65f3307c-3fc4-4a0c-834d-8bed3f2fca56))
  (pad "1" thru_hole circle (at -6.35 7.62) (size 1.7 1.7) (drill 1) (layers *.Cu *.Mask) (tstamp b5cea0b5-192f-476b-a3c8-0c26e2231699))
  (pad "2" thru_hole circle (at -3.81 7.62) (size 1.7 1.7) (drill 1) (layers *.Cu *.Mask) (tstamp 2dc66f7e-d85d-4081-ae71-fd8851d6aeda))
  (pad "3" thru_hole circle (at -1.27 7.62) (size 1.7 1.7) (drill 1) (layers *.Cu *.Mask) (tstamp 7114de55-86d9-46c1-a412-07f5eb895435))
  (pad "4" thru_hole circle (at 1.27 7.62) (size 1.7 1.7) (drill 1) (layers *.Cu *.Mask) (tstamp e29e8d7d-cee8-47d4-8444-1d7032daf03c))
  (pad "5" thru_hole circle (at 3.81 7.62) (size 1.7 1.7) (drill 1) (layers *.Cu *.Mask) (tstamp 80b9a57f-3326-43ca-b6ca-5e911992b3c4))
  (pad "6" thru_hole circle (at 6.35 7.62) (size 1.7 1.7) (drill 1) (layers *.Cu *.Mask) (tstamp 830aee7f-dfce-42cd-85ef-6370f6dc02f5))
  (pad "7" thru_hole circle (at -3.81 -7.62) (size 1.7 1.7) (drill 1) (layers *.Cu *.Mask) (tstamp a8447faf-e0a0-4c4a-ae53-4d4b28669151))
  (pad "8" thru_hole circle (at -1.27 -7.62) (size 1.7 1.7) (drill 1) (layers *.Cu *.Mask) (tstamp b21299b9-3c4d-43df-b399-7f9b08eb5470))
  (pad "9" thru_hole circle (at 1.27 -7.62) (size 1.7 1.7) (drill 1) (layers *.Cu *.Mask) (tstamp ad4d05f5-6957-42f8-b65c-c657b9a26485))
  (pad "10" thru_hole circle (at 3.81 -7.62) (size 1.7 1.7) (drill 1) (layers *.Cu *.Mask) (tstamp 4ce9470f-5633-41bf-89ac-74a810939893))
  (pad "11" thru_hole circle (at -11.43 -7.62) (size 4.24 4.24) (drill 2.54) (layers *.Cu *.Mask) (tstamp 1a734ace-0cd0-489a-9380-915322ff12bd))
  (pad "12" thru_hole circle (at 11.43 -7.649804) (size 4.24 4.24) (drill 2.54) (layers *.Cu *.Mask) (tstamp efd79052-e146-4d61-9e0a-ba764a5a966b))
  (pad "13" thru_hole circle (at 11.43 7.62) (size 4.24 4.24) (drill 2.54) (layers *.Cu *.Mask) (tstamp a8ed9f4d-0385-4ec2-831d-b6c7165c148a))
  (pad "14" thru_hole circle (at -11.43 7.62) (size 4.24 4.24) (drill 2.54) (layers *.Cu *.Mask) (tstamp 9ad54c14-6dd1-4741-ab11-80a0275cae72))
)
